{
   "classeDadosCadastrais": {
      "cnpjClasse": "",
      "evento": "Indicador de cisão total",
      "razaoSocial": "Razao Social Teste 123 Investimento Sustentável",
      "nomeComercial": "Nome Comercial Teste 123",
      "dataConstituicao": "",
      "inicioAtividade": ""
   },
   "classePerfilFIF": {
      "categoriaCvm": "Ações",
      "sufixo": "Ações BDR nível 1",
      "categoriaAnbima": "Ações",
      "tipoAnbima": "Ações Dividendos",
      "composicaoFundo": "FI",
      "tributacaoPerseguida": "Previdenciário",
      "benchmark": "Dólar",
      "creditoPrivado": "Não",
      "investimentosExterior": "Não se aplica",
      "indicadorLimitesPorEmissorAtivo": "Não se Aplica",
      "fundoEsg": "Não",
      "formaCondominio": "Fechado",
      "permiteCriptoativos": "Não",
      "criptoativosMaiorRiscoDaCarteira": "Não se Aplica",
      "prazoDuracao": "Indeterminado"
   },
   "classePerfilFIDC": {
      "categoriaCvm": "FIDC Padronizado",
      "sufixo": "Não se aplica",
      "categoriaAnbima": "FIDC",
      "tipoAnbima": "FIDC Agro Indústria Comércio",
      "tributacaoPerseguida": "Longo Prazo",
      "benchmark": "Dólar",
      "indicadorLimitesPorEmissorAtivo": "Não se Aplica",
      "focoAtuacao": "Fomento Mercantil",
      "permiteCriptoativos": "Não",
      "criptoativosMaiorRiscoDaCarteira": "Não",
      "prazoDuracao": "Indeterminado"
   },
   "classePerfilFII": {
      "categoriaCvm": "FII",
      "sufixo": "Não se aplica",
      "categoriaAnbima": "FII",
      "tipoAnbima": "Tijolo Desenvolvimento Gestão Ativa",
      "composicaoFundo": "FI",
      "tributacaoPerseguida": "Longo Prazo",
      "benchmark": "Dólar",
      "indicadorLimitesPorEmissorAtivo": "Não se Aplica",
      "focoAtuacao": "Outros",
      "permiteCriptoativos": "Não",
      "criptoativosMaiorRiscoDaCarteira": "Não",
      "prazoDuracao": "Indeterminado"
   },
   "classePerfilFIP": {
      "categoriaCvm": "FIP",
      "sufixo": "Não se aplica",
      "categoriaAnbima": "FIP",
      "tipoAnbima": "Fundos de Participações",
      "composicaoFundo": "FI",
      "tributacaoPerseguida": "Longo Prazo",
      "benchmark": "Dólar",
      "creditoPrivado": "Não",
      "investimentosExterior": "Não se aplica",
      "indicadorLimitesPorEmissorAtivo": "Não se Aplica",
      "fundoEsg": "Não",
      "formaCondominio": "Fechado",
      "indicadorFundoInfraestrutura": "Não",
      "permiteCriptoativos": "Não",
      "criptoativosMaiorRiscoDaCarteira": "Não",
      "prazoDuracao": "Indeterminado"
   },
   "classePerfilETF": {
      "categoriaCvm": "ETF(Fundo de Índice)",
      "sufixo": "Não se aplica",
      "categoriaAnbima": "ETF",
      "tipoAnbima": "ETF Renda Fixa",
      "composicaoFundo": "FI",
      "tributacaoPerseguida": "Longo Prazo",
      "benchmark": "Dólar",
      "indicadorLimitesPorEmissorAtivo": "Não se Aplica",
      "fundoEsg": "Não",
      "formaCondominio": "Aberto",
      "permiteCriptoativos": "Não",
      "criptoativosMaiorRiscoDaCarteira": "Não",
      "prazoDuracao": "Indeterminado"
   },
   "classePerfilOffshore": {
      "categoriaCvm": "Offshore",
      "sufixo": "Não se aplica",
      "categoriaAnbima": "Offshore",
      "tipoAnbima": "Offshore Renda Mista",
      "tributacaoPerseguida": "Previdenciário",
      "indicadorLimitesPorEmissorAtivo": "Não se Aplica",
      "fundoEsg": "Não",
      "permiteCriptoativos": "Não",
      "criptoativosMaiorRiscoDaCarteira": "Não",
      "prazoDuracao": "Indeterminado"
   },
   "classePrestadores": [
      { "tipoPrestador": "Custodiante", "cnpjcpf": "80846251000120", "cnpjcpf2": "80.846.251/0001-20" },
      { "tipoPrestador": "Controladoria", "cnpjcpf": "43622369000149", "cnpjcpf2": "43.622.369/0001-49" },
      { "tipoPrestador": "Auditor Independente", "cnpjcpf": "13223116000131", "cnpjcpf2": "13.223.116/0001-31" },
      { "tipoPrestador": "Consultor Especializado", "cnpjcpf": "80846251000120", "cnpjcpf2": "80.846.251/0001-20" }
   ],
   "classePerfilComplementar": {
      "restricaoInvestimento": "Reservado",
      "opcoesDeRestrito": "Familiar",
      "tipoInvestidor": "Geral",
      "fundoAlavancado": "Sim",
      "multiGestor": "Feeder",
      "indicadorAplicacaoAutomatica": "Sim",
      "previdenciario": "Sim",
      "planoPrevidencia": "Não",
      "periodicidadeEnvioPLCota": "Mensal",
      "calculoCota": "Fechamento",
      "abertoCaptacao": "Sim"
   },
   "classeTaxaAdm": {
      "cobraTaxaAdministracao": "Sim",
      "perfilTaxaAdministracao": "Fixa",
      "unidadeTaxaAdministracao": "Valor",
      "valorTaxaAdministracao": "10",
      "valorPisoTaxaAdministracao": "11",
      "valorFixoTaxaAdministracao": "12",
      "informacoesAdicionaisTaxaAdministracao": "13",
      "unidadeTaxaAdministracaoMaxima": "Valor",
      "taxaMaximaAdministracao": "14"
   },
   "classeTaxaGestao": {
      "cobraTaxaGestao": "Sim",
      "perfilTaxaGestao": "Fixa",
      "unidadeTaxaGestao": "Valor",
      "valorTaxaGestao": "10",
      "valorPisoTaxaGestao": "11",
      "valorFixoTaxaGestao": "12",
      "informacoesAdicionaisTaxaGestao": "Teste123",
      "unidadeTaxaMaximaGestao": "Valor",
      "taxaMaximaGestao": "14"
   },
   "classeTaxaCustodia": {
      "cobraTaxaMaximaCustodia": "Sim",
      "perfilTaxaMaximaCustodia": "Fixa",
      "unidadeTaxaMaximaCustodia": "Valor",
      "valorTaxaMaximaCustodia": "10",
      "valorPisoTaxaMaximaCustodia": "11",
      "valorFixoTaxaMaximaCustodia": "12",
      "informacoesAdicionaisCustodia": "Test123"
   },
   "classeTaxaDistribuicao": {
      "cobraTaxaMaximaDistribuicao": "Sim",
      "perfilTaxaMaximaDistribuicao": "Fixa",
      "unidadeTaxaMaximaDistribuicao": "Valor",
      "valorTaxaMaximaDistribuicao": "10",
      "valorPisoTaxaMaximaDistribuicao": "11",
      "valorFixoTaxaMaximaDistribuicao": "12",
      "informacoesAdicionaisDistribuicao": "13"
   },
   "classeTaxaPerformance": {
      "cobraTaxaPerformance": "Sim",
      "perfilTaxaPerformance": "Fixa",
      "periodicidadeTaxaPerformance": "Mensal",
      "informacoesAdicionaisTaxaPerformance": "Teste123",
      "indicesReferenciaTaxaPerfomancePercentual": "10",
      "indicesReferenciaTaxaPerfomanceIndice": "11",
      "indicesReferenciaTaxaPerfomanceIndiceRefencia": "CDI",
      "indicesReferenciaTaxaPerfomanceSpread": "12"
   },
   "classeEntradaSaida": {
      "unidadeTaxaEntrada": "Valor",
      "valorTaxaEntrada": "10",
      "unidadeTaxaSaida": "Valor",
      "valorTaxaSaida": "10"
   },
   "classeTaxaConsultoria": {
      "perfil": "Fixa",
      "unidade": "Valor",
      "valor": "10",
      "valorPiso": "11",
      "valorFixo": "12",
      "informacoesAdicionais": "13",
      "unidadeTaxaMaxima": "Valor",
      "taxaMaxima": "15"
   },
   "classeValoresMovimentacoes": {
      "indicadorPrazoEmissaoCotas": "Dias úteis",
      "prazoEmissaoCotas": "10",
      "indicadorPrazoConversaoResgate": "Dias úteis",
      "prazoConversaoResgate": "11",
      "indicadorPrazoPagamentoResgate": "Dias úteis",
      "prazoPagamentoResgate": "17",
      "regraAdicionalPagamentoResgate": "Sim",
      "descricaoRegraAdicionalResgate": "12",
      "carenciaInicial": "12",
      "carenciaCiclica": "12",
      "indicadorValoresMinimos": "Valor",
      "valorMinimoAplicacaoInicial": "12",
      "valorMinimoAplicacaoSubsequentes": "12",
      "valorMinimoResgate": "12",
      "valorMinimoPermanencia": "12"
   },
   "classePrestadoresComplementares": [
      { "tipoPrestador": "Distribuidor", "cnpjcpf": "80846251000120", "cnpjcpf2": "80.846.251/0001-20" },
      { "tipoPrestador": "Informante Valores Diários", "cnpjcpf": "43622369000149", "cnpjcpf2": "43.622.369/0001-49" }
   ]
}
