{
  "ndk": "C:\\Users\\csilva8\\AppData\\Local\\Android\\Sdk\\ndk\\20.0.5594570",
  "revision": {
    "mMajor": 20,
    "mMinor": 0,
    "mMicro": 5594570,
    "mPreview": 0,
    "mPrecision": "MICRO",
    "mPreviewSeparator": " "
  }
}