-------------------------------------------------------------------------------
Test set: FunctionalTest
-------------------------------------------------------------------------------
Tests run: 21, Failures: 0, Errors: 0, Skipped: 0, Time elapsed: 1.246 sec
