(module TELEDYNECOAX_CCR-39S (layer F.Cu) (tedit 5DF04ED5)
  (fp_text reference REF** (at 0 0.5) (layer F.SilkS)
    (effects (font (size 1 1) (thickness 0.15)))
  )
  (fp_text value TELEDYNECOAX_CCR-39S (at 0 -0.5) (layer F.Fab)
    (effects (font (size 1 1) (thickness 0.15)))
  )
  (fp_circle (center 0 0) (end 12.7 0) (layer F.CrtYd) (width 0.12))
  (pad 1 thru_hole roundrect (at 0 9.4615) (size 1.905 3.937) (drill oval 1.143 3.175) (layers *.Cu *.Mask) (roundrect_rratio 0.24))
  (pad 2 thru_hole roundrect (at 4.105191 8.524517 25.71428571) (size 1.905 3.937) (drill oval 1.143 3.175) (layers *.Cu *.Mask) (roundrect_rratio 0.24))
  (pad 3 thru_hole roundrect (at 7.397299 5.899149 51.42857143) (size 1.905 3.937) (drill oval 1.143 3.175) (layers *.Cu *.Mask) (roundrect_rratio 0.24))
  (pad 4 thru_hole roundrect (at 9.22428 2.105382 77.14285714) (size 1.905 3.937) (drill oval 1.143 3.175) (layers *.Cu *.Mask) (roundrect_rratio 0.24))
  (pad 5 thru_hole roundrect (at 9.22428 -2.105382 102.8571429) (size 1.905 3.937) (drill oval 1.143 3.175) (layers *.Cu *.Mask) (roundrect_rratio 0.24))
  (pad 6 thru_hole roundrect (at 7.397299 -5.899149 128.5714286) (size 1.905 3.937) (drill oval 1.143 3.175) (layers *.Cu *.Mask) (roundrect_rratio 0.24))
  (pad 7 thru_hole roundrect (at 4.105191 -8.524517 154.2857143) (size 1.905 3.937) (drill oval 1.143 3.175) (layers *.Cu *.Mask) (roundrect_rratio 0.24))
  (pad 8 thru_hole roundrect (at 0 -9.4615 180) (size 1.905 3.937) (drill oval 1.143 3.175) (layers *.Cu *.Mask) (roundrect_rratio 0.24))
  (pad 9 thru_hole roundrect (at -4.105191 -8.524517 205.7142857) (size 1.905 3.937) (drill oval 1.143 3.175) (layers *.Cu *.Mask) (roundrect_rratio 0.24))
  (pad 10 thru_hole roundrect (at -7.397299 -5.899149 231.4285714) (size 1.905 3.937) (drill oval 1.143 3.175) (layers *.Cu *.Mask) (roundrect_rratio 0.24))
  (pad 11 thru_hole roundrect (at -9.22428 -2.105382 257.1428571) (size 1.905 3.937) (drill oval 1.143 3.175) (layers *.Cu *.Mask) (roundrect_rratio 0.24))
  (pad 12 thru_hole roundrect (at -9.22428 2.105382 282.8571429) (size 1.905 3.937) (drill oval 1.143 3.175) (layers *.Cu *.Mask) (roundrect_rratio 0.24))
  (pad 13 thru_hole roundrect (at -7.397299 5.899149 308.5714286) (size 1.905 3.937) (drill oval 1.143 3.175) (layers *.Cu *.Mask) (roundrect_rratio 0.24))
  (pad 14 thru_hole roundrect (at -4.105191 8.524517 334.2857143) (size 1.905 3.937) (drill oval 1.143 3.175) (layers *.Cu *.Mask) (roundrect_rratio 0.24))
)
