C:\keycloak\keycloak-master\examples\providers\user-storage-simple\src\main\java\org\keycloak\examples\userstorage\writeable\PropertyFileUserStorageProvider.java
C:\keycloak\keycloak-master\examples\providers\user-storage-simple\src\main\java\org\keycloak\examples\userstorage\writeable\PropertyFileUserStorageProviderFactory.java
C:\keycloak\keycloak-master\examples\providers\user-storage-simple\src\main\java\org\keycloak\examples\userstorage\readonly\PropertyFileUserStorageProvider.java
C:\keycloak\keycloak-master\examples\providers\user-storage-simple\src\main\java\org\keycloak\examples\userstorage\readonly\PropertyFileUserStorageProviderFactory.java
