C:\keycloak\keycloak-master\examples\demo-template\third-party-cdi\src\main\java\org\keycloak\example\oauth\MessagesChecker.java
C:\keycloak\keycloak-master\examples\demo-template\third-party-cdi\src\main\java\org\keycloak\example\oauth\DatabaseClient.java
C:\keycloak\keycloak-master\examples\demo-template\third-party-cdi\src\main\java\org\keycloak\example\oauth\ServletRequestQualifier.java
C:\keycloak\keycloak-master\examples\demo-template\third-party-cdi\src\main\java\org\keycloak\example\oauth\CDIResourcesProducer.java
C:\keycloak\keycloak-master\examples\demo-template\third-party-cdi\src\main\java\org\keycloak\example\oauth\AppContextListener.java
C:\keycloak\keycloak-master\examples\demo-template\third-party-cdi\src\main\java\org\keycloak\example\oauth\UserData.java
C:\keycloak\keycloak-master\examples\demo-template\third-party-cdi\src\main\java\org\keycloak\example\oauth\RefreshTokenFilter.java
