org\keycloak\examples\userstorage\readonly\PropertyFileUserStorageProvider.class
org\keycloak\examples\userstorage\writeable\PropertyFileUserStorageProvider.class
org\keycloak\examples\userstorage\readonly\PropertyFileUserStorageProviderFactory.class
org\keycloak\examples\userstorage\writeable\PropertyFileUserStorageProvider$1.class
org\keycloak\examples\userstorage\writeable\PropertyFileUserStorageProviderFactory.class
org\keycloak\examples\userstorage\readonly\PropertyFileUserStorageProvider$1.class
