﻿rows,Not at all,Strongly disagree,Disagree,Agree,Strongly agree,Absolutely
row 1,396,430,482,583,720,400
row 2,169,73,299,836,309,824
row 3,435,188,435,601,619,615
row 4,2,543,165,252,994,787
row 5,970,396,14,540,794,391
row 6,616,115,792,947,735,441
row 7,339,389,294,557,494,278
row 8,378,203,319,842,314,105
row 9,789,686,487,54,396,456
row 10,81,176,536,392,91,943
row 11,201,402,524,730,965,519
