// Jest Snapshot v1, https://goo.gl/fbAQLP

exports[`Set Contacts Action Matches Snapshot 1`] = `
Array [
  Object {
    "payload": Array [
      Object {
        "address": "",
        "handle": "root",
        "icon": "root.png",
        "name": "Tetratic",
      },
    ],
    "type": "set_contacts",
  },
]
`;

exports[`Set Specific Contact Action Matches Snapshot 1`] = `
Array [
  Object {
    "payload": Object {
      "address": "0x4744b435",
      "handler": "Pepito",
      "name": "Pepito",
    },
    "type": "set_contact",
  },
]
`;
