// Jest Snapshot v1, https://goo.gl/fbAQLP

exports[`Set User Action Matches Snapshot 1`] = `
Array [
  Object {
    "payload": Object {
      "user": Object {
        "did": "0xff81B0492c38dF200e01838B0c01BEc4CDa904C4",
        "expoToken": "ExponentPushToken[NvBmMwOYVZ55FjnbBqk_Q_]",
        "handler": "Alberto",
        "name": "Alberto",
        "nonce": 1,
        "password": "1234",
        "privateKey": "0x4744b435f197517c34e14170397d4cbc6819ee5a6770954d930c0b38aff0e369",
      },
    },
    "type": "set_user",
  },
  Object {
    "payload": Object {
      "user": Object {
        "did": "0xff81B0492c38dF200e01838B0c01BEc4CDa904C4",
        "expoToken": "ExponentPushToken[NvBmMwOYVZ55FjnbBqk_Q_]",
        "handler": "Alberto",
        "name": "Alberto",
        "nonce": 1,
        "password": "1234",
        "privateKey": "0x4744b435f197517c34e14170397d4cbc6819ee5a6770954d930c0b38aff0e369",
      },
    },
    "type": "set_user",
  },
]
`;
