@startuml verifier-subject-flow

' Verifier requests credential from Subject
activate verifier
verifier -> verifier : prepare credential request
verifier -> subject ++ : present QR for subject to scan
subject -> subject : approve credential send
subject -> blockchain ++ : look up verifier DID
return verifier public key
subject -> subject : encrypt VC with verifier public key
return verified credential (VC)
verifier -> verifier : decrypt VC with verifier private key
verifier -> blockchain ++ : look up issuer DID
return issuer public key
verifier -> verifier : validate signatures
deactivate verifier

@enduml