{
  "page_count": 1,
  "page_number": 1,
  "page_size": 30,
  "total_records": 4,
  "meetings": [
    {
      "uuid": "mlghmfghlBBB",
      "id": 11111,
      "host_id": "abckjdfhsdkjf",
      "topic": "Zoom Meeting",
      "type": 2,
      "start_time": "2019-08-16T02:00:00Z",
      "duration": 30,
      "timezone": "America/Los_Angeles",
      "created_at": "2019-08-16T01:13:12Z",
      "join_url": "https://zoom.us/j/11111"
    },
    {
      "uuid": "J8H8eavweUcd321==",
      "id": 2222,
      "host_id": "abckjdfhsdkjf",
      "topic": "TestMeeting",
      "type": 2,
      "start_time": "2019-08-16T19:00:00Z",
      "duration": 60,
      "timezone": "America/Los_Angeles",
      "agenda": "RegistrationDeniedTest",
      "created_at": "2019-08-16T18:30:46Z",
      "join_url": "https://zoom.us/j/2222"
    },
    {
      "uuid": "SGVTAcfSfCbbbb",
      "id": 33333,
      "host_id": "abckjdfhsdkjf",
      "topic": "My Meeting",
      "type": 2,
      "start_time": "2019-08-16T22:00:00Z",
      "duration": 60,
      "timezone": "America/Los_Angeles",
      "created_at": "2019-08-16T21:15:56Z",
      "join_url": "https://zoom.us/j/33333"
    },
    {
      "uuid": "64123avdfsMVA==",
      "id": 44444,
      "host_id": "abckjdfhsdkjf",
      "topic": "MyTestPollMeeting",
      "type": 2,
      "start_time": "2019-08-29T18:00:00Z",
      "duration": 60,
      "timezone": "America/Los_Angeles",
      "created_at": "2019-08-29T17:32:33Z",
      "join_url": "https://zoom.us/j/4444"
    }
  ]
}