{
  "event": "meeting.created",
  "event_ts": 1626230691572,
  "payload": {
    "account_id": "AAAAAABBBB",
    "operator": "admin@example.com",
    "operator_id": "z8yCxjabcdEFGHfp8uQ",
    "operation": "single",
    "object": {
      "uuid": "4444AAAiAAAAAiAiAiiAii==",
      "id": 1234567890,
      "host_id": "x1yCzABCDEfg23HiJKl4mN",
      "topic": "My Meeting",
      "type": 8,
      "start_time": "2021-07-13T21:44:51Z",
      "duration": 60,
      "timezone": "America/Los_Angeles",
      "join_url": "https://example.com",
      "password": "XYz@BC!D1087",
      "pmi": "ABc$DE@F234",
      "occurrences": [
        {
          "occurrence_id": "ABCDE12345",
          "start_time": "2021-07-13T21:44:51Z",
          "duration": 60,
          "status": "available"
        }
      ],
      "settings": {
        "use_pmi": true,
        "alternative_hosts": "althost1@example.com;althost2@example.com"
      }
    }
  }
}