Place,Name,Sex,Event,Division,WeightClassKg,Equipment,BirthYear,Team,State,BodyweightKg,Squat1Kg,Squat2Kg,Squat3Kg,Best3SquatKg,Bench1Kg,Bench2Kg,Bench3Kg,Best3BenchKg,Deadlift1Kg,Deadlift2Kg,Deadlift3Kg,Best3DeadliftKg,TotalKg,Age,BirthDate
1,Ava Biemer,F,SBD,FR-C,47,Raw,2002,The Ohio State University,NY,45.6,57.5,62.5,-67.5,62.5,35,-40,-40,35,85,90,-95,90,187.5,,
1,Caitlin Berry #1,F,SBD,FR-C,57,Raw,2002,Midland University,TX,56.35,132.5,-137.5,-137.5,132.5,115,-120,-120,115,147.5,160,-175,160,407.5,,
2,Elaine Chen,F,SBD,FR-C,57,Raw,1996,The Ohio State University,OH,55.6,117.5,125,130,130,70,75,77.5,77.5,162.5,170,-177.5,170,377.5,,
3,Jenna Wassel,F,SBD,FR-C,57,Raw,2001,The Ohio State University,OH,56.7,80,85,-90,85,50,55,-57.5,55,102.5,-110,110,110,250,,
1,Luisa Cruz,F,SBD,FR-C,63,Raw,2000,Midland University,TX,60.6,-135,140,147.5,147.5,70,-82.5,,70,175,185,-195,185,402.5,,
2,Katelyn Dundas,F,SBD,FR-C,63,Raw,1999,Midland University,NC,62.15,132.5,-137.5,142.5,142.5,65,67.5,-70,67.5,137.5,147.5,152.5,152.5,362.5,,
3,Angela Gugliotta,F,SBD,FR-C,63,Raw,2002,The Ohio State University,OH,62.25,97.5,105,112.5,112.5,65,70,-75,70,120,127.5,137.5,137.5,320,,
1,Catherine Widay,F,SBD,FR-C,69,Raw,2000,The Ohio State University,OH,68.6,135,142.5,-150,142.5,77.5,82.5,85,85,172.5,182.5,192.5,192.5,420,,
2,Mary Trabue,F,SBD,FR-C,69,Raw,1999,The Ohio State University,OH,68,127.5,137.5,142.5,142.5,80,85,90,90,147.5,157.5,165,165,397.5,,
3,Loryn Wright,F,SBD,FR-C,69,Raw,2001,The Ohio State University,OH,67.3,135,142.5,145,145,70,75,77.5,77.5,150,162.5,170,170,392.5,,
4,Ally Carraway,F,SBD,FR-C,69,Raw,2001,Midland University,TX,68.1,140,147.5,-150,147.5,75,80,-85,80,145,157.5,165,165,392.5,,
1,Maria Dailey,F,SBD,FR-C,76,Raw,2002,Midland University,WA,73.65,170,180,187.5,187.5,92.5,100,105,105,200,215,232.5,232.5,525,,
2,Jaileigh Sorgenfrei,F,SBD,FR-C,76,Raw,2002,Midland University,NE,74.45,125,132.5,142.5,142.5,62.5,67.5,-70,67.5,152.5,162.5,167.5,167.5,377.5,,
3,Jordan Raudins,F,SBD,FR-C,76,Raw,2002,The Ohio State University,OH,74.35,105,112.5,117.5,117.5,52.5,55,57.5,57.5,132.5,140,142.5,142.5,317.5,,
4,Melanie Steinberger,F,SBD,FR-C,76,Raw,2001,The Ohio State University,OH,72.9,107.5,115,122.5,122.5,57.5,62.5,65,65,115,127.5,-137.5,127.5,315,,
1,Morgan Gilliam,F,SBD,FR-C,84,Raw,2000,Midland University,MI,83.55,147.5,155,-162.5,155,77.5,82.5,-85,82.5,145,155,-160,155,392.5,,
1,Alexis Jones #1,F,SBD,FR-C,84+,Raw,2000,Midland University,FL,138.65,225,232.5,240,240,145,152.5,-157.5,152.5,205,227.5,232.5,232.5,625,,
2,Makenna Henderson,F,SBD,FR-C,84+,Raw,2000,Midland University,TX,96.95,197.5,205,-225,205,102.5,110,-122.5,110,157.5,170,-175,170,485,,
3,Morgan Rich,F,SBD,FR-C,84+,Raw,2001,The Ohio State University,OH,86.5,152.5,162.5,172.5,172.5,65,70,75,75,137.5,147.5,155,155,402.5,,
4,Emma Hampton,F,SBD,FR-C,84+,Raw,2002,Midland University,MO,119.6,152.5,160,167.5,167.5,65,70,-75,70,145,155,162.5,162.5,400,,
1,Aidan Cusack,M,SBD,MR-C,53,Raw,2001,Midland University,TX,52.05,145,150,-155,150,90,95,-97.5,95,170,180,185,185,430,,
1,Ahmed Alfaysale,M,SBD,MR-C,59,Raw,2000,The Ohio State University,OH,58.75,132.5,145,155,155,105,115,120,120,165,-190,190,190,465,,
2,Nicholas Rockey,M,SBD,MR-C,59,Raw,2002,The Ohio State University,OH,58.05,122.5,130,-137.5,130,65,70,-75,70,152.5,162.5,172.5,172.5,372.5,,
1,CJ Shuford,M,SBD,MR-C,66,Raw,2002,Midland University,LA,65,232.5,-240,-240,232.5,130,140,-145,140,235,245,257.5,257.5,630,,
1,Tony Nguyen,M,SBD,MR-C,74,Raw,2001,Midland University,PA,72.75,225,235,-240,235,127.5,135,140,140,250,-270,-270,250,625,,
2,Matthew Flanagan,M,SBD,MR-C,74,Raw,2002,The Ohio State University,OH,72.95,185,200,205,205,102.5,112.5,117.5,117.5,227.5,240,-245,240,562.5,,
3,Ethan Hampton,M,SBD,MR-C,74,Raw,2000,The Ohio State University,KY,73.7,175,182.5,192.5,192.5,120,130,-137.5,130,180,-190,190,190,512.5,,
4,Mitchell McCune,M,SBD,MR-C,74,Raw,2000,The Ohio State University,OH,72.7,150,157.5,162.5,162.5,75,85,-92.5,85,172.5,182.5,192.5,192.5,440,,
DQ,Marcus Muise,M,SBD,MR-C,74,Raw,2001,The Ohio State University,OH,72.45,180,190,197.5,197.5,102.5,112.5,117.5,117.5,-230,-247.5,-247.5,,,,
1,Seth Dasuki,M,SBD,MR-C,83,Raw,2002,Midland University,MN,82,242.5,255,265,265,145,152.5,155,155,295,310,325,325,745,,
2,Jackson Jaeger,M,SBD,MR-C,83,Raw,2001,Midland University,WI,80.25,220,230,237.5,237.5,130,137.5,147.5,147.5,260,-272.5,280,280,665,,
3,David Ryu,M,SBD,MR-C,83,Raw,2002,The Ohio State University,OH,82.4,215,225,235,235,122.5,130,132.5,132.5,227.5,242.5,-257.5,242.5,610,,
4,Demetrius Smith,M,SBD,MR-C,83,Raw,2003,The Ohio State University,PA,82.95,207.5,220,225,225,137.5,147.5,-152.5,147.5,222.5,-240,-252.5,222.5,595,,
5,Spencer Smith,M,SBD,MR-C,83,Raw,2003,The Ohio State University,OH,79,160,167.5,175,175,100,107.5,112.5,112.5,167.5,177.5,185,185,472.5,,
6,Allan Thomas II,M,SBD,MR-C,83,Raw,2000,The Ohio State University,OH,78,137.5,142.5,155,155,110,117.5,-125,117.5,-182.5,182.5,-197.5,182.5,455,,
1,Quinton Briggs,M,SBD,MR-C,93,Raw,2000,Midland University,UT,92.2,250,260,-270,260,145,152.5,-160,152.5,277.5,302.5,-317.5,302.5,715,,
2,Bryce Polito,M,SBD,MR-C,93,Raw,2000,The Ohio State University,OH,91.25,205,215,-225,215,167.5,177.5,-182.5,177.5,220,232.5,245,245,637.5,,
3,Adit Baruah,M,SBD,MR-C,93,Raw,1999,The Ohio State University,OH,89.2,157.5,167.5,177.5,177.5,105,112.5,117.5,117.5,175,187.5,-195,187.5,482.5,,
1,Carter Welch,M,SBD,MR-C,105,Raw,2000,Midland University,WI,101.35,272.5,282.5,287.5,287.5,175,-185,-185,175,300,310,-330,310,772.5,,
2,Brady Fishpaw,M,SBD,MR-C,105,Raw,2002,The Ohio State University,OH,104.45,247.5,260,267.5,267.5,140,147.5,155,155,247.5,260,270,270,692.5,,
3,Tyrek Mitchell,M,SBD,MR-C,105,Raw,2000,The Ohio State University,OH,102.8,220,230,-240,230,175,185,190,190,225,242.5,-265,242.5,662.5,,
1,Jadon Bartman,M,SBD,MR-C,120,Raw,2001,The Ohio State University,OH,118.9,230,240,250,250,150,160,170,170,232.5,245,-257.5,245,665,,
2,David Lampman,M,SBD,MR-C,120,Raw,2002,The Ohio State University,OH,117.3,212.5,222.5,232.5,232.5,115,120,125,125,227.5,240,255,255,612.5,,
3,Alec Osborn,M,SBD,MR-C,120,Raw,1999,The Ohio State University,OH,116.95,207.5,217.5,227.5,227.5,90,97.5,105,105,195,205,-217.5,205,537.5,,
1,Kevin Vuong,M,SBD,MR-C,120+,Raw,2001,Midland University,NE,130.15,275,290,305,305,160,167.5,172.5,172.5,235,250,-260,250,727.5,,
2,George Sdregas,M,SBD,MR-C,120+,Raw,2001,The Ohio State University,OH,158.5,200,210,220,220,150,160,170,170,210,222.5,232.5,232.5,622.5,,
