Place,Name,Sex,BirthDate,Age,Country,State,Equipment,Division,BodyweightKg,WeightClassKg,Squat1Kg,Squat2Kg,Squat3Kg,Best3SquatKg,Bench1Kg,Bench2Kg,Bench3Kg,Best3BenchKg,Deadlift1Kg,Deadlift2Kg,Deadlift3Kg,Best3DeadliftKg,TotalKg,Event
1,Zeba Kamin,F,1984-04-11,37,USA,CA,Raw,Open,65.6,56+,105,112.5,-117.5,112.5,47.5,-50,-50,47.5,132.5,140,147.5,147.5,307.5,SBD
1,Jennifer Mecham,F,1981-10-16,40,USA,CA,Wraps,Open,72.7,56+,130,145,-155,145,52.5,,,52.5,130,145,-152.5,145,342.5,SBD
1,Stacey Rohrer,F,1971-12-10,49,USA,CA,Raw,Open,77.6,56+,102.5,107.5,112.5,112.5,75,-80,-80,75,160,170,,170,357.5,SBD
1,Sierra Gallegos,F,2009-07-08,12,USA,CA,Raw,Open,47.3,56,62.5,67.5,70,70,40,-42.5,-42.5,40,100,110,-115,110,220,SBD
1,Katia Rios,F,1998-04-18,23,USA,CA,Raw,Open,56,56,135,145,152.5,152.5,70,75,-80,75,142.5,152.5,-162.5,152.5,380,SBD
2,Amaya Batiza,F,1995-04-30,26,USA,OH,Raw,Open,54.8,56,97.5,102.5,105,105,62.5,-65,-65,62.5,137.5,-145,-145,137.5,305,SBD
3,Chloe Ormerod,F,2002-03-11,19,USA,CA,Raw,Open,55.2,56,80,-85,-85,80,52.5,-57.5,-57.5,52.5,80,85,-87.5,85,217.5,SBD
1,Hunter Henderson #1,F,1994-11-17,27,USA,MO,Raw,Pro,81.5,82.5,-225,240,-247.5,240,132.5,137.5,140,140,225,240,245,245,625,SBD
1,Pablo Hernandez Jr,M,,30,USA,CA,Wraps,Open,107.4,100+,240,252.5,-265,252.5,177.5,187.5,-195,187.5,240,255,272.5,272.5,712.5,SBD
2,Jared Greenstein,M,1991-07-23,30,USA,CA,Raw,Open,108.6,100+,230,247.5,-252.5,247.5,165,-175,-175,165,257.5,277.5,-290,277.5,690,SBD
3,Curtis Atkinson,M,1979-06-30,42,USA,CA,Wraps,Open,108.1,100+,-215,230,-240,230,150,160,,160,260,275,-280,275,665,SBD
4,Steve Farias,M,1987-06-02,34,USA,CA,Wraps,Open,107.6,100+,230,242.5,-250,242.5,150,-162.5,-162.5,150,240,255,-275,255,647.5,SBD
5,Adam Silva,M,2000-12-21,20,USA,CA,Raw,Open,107,100+,197.5,215,-237.5,215,130,140,145,145,212.5,227.5,237.5,237.5,597.5,SBD
1,Codie Rynearson,M,,28,USA,CA,Wraps,Open,125,100+,305,320,327.5,327.5,175,185,-195,185,310,-322.5,327.5,327.5,840,SBD
2,Davy Capriles,M,1999-03-17,22,USA,CA,Wraps,Open,115.6,100+,265,-280,280,280,205,217.5,-227.5,217.5,250,265,275,275,772.5,SBD
3,Eduardo Castaneda,M,1996-11-09,25,USA,CA,Wraps,Open,123.9,100+,265,282.5,-292.5,282.5,142.5,150,155,155,265,280,285,285,722.5,SBD
4,Kevin Howie,M,1989-05-28,32,USA,TX,Raw,Open,115.6,100+,205,215,227.5,227.5,137.5,142.5,-150,142.5,242.5,257.5,-272.5,257.5,627.5,SBD
5,Jean-Luc Theriault,M,1992-11-11,29,USA,CA,Raw,Open,112.8,100+,210,215,225,225,115,-120,-120,115,215,222.5,230,230,570,SBD
1,Brad Abbott,M,1989-04-14,32,USA,IN,Wraps,Open,132.3,100+,305,327.5,342.5,342.5,222.5,230,-237.5,230,320,-340,-340,320,892.5,SBD
1,Paul Yonnotti,M,1990-12-30,30,USA,OH,Raw,Open,89.4,100,245,257.5,-262.5,257.5,180,185,-187.5,185,242.5,255,267.5,267.5,710,SBD
2,Dima Rumanov,M,1995-02-02,26,USA,CA,Raw,Open,87.7,100,-175,175,182.5,182.5,155,162.5,170,170,260,272.5,287.5,287.5,640,SBD
3,Daniel Ponte,M,1994-01-16,27,USA,CA,Wraps,Open,84.1,100,190,-195,197.5,197.5,145,150,-152.5,150,232.5,240,247.5,247.5,595,SBD
4,Delsin Mitaro,M,1999-11-13,22,USA,CA,Raw,Open,87.6,100,-165,165,182.5,182.5,100,107.5,-115,107.5,200,215,227.5,227.5,517.5,SBD
5,Jacob Bushard,M,,21,USA,CA,Raw,Open,87.2,100,110,115,122.5,122.5,80,87.5,-92.5,87.5,115,127.5,137.5,137.5,347.5,SBD
1,Cristian Arana,M,1998-05-25,23,USA,CA,Wraps,Open,99.2,100,300,315,-322.5,315,155,-165,165,165,305,320,-327.5,320,800,SBD
2,Manul Mosley,M,2000-03-11,21,USA,CA,Raw,Open,99.7,100,-195,195,215,215,137.5,-145,-145,137.5,220,235,-245,235,587.5,SBD
1,Chris Garcia #1,M,,34,USA,CA,Wraps,Pro,89.1,90,-320,345,357.5,357.5,185,197.5,-205,197.5,295,-325,325,325,880,SBD
2,Anthony Hobaica,M,1987-01-07,34,USA,NV,Wraps,Pro,89,90,315,-340,-350,315,205,217.5,222.5,222.5,300,-320,-320,300,837.5,SBD
1,Dan Green,M,1982-12-01,39,USA,CA,Raw,Pro,99.9,100,325,345,365,365,180,190,-200,190,355,-385,-385,355,910,SBD
