Place,Name,Sex,BirthDate,Age,Country,Equipment,Division,BodyweightKg,WeightClassKg,Squat1Kg,Squat2Kg,Squat3Kg,Squat4Kg,Best3SquatKg,Bench1Kg,Bench2Kg,Bench3Kg,Bench4Kg,Best3BenchKg,Deadlift1Kg,Deadlift2Kg,Deadlift3Kg,Deadlift4Kg,Best3DeadliftKg,TotalKg,Event
1,Anni Kemppinen,F,1999-06-25,22,,Raw,F_JR_WPC,64.4,67.5,90,100,110,,110,40,50,-55,,50,105,115,122.5,,122.5,282.5,SBD
NS,Mari Viljanen,F,1990-01-01,32,,Raw,F_OR_WPC,,,,,,,,,,,,,,,,,,,SBD
1,Eevi Salonen,F,,,,Raw,F_TR_1_WPC,48,48,45,50,55,,55,27.5,30,32.5,,32.5,70,75,80,,80,167.5,SBD
1,Viola Pukkila,F,2005-04-29,16,,Raw,F_TR_2_WPC,64.9,67.5,90,100,110,115,110,50,55,57.5,60,57.5,100,110,120,-125,120,287.5,SBD
1,Elisa Koikkalainen,F,1999-07-15,22,,Wraps,F_JCR_WPC,56.8,60,110,115,120,,120,60,70,75,-80,75,145,155,165,-170,165,360,SBD
1,Päivi Kaarto,F,1977-01-08,45,,Raw,F_MCR_2_WPC,98.6,100,185,200,210,,210,117.5,125,130,,130,220,235,242.5,,242.5,582.5,SBD
NS,Leesa Ståstedt,F,1968-06-24,53,,Wraps,F_MCR_3_WPC,,,,,,,,,,,,,,,,,,,SBD
1,Nina Kiuru,F,1967-05-29,54,,Wraps,F_MCR_3_WPC,44.9,48,90,-102.5,102.5,110,102.5,50,55,57.5,-60,57.5,90,100,107.5,-110,107.5,267.5,SBD
1,Tiina Puolakka,F,1968-02-19,54,,Wraps,F_MCR_3_WPC,74.4,75,90,95,100,,100,45,50,55,,55,120,130,137.5,,137.5,292.5,SBD
1,Maiju Hilander,F,,64,,Wraps,F_MCR_5_WPC,71.9,75,95,-105,105,,105,50,55,-57.5,,55,140,150,-155,,150,310,SBD
1,Nina Kiuru,F,1967-05-29,54,,Wraps,F_OCR_WPC,44.9,48,90,-102.5,102.5,110,102.5,50,55,57.5,-60,57.5,90,100,107.5,-110,107.5,267.5,SBD
1,Krista Pellikka,F,1987-06-29,34,,Raw,F_OCR_WPC,74.8,75,160,170,-180,,170,112.5,120,-122.5,,120,175,185,-190,,185,475,SBD
1,Päivi Kaarto,F,1977-01-08,45,,Raw,F_OCR_WPC,98.6,100,185,200,210,,210,117.5,125,130,,130,220,235,242.5,,242.5,582.5,SBD
1,Ada Kousa,F,2007-03-26,15,,Wraps,F_TCR_1_WPC,65.6,67.5,70,80,85,,85,30,32.5,35,,35,80,85,90,,90,210,SBD
G,Samantha Panziera,F,1989-05-24,,USA,Multi-ply,F_OEM_WPC,67.3,67.5,,,,,,-192.5,202.5,-210,,202.5,,,,,,202.5,B
G,Samantha Panziera,F,1989-05-24,,USA,Multi-ply,F_OEM_WPC,67.3,67.5,,,,,,,,,,,192.5,202.5,207.5,,207.5,207.5,D
1,Rene Makarenko,M,1999-05-28,22,,Raw,M_JR_WPC,80.4,82.5,-225,-225,225,,225,130,140,142.5,,142.5,250,270,275,,275,642.5,SBD
1,Oskari Simonen,M,1998-06-13,23,,Raw,M_JR_WPC,97.5,100,210,230,250,,250,130,150,-155,,150,300,310,-320.5,,310,710,SBD
2,Oskari Siirila,M,1999-04-20,22,,Raw,M_JR_WPC,99.5,100,240,247.5,255,260,255,150,157.5,-160,,157.5,270,285,-300,,285,697.5,SBD
1,Timo Saarela,M,1979-04-18,42,,Raw,M_MR_1_WPC,79.9,82.5,140,150,155,,155,110,-120.5,-120.5,,110,200,210,-220,,210,475,SBD
1,Antti Tietäväinen,M,1977-11-10,44,,Raw,M_MR_1_WPC,89.5,90,180,-190,190,,190,140,-147.5,147.5,,147.5,200,210,,,210,547.5,SBD
1,Harri Korhonen,M,1979-01-04,43,,Raw,M_MR_1_WPC,98.9,100,170,-180,180,,180,135,145,-150,,145,220,240,-250,,240,565,SBD
DQ,Jyrki Varvas,M,1979-06-28,42,,Raw,M_MR_1_WPC,107.9,110,260,280,-300.5,,280,,,,,,,,,,,,SBD
1,Jarno Ojala,M,1977-04-12,44,,Raw,M_MR_1_WPC,126.3,140,235,-245,245,,245,130,145,155,,155,235,255,-260,,255,655,SBD
1,Rami Eerikäinen,M,1973-11-28,48,,Raw,M_MR_2_WPC,104,110,180,-200,-200,,180,140,150,160,,160,210,230,240,,240,580,SBD
2,Klaus Renfors,M,1973-01-16,49,,Raw,M_MR_2_WPC,101,110,172.5,190,192.5,,192.5,155,165,-170,,165,190,210,217.5,,217.5,575,SBD
1,Janne Murto,M,1968-03-02,54,,Raw,M_MR_3_WPC,99.7,100,130,145,155.5,,155.5,135,140.5,-145,,140.5,170,185,,,185,481,SBD
1,Billy Haavisto,M,1965-08-06,56,,Raw,M_MR_4_WPC,108.6,110,-200,200,-227.5,,200,120,,,,120,150,,,,150,470,SBD
1,Arto Selkee,M,1960-12-02,61,,Raw,M_MR_5_WPC,66.8,67.5,95,102.5,107.5,,107.5,57.5,62.5,65,,65,165,175,182.5,,182.5,355,SBD
1,Narinen Samuli,M,1995-09-05,26,,Raw,M_OR_WPC,74.4,75,-180,185,-192.5,,185,140,145,-150,,145,-230,230,-240,,230,560,SBD
1,Rene Makarenko,M,1999-05-28,22,,Raw,M_OR_WPC,80.4,82.5,-225,-225,225,,225,130,140,142.5,,142.5,250,270,275,,275,642.5,SBD
2,Timo Saarela,M,1979-04-18,42,,Raw,M_OR_WPC,79.9,82.5,140,150,155,,155,110,-120.5,-120.5,,110,200,210,-220,,210,475,SBD
1,Juho Pakkanen,M,1995-03-31,27,,Raw,M_OR_WPC,87.1,90,170,-180,185,,185,100,-115,-120,,100,190,205,-215,,205,490,SBD
1,Oskari Simonen,M,1998-06-13,23,,Raw,M_OR_WPC,97.5,100,210,230,250,,250,130,150,-155,,150,300,310,-320.5,,310,710,SBD
2,Aleksi Hiissa,M,1993-11-17,28,,Raw,M_OR_WPC,98.9,100,210,225,-230,,225,130,145,-155,,145,250,262.5,-270,,262.5,632.5,SBD
1,Tatu Kuusinen,M,1987-05-24,34,,Raw,M_OR_WPC,105.8,110,265,275,290,,290,170,180,-190,,180,280,-300,,,280,750,SBD
2,Rami Eerikäinen,M,1973-11-28,48,,Raw,M_OR_WPC,104,110,180,-200,-200,,180,140,150,160,,160,210,230,240,,240,580,SBD
3,Billy Haavisto,M,1965-08-06,56,,Raw,M_OR_WPC,108.6,110,-200,200,-227.5,,200,120,,,,120,150,,,,150,470,SBD
DQ,Jyrki Varvas,M,1979-06-28,42,,Raw,M_OR_WPC,107.9,110,260,280,-300.5,,280,,,,,,,,,,,,SBD
1,Janne Peltoniemi,M,1983-11-03,38,,Raw,M_OR_WPC,129.5,140,170,200,232.5,,232.5,150,175,180,,180,237.5,250,262.5,,262.5,675,SBD
1,Eero Mitronen,M,2005-03-13,17,,Raw,M_TR_2_WPC,82.4,82.5,135,145,160,,160,95,105,110,,110,175,185,-190,,185,455,SBD
1,Jere Virtanen,M,2003-12-06,18,,Raw,M_TR_3_WPC,93.5,100,160,-170,,,160,95,-105,,,95,100,,,,100,355,SBD
1,Nico Viljakainen,M,2003-05-02,18,,Raw,M_TR_3_WPC,108,110,160,170,-180,,170,120,127.5,-132.5,,127.5,100,,,,100,397.5,SBD
1,Ville Saranpää,M,1999-03-01,23,,Wraps,M_JCR_WPC,87.8,90,180,190,200,,200,110,115,122.5,,122.5,190,210,-217.5,,210,532.5,SBD
1,Aaro Mäki-Jouppila,M,1999-05-01,22,,Wraps,M_JCR_WPC,105.6,110,180,187.5,192.5,,192.5,115,120,125,,125,190,210,220,,220,537.5,SBD
1,Tommi Läntinen,M,1980-01-01,42,,Wraps,M_MCR_1_WPC,81.6,82.5,190,-210,-210,,190,105,-115,-115,,105,240,250,-262.5,,250,545,SBD
1,Ari Kaskela,M,1977-10-16,44,,Wraps,M_MCR_1_WPC,97.1,100,200,220,235,,235,145,155,-162.5,,155,240,260,270,,270,660,SBD
2,Tuomas Siivonen,M,1979-11-04,42,,Wraps,M_MCR_1_WPC,93.3,100,145,160,170,,170,100,105,110,,110,160,182.5,190,,190,470,SBD
1,Tero Manner,M,1980-08-24,41,,Wraps,M_MCR_1_WPC,107.4,110,180,200,210,,210,130,-140,-140,,130,210,230,-250,,230,570,SBD
1,Vesa Järveläinen,M,1975-12-03,46,,Wraps,M_MCR_2_WPC,73.8,75,180,200,-212.5,,200,110,125,-130,,125,200,222.5,230,,230,555,SBD
1,Valeri Astapsev,M,1973-02-02,49,,Wraps,M_MCR_2_WPC,88,90,-165,-165,165,,165,100,105,107.5,,107.5,195,202.5,207.5,,207.5,480,SBD
1,Miikka Heikkinen,M,1976-01-29,46,,Wraps,M_MCR_2_WPC,118,125,235,255,270.5,,270.5,155,162.5,-167.5,,162.5,282.5,300,310,,310,743,SBD
1,Vladlen Astapsev,M,1965-02-01,57,,Wraps,M_MCR_4_WPC,73,75,140,145,147.5,,147.5,105,110,-115,,110,185,195,200,,200,457.5,SBD
1,Pekka Anttila,M,1965-04-19,,,Wraps,M_MCR_4_WPC,81.9,82.5,170.5,180,190,195,190,90,92.5,95,,95,200,212.5,,,212.5,497.5,SBD
NS,Jani Varha,M,1992-01-01,30,,Wraps,M_OCR_WPC,,,,,,,,,,,,,,,,,,,SBD
1,Sami Vaskelainen,M,1984-05-12,37,,Wraps,M_OCR_WPC,74.2,75,230,240,248,,248,115,120,122.5,,122.5,230,240,250,257.5,250,620.5,SBD
1,Roope Lankila,M,1992-03-02,30,,Wraps,M_OCR_WPC,97.6,100,245,260,270,,270,170,180,-187.5,,180,215,225,240,,240,690,SBD
2,Antero Kautonen,M,1986-11-26,35,,Wraps,M_OCR_WPC,92.5,100,240,-255,260,,260,145,150,-155,,150,240,250,-257.5,,250,660,SBD
1,Jari Koskinen,M,1982-09-05,39,,Wraps,M_OCR_WPC,108.3,110,-270,-280,280,,280,200,210,,,210,280,300,310,,310,800,SBD
2,Sami Niittumaa,M,1988-11-08,33,,Wraps,M_OCR_WPC,107.7,110,235,-250,260,,260,160,167.5,-175,,167.5,260,275,285,,285,712.5,SBD
3,Riku Myllylä,M,1990-10-16,31,,Wraps,M_OCR_WPC,108.1,110,210,230,-245,,230,120,135,-145,,135,200,220,-240,,220,585,SBD
4,Tero Manner,M,1980-08-24,41,,Wraps,M_OCR_WPC,107.4,110,180,200,210,,210,130,-140,-140,,130,210,230,-250,,230,570,SBD
1,Ville Suominen,M,1982-07-01,39,,Wraps,M_OCR_WPC,123.2,125,320,340,-350,,340,180,187.5,,,187.5,300,335,,,335,862.5,SBD
1,Samuli Kapanen,M,1988-12-31,33,,Wraps,M_OCR_WPC,129.2,140,280,-300,-300,,280,145,152.5,-157.5,,152.5,270,282.5,,,282.5,715,SBD
NS,Jimi Suutarinen,M,2002-08-20,19,,Wraps,M_TCR_3_WPC,,,,,,,,,,,,,,,,,,,SBD
1,Veeti Toivonen,M,2004-03-14,18,,Wraps,M_TCR_3_WPC,72.2,75,135,145,-150,,145,80,85,-90,,85,165,175,180,190,180,410,SBD
1,Jorma Mononen,M,1974-08-22,47,,Single-ply,M_MES_2_WPC,81.2,82.5,-165,170,,,170,165,175,-180,,175,180,190,,,190,535,SBD
1,Jorma Mononen,M,1974-08-22,47,,Single-ply,M_OES_WPC,81.2,82.5,-165,170,,,170,165,175,-180,,175,180,190,,,190,535,SBD
1,Pasi Koukkula,M,1971-05-11,50,,Single-ply,M_MES_3_WPC,88.2,90,215,225,235,,235,135,-140,,,135,250,260,,,260,630,SBD
1,Hannu Koskinen,M,1981-09-14,40,,Raw,M_MR_1_WPC,109.9,110,,,,,,200,212.5,-222.5,,212.5,,,,,,212.5,B
1,Timo Alasirniö,M,1970-05-07,51,,Raw,M_MR_3_WPC,74.2,75,,,,,,110.5,112.5,-115,,112.5,,,,,,112.5,B
1,Marcus Young,M,1964-09-12,57,,Raw,M_MR_4_WPC,84.9,90,,,,,,135,140,145,,145,,,,,,145,B
1,Hannu Koskinen,M,1981-09-14,40,,Raw,M_OR_WPC,109.9,110,,,,,,200,212.5,-222.5,,212.5,,,,,,212.5,B
1,Vili Muhonen,M,1998-08-21,23,,Single-ply,M_JES_WPC,77.3,82.5,,,,,,120,130,140,,140,,,,,,140,B
1,Marko Loponen,M,1981-12-16,40,,Multi-ply,M_MEM_1_WPC,106.1,110,,,,,,280,-300,300,,300,,,,,,300,B
1,Marcus Young,M,1964-09-12,57,,Single-ply,M_MES_4_WPC,84.9,90,,,,,,160,-182.5,-182.5,,160,,,,,,160,B
1,Taisto Inervo,M,1941-11-16,80,,Raw,M_MR_9_WPC,61.6,67.5,,,,,,,,,,,90,100,110,115,110,110,D
1,Tommi Muukkonen,M,1987-11-27,34,,Raw,M_OR_WPC,115.3,125,,,,,,,,,,,260,-270,270,,270,270,D
1,Pekka Räihä,M,1982-02-27,40,,Multi-ply,M_MEM_1_WPC,98.9,100,,,,,,,,,,,290,310.5,-321.5,,310.5,310.5,D
1,Marko Loponen,M,1981-12-16,40,,Multi-ply,M_MEM_1_WPC,106.1,110,,,,,,,,,,,250,275,302.5,,302.5,302.5,D
1,Jorma Mononen,M,1974-08-22,47,,Single-ply,M_MES_2_WPC,80.6,82.5,,,,,,,,,,,180,202.5,210,,210,210,D
1,Seppo Laukkanen,M,1962-06-06,59,,Single-ply,M_MES_4_WPC,98.9,100,,,,,,,,,,,262.5,270,-278,,270,270,D
1,Jani Lantiainen,M,1986-09-02,35,,Multi-ply,M_OEM_WPC,91.8,100,,,,,,,,,,,300,325,-350.5,,325,325,D
