Division,WeightClassKg,Place,Name,Team,BodyweightKg,Best3SquatKg,Best3BenchKg,Best3DeadliftKg,TotalKg,Equipment,Event,Sex,BirthDate
Boys,51.71,1,Anthony Ramirez,San Antonio East Central,50.89,106.59,83.91,145.15,335.66,Single-ply,SBD,M,
Boys,51.71,2,Jeese Garnica,Poth,48.81,72.57,45.36,102.06,219.99,Single-ply,SBD,M,
Boys,55.79,1,Justin Figueroa,San Antonio East Central,55.79,174.63,106.59,183.7,464.93,Single-ply,SBD,M,
Boys,55.79,2,Kaleb Pugh,Poth,54.7,72.57,61.23,106.59,240.4,Single-ply,SBD,M,
Boys,55.79,3,Elyjah Estrada-Nelson,San Antonio Brooks Academy,55.07,86.18,38.56,106.59,231.33,Single-ply,SBD,M,
Boys,59.87,1,Ethan Brown,Bandera,59.15,163.29,104.33,183.7,451.32,Single-ply,SBD,M,
Boys,59.87,2,Avery Crouch,San Antonio Veterans Memorial,58.69,133.81,74.84,147.42,356.07,Single-ply,SBD,M,
Boys,59.87,3,Joey Flewellen,Bandera,56.61,106.59,70.31,131.54,308.44,Single-ply,SBD,M,
Boys,59.87,4,Ashton Robison,Bandera,58.97,111.13,63.5,124.74,299.37,Single-ply,SBD,M,
Boys,59.87,5,Greene Addison,San Antonio Veterans Memorial,58.88,68.04,52.16,106.59,226.8,Single-ply,SBD,M,
Boys,67.13,1,Marc Flores,Blanco,66.77,195.04,124.74,176.9,496.68,Single-ply,SBD,M,
Boys,67.13,2,Noah Garcia,Somerset,65.86,142.88,92.99,172.37,408.23,Single-ply,SBD,M,
Boys,67.13,3,Ryder Moorman,Blanco,65.68,163.29,92.99,147.42,403.7,Single-ply,SBD,M,
Boys,67.13,4,Rowan Macias,Poth,65.05,142.88,68.04,151.95,362.87,Single-ply,SBD,M,
Boys,67.13,5,Nicholas Schultze,San Antonio Veterans Memorial,67.13,115.67,92.99,142.88,351.53,Single-ply,SBD,M,
Boys,67.13,6,Eden Flores,San Antonio Brooks Academy,63.23,113.4,68.04,142.88,324.32,Single-ply,SBD,M,
Boys,67.13,7,Xander Hernandez,San Antonio Veterans Memorial,62.41,90.72,58.97,147.42,297.1,Single-ply,SBD,M,
Boys,67.13,8,Gavin Rice,San Antonio Veterans Memorial,61.87,81.65,43.09,131.54,256.28,Single-ply,SBD,M,
Boys,67.13,DQ,Issac Ramos,Converse Judson,65.95,113.4,,,,Single-ply,SBD,M,
Boys,74.84,1,Josiah Lugo,Somerset,69.85,190.51,122.47,185.97,498.95,Single-ply,SBD,M,
Boys,74.84,2,Justin Beal,Bandera,71.3,170.1,122.47,172.37,464.93,Single-ply,SBD,M,
Boys,74.84,3,Noah Schwarzlose,Blanco,72.76,151.95,99.79,179.17,430.91,Single-ply,SBD,M,
Boys,74.84,4,Grant Jones,Blanco,71.85,163.29,92.99,172.37,428.64,Single-ply,SBD,M,
Boys,74.84,5,Matthew Chavez,Bandera,72.3,145.15,102.06,161.03,408.23,Single-ply,SBD,M,
Boys,74.84,6,Tanner Thomas,Poth,73.12,111.13,68.04,147.42,326.59,Single-ply,SBD,M,
Boys,74.84,7,Gavin Munoz,San Antonio Brooks Academy,73.94,106.59,52.16,136.08,294.84,Single-ply,SBD,M,
Boys,74.84,DQ,Danny Freeman,Bandera,70.4,170.1,,,,Single-ply,SBD,M,
Boys,82.1,1,David Garcia #20,Somerset,80.1,195.04,124.74,190.51,510.29,Single-ply,SBD,M,
Boys,82.1,2,Matthew Staton,Bandera,77.11,181.44,124.74,190.51,496.68,Single-ply,SBD,M,
Boys,82.1,3,Logan Pawelek,Poth,80.74,190.51,113.4,183.7,487.61,Single-ply,SBD,M,
Boys,82.1,4,Michael Cruz #5,San Antonio East Central,81.28,167.83,111.13,199.58,478.54,Single-ply,SBD,M,
Boys,82.1,5,Rey Torres,San Antonio East Central,81.47,167.83,122.47,183.7,474,Single-ply,SBD,M,
Boys,82.1,6,Bennett Brock,Blanco,79.74,131.54,97.52,176.9,405.97,Single-ply,SBD,M,
Boys,82.1,7,Kahlil Noland,Converse Judson,75.3,113.4,74.84,185.97,374.21,Single-ply,SBD,M,
Boys,82.1,8,Georgie Casarez,San Antonio Holy Cross,79.24,140.61,97.52,129.27,367.41,Single-ply,SBD,M,
Boys,82.1,9,Tobias Fletcher,San Antonio Veterans Memorial,79.56,124.74,43.09,142.88,310.71,Single-ply,SBD,M,
Boys,82.1,10,Christian Miranda,Converse Judson,79.74,111.13,72.57,120.2,303.91,Single-ply,SBD,M,
Boys,82.1,DQ,George Cabasos,Bandera,77.38,,,,,Single-ply,SBD,M,
Boys,89.81,1,Michael Connell,San Antonio East Central,89.63,215.46,129.27,258.55,603.28,Single-ply,SBD,M,
Boys,89.81,2,Caden Bosanko,San Antonio East Central,82.83,238.14,127.01,208.65,573.79,Single-ply,SBD,M,
Boys,89.81,3,Deonte Hector,Blanco,86.91,201.85,142.88,192.78,537.51,Single-ply,SBD,M,
Boys,89.81,4,Luke Johnson,Blanco,82.83,161.03,117.93,172.37,451.32,Single-ply,SBD,M,
Boys,89.81,5,John May,San Antonio East Central,83.46,122.47,102.06,172.37,396.89,Single-ply,SBD,M,
Boys,89.81,6,Gideon Flores,San Antonio Brooks Academy,87.36,142.88,83.91,161.03,387.82,Single-ply,SBD,M,
Boys,89.81,7,Lance Nielson,San Antonio Brooks Academy,89.45,136.08,70.31,181.44,387.82,Single-ply,SBD,M,
Boys,89.81,8,Darian Harris,San Antonio Veterans Memorial,85.46,117.93,77.11,183.7,378.75,Single-ply,SBD,M,
Boys,89.81,9,Kieran Davis,Converse Judson,88.72,124.74,86.18,142.88,353.8,Single-ply,SBD,M,
Boys,89.81,10,Angel Rodriguez Solano,San Antonio Brooks Academy,89.63,90.72,58.97,163.29,312.98,Single-ply,SBD,M,
Boys,89.81,11,Jesus Vargas,San Antonio Veterans Memorial,86.27,79.38,54.43,138.35,272.16,Single-ply,SBD,M,
Boys,89.81,DQ,Riley Holman,Poth,83.55,165.56,136.08,,,Single-ply,SBD,M,
Boys,99.79,1,Timothy Huff,San Antonio East Central,93.53,222.26,122.47,260.82,605.55,Single-ply,SBD,M,
Boys,99.79,2,Alan Rubio,Blanco,92.62,206.38,124.74,192.78,523.9,Single-ply,SBD,M,
Boys,99.79,3,Mitchell Dalland,Blanco,90.72,149.69,92.99,165.56,408.23,Single-ply,SBD,M,
Boys,109.77,1,Gerardo Cantu,Somerset,104.42,242.67,133.81,204.12,580.6,Single-ply,SBD,M,
Boys,109.77,2,Juan Palacios,Blanco,105.41,215.46,161.03,183.7,560.19,Single-ply,SBD,M,
Boys,109.77,3,Ethan Boyd,Bandera,105.23,176.9,108.86,181.44,467.2,Single-ply,SBD,M,
Boys,109.77,4,Aaron Martinez,San Antonio Holy Cross,105.51,165.56,120.2,167.83,453.59,Single-ply,SBD,M,
Boys,109.77,5,Adahir Ruiz,Poth,102.6,170.1,90.72,149.69,410.5,Single-ply,SBD,M,
Boys,109.77,6,Angel Garcia #11,San Antonio Brooks Academy,100.24,136.08,83.91,167.83,387.82,Single-ply,SBD,M,
Boys,109.77,7,Logan Ramirez,Poth,109.77,111.13,68.04,113.4,292.57,Single-ply,SBD,M,
Boys,109.77,8,Christopher Earl,San Antonio Brooks Academy,107.86,97.52,49.9,124.74,272.16,Single-ply,SBD,M,
Boys,109.77,DQ,Kyler Flores,San Antonio Veterans Memorial,101.15,,,,,Single-ply,SBD,M,
Boys,124.74,1,Daniel Jaimes,Blanco,116.48,251.74,142.88,222.26,616.89,Single-ply,SBD,M,
Boys,124.74,2,Frankie Castillo,Somerset,120.2,254.01,151.95,210.92,616.89,Single-ply,SBD,M,
Boys,124.74,3,Daniel Alonzo,San Antonio Holy Cross,115.67,136.08,102.06,165.56,403.7,Single-ply,SBD,M,
Boys,124.74,4,Isaac Tello,San Antonio Brooks Academy,113.49,151.95,74.84,170.1,396.89,Single-ply,SBD,M,
Boys,124.74,5,Luke Harris,Converse Judson,120.47,142.88,83.91,170.1,396.89,Single-ply,SBD,M,
Boys,139.71,1,William Viator,San Antonio East Central,130.73,242.67,156.49,226.8,625.96,Single-ply,SBD,M,
Boys,139.71,2,Abraham Vasquez,Somerset,134.72,260.82,129.27,231.33,621.42,Single-ply,SBD,M,
Boys,139.71,3,Noah Sizemore,Bandera,134.26,265.35,136.08,204.12,605.55,Single-ply,SBD,M,
Boys,139.71+,1,Alfonspo Gutierrez,San Antonio Veterans Memorial,145.33,158.76,72.57,158.76,390.09,Single-ply,SBD,M,
