<svg id="Grupo_7" data-name="Grupo 7" xmlns="http://www.w3.org/2000/svg" width="33.223" height="33.223" viewBox="0 0 33.223 33.223">
  <g id="Grupo_6" data-name="Grupo 6">
    <path id="Trazado_12" data-name="Trazado 12" d="M165.96,163.351a6.273,6.273,0,0,1-1.971.755,3.119,3.119,0,0,0-2.265-.967,3.073,3.073,0,0,0-3.1,3.02,3.023,3.023,0,0,0,.083.695,8.842,8.842,0,0,1-6.388-3.186,2.982,2.982,0,0,0,.959,4.047,3.126,3.126,0,0,1-1.4-.385v.038a3.066,3.066,0,0,0,2.484,3.02,3.164,3.164,0,0,1-1.4.053,3.1,3.1,0,0,0,2.892,2.114,6.275,6.275,0,0,1-3.828,1.321,6.42,6.42,0,0,1-.755-.045,8.872,8.872,0,0,0,4.749,1.374,8.683,8.683,0,0,0,8.84-8.523q0-.076,0-.152v-.393a6.275,6.275,0,0,0,1.51-1.578,6.267,6.267,0,0,1-1.782.483A3.073,3.073,0,0,0,165.96,163.351Z" transform="translate(-141.458 -152.554)" fill="#fff"/>
    <path id="Trazado_13" data-name="Trazado 13" d="M16.612,0A16.611,16.611,0,1,0,33.223,16.611,16.612,16.612,0,0,0,16.612,0Zm0,31.713a15.1,15.1,0,1,1,15.1-15.1A15.1,15.1,0,0,1,16.612,31.713Z" fill="#fff"/>
  </g>
</svg>
