<svg id="instagram" xmlns="http://www.w3.org/2000/svg" width="36.645" height="36.646" viewBox="0 0 36.645 36.646">
  <g id="Grupo_11" data-name="Grupo 11" transform="translate(0)">
    <g id="Grupo_10" data-name="Grupo 10">
      <path id="Trazado_21" data-name="Trazado 21" d="M18.323,0A18.323,18.323,0,1,0,36.646,18.323,18.323,18.323,0,0,0,18.323,0Zm0,34.98A16.657,16.657,0,1,1,34.98,18.323,16.657,16.657,0,0,1,18.323,34.98Z" fill="#fff"/>
      <path id="Trazado_22" data-name="Trazado 22" d="M152.963,139.636h-9.994a3.331,3.331,0,0,0-3.331,3.331v9.994a3.331,3.331,0,0,0,3.331,3.331h9.994a3.331,3.331,0,0,0,3.331-3.331v-9.994A3.331,3.331,0,0,0,152.963,139.636Zm-1.666,2.5h2.5v2.5h-2.5Zm-3.331,2.5a3.331,3.331,0,1,1-3.331,3.331A3.331,3.331,0,0,1,147.965,144.633Zm6.663,8.328a1.666,1.666,0,0,1-1.666,1.666h-9.994a1.666,1.666,0,0,1-1.666-1.666v-5.83h1.749a5,5,0,1,0,9.911.833,4.935,4.935,0,0,0-.083-.833h1.749v5.83Z" transform="translate(-129.643 -129.642)" fill="#fff"/>
    </g>
  </g>
</svg>
