<svg xmlns="http://www.w3.org/2000/svg" width="202" height="51" viewBox="0 0 202 51">
  <g id="Grupo_2125" data-name="Grupo 2125" transform="translate(0.268 -0.286)">
    <g id="Grupo_1217" data-name="Grupo 1217" transform="translate(0 0)">
      <g id="Rectángulo_33" data-name="Rectángulo 33" transform="translate(-0.268 0.286)" fill="#fff" stroke="#697e42" stroke-width="2">
        <rect width="202" height="51" rx="12" stroke="none"/>
        <rect x="1" y="1" width="200" height="49" rx="11" fill="none"/>
      </g>
      <path id="XMLID_229_" d="M29.044,75.935C26.7,80,28.19,86.168,30.78,89.908c1.293,1.87,2.6,3.548,4.395,3.548l.1,0a5.427,5.427,0,0,0,2.04-.544,5.585,5.585,0,0,1,2.416-.573,5.253,5.253,0,0,1,2.3.554,4.872,4.872,0,0,0,2.2.528c2.02-.038,3.259-1.849,4.353-3.446A15.277,15.277,0,0,0,50.5,86.067l.008-.025a.227.227,0,0,0-.121-.279l-.017-.007a5.789,5.789,0,0,1-3.508-5.3,5.959,5.959,0,0,1,2.816-4.981l.022-.014a.227.227,0,0,0,.064-.319,6.553,6.553,0,0,0-5.154-2.8c-.147-.015-.3-.022-.45-.022a8.985,8.985,0,0,0-3.235.808,5.2,5.2,0,0,1-1.55.463,5.07,5.07,0,0,1-1.6-.469,7.767,7.767,0,0,0-2.825-.718h-.072A6.927,6.927,0,0,0,29.044,75.935Z" transform="translate(-9.391 -54.095)" fill="#697e42"/>
      <path id="XMLID_230_" d="M154.923,0a6.326,6.326,0,0,0-4.176,2.142,5.927,5.927,0,0,0-1.5,4.395.227.227,0,0,0,.207.2c.1.008.2.011.294.011a5.351,5.351,0,0,0,3.942-2.022A6.249,6.249,0,0,0,155.158.2.228.228,0,0,0,154.923,0Z" transform="translate(-119.704 11.656)" fill="#697e42"/>
      <text id="VERSIÓN_IOS" data-name="VERSIÓN IOS" transform="translate(51.732 19.286)" fill="#697e42" font-size="10" font-family="Lato-Regular, Lato"><tspan x="0" y="0">VERSIÓN IOS</tspan></text>
      <text id="APP_STORE" data-name="APP STORE" transform="translate(51.732 38.286)" fill="#697e42" font-size="17" font-family="Lato-Bold, Lato" font-weight="700"><tspan x="0" y="0">APP STORE</tspan></text>
    </g>
  </g>
</svg>
