<svg id="Grupo_2134" data-name="Grupo 2134" xmlns="http://www.w3.org/2000/svg" xmlns:xlink="http://www.w3.org/1999/xlink" width="273.532" height="95.806" viewBox="0 0 273.532 95.806">
  <defs>
    <clipPath id="clip-path">
      <rect id="Rectángulo_3580" data-name="Rectángulo 3580" width="273.532" height="95.806" fill="#b65e43"/>
    </clipPath>
  </defs>
  <g id="Grupo_1470" data-name="Grupo 1470" clip-path="url(#clip-path)">
    <path id="Trazado_1463" data-name="Trazado 1463" d="M11.754,48.96a1.385,1.385,0,0,1-1.384-1.384V6.555H1.384A1.386,1.386,0,0,1,0,5.171V1.384A1.386,1.386,0,0,1,1.384,0H27.392a1.386,1.386,0,0,1,1.384,1.384V5.171a1.386,1.386,0,0,1-1.384,1.384H18.406V47.576a1.385,1.385,0,0,1-1.384,1.384Z" transform="translate(0)" fill="#b65e43"/>
    <path id="Trazado_1464" data-name="Trazado 1464" d="M92.243,62.924a1.385,1.385,0,0,1-1.384-1.384V23.808a1.385,1.385,0,0,1,1.384-1.384h21.87a1.386,1.386,0,0,1,1.384,1.384V27.6a1.386,1.386,0,0,1-1.384,1.384H100.952A2.059,2.059,0,0,0,98.9,31.036v3.679a2.059,2.059,0,0,0,2.057,2.056h12.5a1.386,1.386,0,0,1,1.384,1.384V41.84a1.385,1.385,0,0,1-1.384,1.384h-12.5A2.059,2.059,0,0,0,98.9,45.28v9.032a2.059,2.059,0,0,0,2.057,2.057h13.774a1.385,1.385,0,0,1,1.384,1.384V61.54a1.385,1.385,0,0,1-1.384,1.384Z" transform="translate(-56.579 -13.964)" fill="#b65e43"/>
    <path id="Trazado_1465" data-name="Trazado 1465" d="M194.513,77.89a1.388,1.388,0,0,1-1.118-.568l-10.28-14.086a1.4,1.4,0,0,0-1.142-.584,1.426,1.426,0,0,0-1.427,1.422V76.506a1.385,1.385,0,0,1-1.384,1.384h-5.268a1.385,1.385,0,0,1-1.384-1.384V47.842a1.385,1.385,0,0,1,1.384-1.384h5.072a1.387,1.387,0,0,1,1.124.576l10.277,14.3a1.4,1.4,0,0,0,1.148.593,1.426,1.426,0,0,0,1.427-1.422V47.842a1.386,1.386,0,0,1,1.384-1.384H199.6a1.386,1.386,0,0,1,1.384,1.384V76.506A1.386,1.386,0,0,1,199.6,77.89Z" transform="translate(-107.424 -28.93)" fill="#b65e43"/>
    <path id="Trazado_1466" data-name="Trazado 1466" d="M92.243,187.772a1.385,1.385,0,0,1-1.384-1.384V157.724a1.386,1.386,0,0,1,1.384-1.384h21.87a1.385,1.385,0,0,1,1.384,1.384v3.787a1.385,1.385,0,0,1-1.384,1.384h-13.8a1.423,1.423,0,0,0-1.421,1.421v2.862a1.423,1.423,0,0,0,1.421,1.421h13.133a1.385,1.385,0,0,1,1.384,1.384v3.685a1.385,1.385,0,0,1-1.384,1.384H100.316a1.423,1.423,0,0,0-1.421,1.421V179.8a1.423,1.423,0,0,0,1.421,1.421h14.411a1.386,1.386,0,0,1,1.384,1.384v3.787a1.385,1.385,0,0,1-1.384,1.384Z" transform="translate(-56.579 -97.355)" fill="#b65e43"/>
    <path id="Trazado_1467" data-name="Trazado 1467" d="M192.87,187.772a1.383,1.383,0,0,1-1.218-.726l-2.981-5.519a1.41,1.41,0,0,0-1.239-.745c-1.273.027-3.1.041-5.455.043a1.428,1.428,0,0,0-1.431,1.42v4.143a1.385,1.385,0,0,1-1.384,1.384h-5.268a1.386,1.386,0,0,1-1.384-1.384V157.724a1.386,1.386,0,0,1,1.384-1.384h12.391c4.665,0,8.3,1.171,10.8,3.482a11.312,11.312,0,0,1,3.742,8.761,12.113,12.113,0,0,1-1.245,5.33,10.429,10.429,0,0,1-2.241,3.058,3.061,3.061,0,0,0-.551,3.889l3,4.793a1.384,1.384,0,0,1-1.173,2.119ZM182.6,162.9a2.059,2.059,0,0,0-2.057,2.057v7.262a2.059,2.059,0,0,0,2.057,2.057h3.785a5.7,5.7,0,0,0,4.192-1.649,5.767,5.767,0,0,0,0-8.076,5.64,5.64,0,0,0-4.141-1.649Z" transform="translate(-107.424 -97.355)" fill="#b65e43"/>
    <rect id="Rectángulo_3579" data-name="Rectángulo 3579" width="8.035" height="39.656" rx="3.668" transform="translate(99.673 50.761)" fill="#b65e43"/>
    <path id="Trazado_1468" data-name="Trazado 1468" d="M306.188,161.01a1.385,1.385,0,0,1-1.384-1.384V114.747a1.386,1.386,0,0,1,1.384-1.384h21.1a1.385,1.385,0,0,1,1.384,1.384v3.787a1.385,1.385,0,0,1-1.384,1.384H314.8a1.962,1.962,0,0,0-1.96,1.959v6.93a1.962,1.962,0,0,0,1.96,1.959h10.5a1.385,1.385,0,0,1,1.384,1.384v3.684a1.385,1.385,0,0,1-1.384,1.384H314.8a1.962,1.962,0,0,0-1.96,1.96v20.446a1.385,1.385,0,0,1-1.384,1.384Z" transform="translate(-189.805 -70.592)" fill="#b65e43"/>
    <path id="Trazado_1469" data-name="Trazado 1469" d="M382.017,146.853a1.385,1.385,0,0,1-1.384-1.384V92.013a1.386,1.386,0,0,1,1.384-1.384h21.869a1.385,1.385,0,0,1,1.384,1.384V95.8a1.385,1.385,0,0,1-1.384,1.384H390.628a1.962,1.962,0,0,0-1.96,1.96v7.346a1.961,1.961,0,0,0,1.96,1.959h12.595a1.386,1.386,0,0,1,1.384,1.384v3.685a1.386,1.386,0,0,1-1.384,1.384H390.628a1.962,1.962,0,0,0-1.96,1.96v21.477a1.961,1.961,0,0,0,1.96,1.959H404.5a1.385,1.385,0,0,1,1.384,1.384v3.787a1.385,1.385,0,0,1-1.384,1.384Z" transform="translate(-237.025 -56.436)" fill="#b65e43"/>
    <path id="Trazado_1470" data-name="Trazado 1470" d="M646.025,174.02a2.666,2.666,0,0,1-2.142-1.085l-15.306-20.919c-1.206-1.638-2.467-3.468-3.746-5.437q-1.168-1.8-2.023-3.136v27.923a2.658,2.658,0,0,1-2.655,2.655h-5.123a2.658,2.658,0,0,1-2.655-2.655V128.257a2.658,2.658,0,0,1,2.655-2.655h6.041a2.664,2.664,0,0,1,2.145,1.09l16.092,22.059c.979,1.371,2.071,2.981,3.248,4.794.714,1.1,1.342,2.089,1.878,2.959V128.257a2.658,2.658,0,0,1,2.655-2.655h5.123a2.658,2.658,0,0,1,2.655,2.655v43.109a2.658,2.658,0,0,1-2.655,2.655Z" transform="translate(-381.334 -78.214)" fill="#b65e43"/>
    <path id="Trazado_1471" data-name="Trazado 1471" d="M507.85,164.569a20.094,20.094,0,1,1,20.094-20.094,20.117,20.117,0,0,1-20.094,20.094m0-29.77a9.676,9.676,0,1,0,9.675,9.676,9.686,9.686,0,0,0-9.675-9.676" transform="translate(-303.732 -77.454)" fill="#b65e43"/>
  </g>
</svg>
