{
  "allPlaceholder": "Introduzca código o nombre...",
  "showInfoWindowOnSelect": true,
  "sources": [
    {
      "layerId": null,
      "url": "https://vente-pre.tenerife.es/server/rest/services/MapasBase/Busqueda_read/MapServer/0",
      "name": "Toponimia",
      "placeholder": "Introduzca topónimo...",
      "searchFields": [
        "descrip",
        "texto"
      ],
      "displayField": "texto",
      "exactMatch": false,
      "searchInCurrentMapExtent": false,
      "panToScale": false,
      "zoomScale": null,
      "maxSuggestions": 6,
      "maxResults": 6,
      "type": "query"
    },
    {
      "layerId": "etiquetasviario_read_9714_0",
      "url": "https://vente-pre.tenerife.es/server/rest/services/Viario/etiquetasviario_read/MapServer/0",
      "name": "Nombres de pistas y caminos",
      "placeholder": "Introduzca nombre...",
      "searchFields": [
        "nombre"
      ],
      "displayField": "nombre",
      "exactMatch": false,
      "searchInCurrentMapExtent": false,
      "panToScale": false,
      "zoomScale": null,
      "maxSuggestions": 6,
      "maxResults": 6,
      "type": "query"
    },
    {
      "layerId": "EdicionIncidencias_edit_3169",
      "url": "https://vente-pre.tenerife.es/server/rest/services/Incidencias/EdicionIncidencias_edit/FeatureServer/106",
      "name": "Incidencias",
      "placeholder": "Introduzca código o nombre...",
      "searchFields": [
        "codigo",
        "nombre"
      ],
      "displayField": "nombre",
      "exactMatch": false,
      "searchInCurrentMapExtent": false,
      "panToScale": false,
      "zoomScale": null,
      "maxSuggestions": 6,
      "maxResults": 6,
      "type": "query"
    },
    {
      "layerId": "EdicionIncidencias_edit_2894",
      "url": "https://vente-pre.tenerife.es/server/rest/services/Incidencias/EdicionIncidencias_edit/FeatureServer/0",
      "name": "Áreas de descanso",
      "placeholder": "Introduzca código o nombre...",
      "searchFields": [
        "codigo",
        "nombre"
      ],
      "displayField": "nombre",
      "exactMatch": false,
      "searchInCurrentMapExtent": false,
      "panToScale": false,
      "zoomScale": null,
      "maxSuggestions": 6,
      "maxResults": 6,
      "type": "query"
    },
    {
      "layerId": "EdicionIncidencias_edit_6560",
      "url": "https://vente-pre.tenerife.es/server/rest/services/Incidencias/EdicionIncidencias_edit/FeatureServer/1",
      "name": "Arquetas",
      "placeholder": "Introduzca código o nombre...",
      "searchFields": [
        "codigo",
        "nombre"
      ],
      "displayField": "nombre",
      "exactMatch": false,
      "searchInCurrentMapExtent": false,
      "panToScale": false,
      "zoomScale": null,
      "maxSuggestions": 6,
      "maxResults": 6,
      "type": "query"
    },
    {
      "layerId": "EdicionIncidencias_edit_1922",
      "url": "https://vente-pre.tenerife.es/server/rest/services/Incidencias/EdicionIncidencias_edit/FeatureServer/2",
      "name": "Balizas",
      "placeholder": "Introduzca código o nombre...",
      "searchFields": [
        "codigo",
        "nombre"
      ],
      "displayField": "nombre",
      "exactMatch": false,
      "searchInCurrentMapExtent": false,
      "panToScale": false,
      "zoomScale": null,
      "maxSuggestions": 6,
      "maxResults": 6,
      "type": "query"
    },
    {
      "layerId": "EdicionIncidencias_edit_8120",
      "url": "https://vente-pre.tenerife.es/server/rest/services/Incidencias/EdicionIncidencias_edit/FeatureServer/3",
      "name": "Barreras",
      "placeholder": "Introduzca código o nombre...",
      "searchFields": [
        "codigo",
        "nombre"
      ],
      "displayField": "nombre",
      "exactMatch": false,
      "searchInCurrentMapExtent": false,
      "panToScale": false,
      "zoomScale": null,
      "maxSuggestions": 6,
      "maxResults": 6,
      "type": "query"
    },
    {
      "layerId": "EdicionIncidencias_edit_837",
      "url": "https://vente-pre.tenerife.es/server/rest/services/Incidencias/EdicionIncidencias_edit/FeatureServer/4",
      "name": "Carteles",
      "placeholder": "Introduzca código o nombre...",
      "searchFields": [
        "codigo",
        "nombre"
      ],
      "displayField": "nombre",
      "exactMatch": false,
      "searchInCurrentMapExtent": false,
      "panToScale": false,
      "zoomScale": null,
      "maxSuggestions": 6,
      "maxResults": 6,
      "type": "query"
    },
    {
      "layerId": "EdicionIncidencias_edit_1698",
      "url": "https://vente-pre.tenerife.es/server/rest/services/Incidencias/EdicionIncidencias_edit/FeatureServer/5",
      "name": "Depósitos",
      "placeholder": "Introduzca código o nombre...",
      "searchFields": [
        "codigo",
        "nombre"
      ],
      "displayField": "codigo",
      "exactMatch": false,
      "searchInCurrentMapExtent": false,
      "panToScale": false,
      "zoomScale": null,
      "maxSuggestions": 6,
      "maxResults": 6,
      "type": "query"
    },
    {
      "layerId": "EdicionIncidencias_edit_43",
      "url": "https://vente-pre.tenerife.es/server/rest/services/Incidencias/EdicionIncidencias_edit/FeatureServer/6",
      "name": "Dotaciones de sendero",
      "placeholder": "Introduzca código o nombre...",
      "searchFields": [
        "codigo",
        "nombre"
      ],
      "displayField": "nombre",
      "exactMatch": false,
      "searchInCurrentMapExtent": false,
      "panToScale": false,
      "zoomScale": null,
      "maxSuggestions": 6,
      "maxResults": 6,
      "type": "query"
    },
    {
      "layerId": "EdicionIncidencias_edit_8074",
      "url": "https://vente-pre.tenerife.es/server/rest/services/Incidencias/EdicionIncidencias_edit/FeatureServer/16",
      "name": "Grupo de instalaciones recreativas",
      "placeholder": "Introduzca nombre...",
      "searchFields": [
        "nombre"
      ],
      "displayField": "nombre",
      "exactMatch": false,
      "searchInCurrentMapExtent": false,
      "panToScale": false,
      "zoomScale": null,
      "maxSuggestions": 6,
      "maxResults": 6,
      "type": "query"
    },
    {
      "layerId": "EdicionIncidencias_edit_9211",
      "url": "https://vente-pre.tenerife.es/server/rest/services/Incidencias/EdicionIncidencias_edit/FeatureServer/8",
      "name": "Instalaciones recreativas",
      "placeholder": "Introduzca código o nombre...",
      "searchFields": [
        "codigo",
        "nombre"
      ],
      "displayField": "nombre",
      "exactMatch": false,
      "searchInCurrentMapExtent": false,
      "panToScale": false,
      "zoomScale": null,
      "maxSuggestions": 6,
      "maxResults": 6,
      "type": "query"
    },
    {
      "layerId": "EdicionIncidencias_edit_4944",
      "url": "https://vente-pre.tenerife.es/server/rest/services/Incidencias/EdicionIncidencias_edit/FeatureServer/9",
      "name": "Marcas",
      "placeholder": "Introduzca código o nombre...",
      "searchFields": [
        "codigo",
        "nombre"
      ],
      "displayField": "nombre",
      "exactMatch": false,
      "searchInCurrentMapExtent": false,
      "panToScale": false,
      "zoomScale": null,
      "maxSuggestions": 6,
      "maxResults": 6,
      "type": "query"
    },
    {
      "layerId": "EdicionIncidencias_edit_4020",
      "url": "https://vente-pre.tenerife.es/server/rest/services/Incidencias/EdicionIncidencias_edit/FeatureServer/10",
      "name": "Mesas interpretativas",
      "placeholder": "Introduzca código o nombre...",
      "searchFields": [
        "codigo",
        "nombre"
      ],
      "displayField": "nombre",
      "exactMatch": false,
      "searchInCurrentMapExtent": false,
      "panToScale": false,
      "zoomScale": null,
      "maxSuggestions": 6,
      "maxResults": 6,
      "type": "query"
    },
    {
      "layerId": "EdicionIncidencias_edit_6458",
      "url": "https://vente-pre.tenerife.es/server/rest/services/Incidencias/EdicionIncidencias_edit/FeatureServer/11",
      "name": "Paneles",
      "placeholder": "Introduzca código o nombre...",
      "searchFields": [
        "codigo",
        "nombre"
      ],
      "displayField": "nombre",
      "exactMatch": false,
      "searchInCurrentMapExtent": false,
      "panToScale": false,
      "zoomScale": null,
      "maxSuggestions": 6,
      "maxResults": 6,
      "type": "query"
    },
    {
      "layerId": "v_red_recreativa_tramo_unico_4922_0",
      "url": "https://vente-pre.tenerife.es/server/rest/services/MapasBase/v_red_recreativa_tramo_unico/MapServer/0",
      "name": "Redes recreativas",
      "placeholder": "Introduzca matrícula o nombre...",
      "searchFields": [
        "matricula",
        "nombre",
        "matricula_nombre"
      ],
      "displayField": "matricula_nombre",
      "exactMatch": false,
      "searchInCurrentMapExtent": false,
      "panToScale": false,
      "zoomScale": null,
      "maxSuggestions": 6,
      "maxResults": 6,
      "type": "query"
    },
    {
      "layerId": "EdicionIncidencias_edit_7412",
      "url": "https://vente-pre.tenerife.es/server/rest/services/Incidencias/EdicionIncidencias_edit/FeatureServer/12",
      "name": "Señales direccionales",
      "placeholder": "Introduzca código o nombre...",
      "searchFields": [
        "codigo",
        "nombre"
      ],
      "displayField": "nombre",
      "exactMatch": false,
      "searchInCurrentMapExtent": false,
      "panToScale": false,
      "zoomScale": null,
      "maxSuggestions": 6,
      "maxResults": 6,
      "type": "query"
    },
    {
      "layerId": "EdicionIncidencias_edit_8396",
      "url": "https://vente-pre.tenerife.es/server/rest/services/Incidencias/EdicionIncidencias_edit/FeatureServer/13",
      "name": "Zonas de aparcamiento",
      "placeholder": "Introduzca código o nombre...",
      "searchFields": [
        "codigo",
        "nombre"
      ],
      "displayField": "nombre",
      "exactMatch": false,
      "searchInCurrentMapExtent": false,
      "panToScale": false,
      "zoomScale": null,
      "maxSuggestions": 6,
      "maxResults": 6,
      "type": "query"
    }
  ]
}
