{
  "numPerPage": 30,
  "scopeOptions": {
    "MyContent": {
      "allow": true,
      "label": null
    },
    "MyOrganization": {
      "allow": false,
      "label": null
    },
    "Curated": {
      "allow": true,
      "label": null,
      "filter": "group:${GROUP_ID}"
    },
    "ArcGISOnline": {
      "allow": true,
      "label": null
    },
    "defaultScope": "Curated"
  },
  "addFromUrl": {
    "allow": true
  },
  "searchCategories": {
    "allow": true
  },
  "addFromFile": {
    "allow": true,
    "maxRecordCount": 1000
  }
}
