{
  "GeometryServer": "https://utility.arcgisonline.com/ArcGIS/rest/services/Geometry/GeometryServer",  
  "Capas": ["Viario"],
  "nombre_viario":"Viario",
  "urlViario_VisorCartografico": "https://vente-pre.tenerife.es/server/rest/services/Varios/VisorCartografico_read/FeatureServer/21",
  "idViario_VisorCartografico": "VisorCartografico_read_3984",
  "idViario_EdicionIncidencias": "EdicionIncidencias_read_7475",
  "idViario_EdicionEquipamientos": "EdicionEquipamientos_read_940",
  "idNumericoViario_VisorCartografico": 20,
  "idNumerico_VisorCartografico_layersid": 21,
  "idNumerico_EdicionIncidencias_layersid": 15,
  "idNumerico_EdicionEquipamientos_layersid": 16,
  "url_ViarioFL": "https://vente-pre.tenerife.es/server/rest/services/Varios/EdicionEquipamientos_edit/FeatureServer/16"
}