{
  "theme": {
    "name": "FoldableTheme",
    "styles": [
      "yellow",
      "default",
      "black",
      "blue",
      "cyan",
      "green",
      "purple",
      "red"
    ],
    "version": "2.17",
    "sharedTheme": {
      "isPortalSupport": true,
      "useHeader": false,
      "useLogo": false
    },
    "customStyles": {
      "mainBackgroundColor": "#4b4a4a"
    }
  },
  "portalUrl": "https://vente.shsconsultores.es/portal",
  "appId": "",
  "authorizedCrossOriginDomains": [],
  "title": "Edición - Priorización y planificación presupuestaria de senderos",
  "subtitle": "",
  "keepAppState": true,
  "logo": "images/logo.png",
  "geometryService": "https://utility.arcgisonline.com/arcgis/rest/services/Geometry/GeometryServer",
  "links": [],
  "widgetOnScreen": {
    "widgets": [
      {
        "uri": "themes/FoldableTheme/widgets/HeaderController/Widget",
        "position": {
          "left": 0,
          "top": 0,
          "right": 0,
          "height": 40,
          "relativeTo": "browser"
        },
        "version": "2.17",
        "id": "themes_FoldableTheme_widgets_HeaderController_Widget_1",
        "name": "HeaderController"
      },
      {
        "uri": "widgets/Scalebar/Widget",
        "position": {
          "left": 7,
          "bottom": 25,
          "relativeTo": "map"
        },
        "version": "2.17",
        "id": "widgets_Scalebar_Widget_2",
        "name": "Scalebar",
        "config": "configs/Scalebar/config_widgets_Scalebar_Widget_2.json"
      },
      {
        "uri": "widgets/Search/Widget",
        "position": {
          "left": 55,
          "top": 5,
          "relativeTo": "map"
        },
        "version": "2.17",
        "id": "widgets_Search_Widget_3",
        "name": "Search",
        "config": "configs/Search/config_widgets_Search_Widget_3.json"
      },
      {
        "uri": "widgets/Coordinate/Widget",
        "position": {
          "left": 7,
          "bottom": 5,
          "relativeTo": "map"
        },
        "version": "2.17",
        "id": "widgets_Coordinate_Widget_4",
        "name": "Coordinate"
      },
      {
        "position": {
          "left": 55,
          "top": 45,
          "relativeTo": "map"
        },
        "placeholderIndex": 1,
        "id": "_5",
        "name": "Screening",
        "version": "2.17",
        "closeable": true,
        "IsController": false,
        "uri": "widgets/Screening/Widget",
        "config": "configs/Screening/config__5.json"
      },
      {
        "position": {
          "left": 105,
          "top": 45,
          "relativeTo": "map"
        },
        "placeholderIndex": 1,
        "id": "_6",
        "name": "Select",
        "version": "2.17",
        "closeable": true,
        "uri": "widgets/Select/Widget",
        "config": "configs/Select/config__6.json"
      },
      {
        "position": {
          "left": 205,
          "top": 45,
          "relativeTo": "map"
        },
        "placeholderIndex": 1,
        "id": "_7",
        "version": "2.17",
        "closeable": true,
        "uri": ""
      },
      {
        "position": {
          "left": 155,
          "top": 45,
          "relativeTo": "map"
        },
        "placeholderIndex": 2,
        "id": "_8",
        "name": "NearMe",
        "version": "2.17",
        "closeable": true,
        "IsController": false,
        "uri": "widgets/NearMe/Widget",
        "config": "configs/NearMe/config__8.json"
      },
      {
        "position": {
          "left": 255,
          "top": 45,
          "relativeTo": "map"
        },
        "placeholderIndex": 2,
        "id": "_9",
        "version": "2.17",
        "closeable": true,
        "uri": ""
      },
      {
        "uri": "widgets/OverviewMap/Widget",
        "position": {
          "bottom": 0,
          "right": 0,
          "zIndex": 1,
          "relativeTo": "map"
        },
        "version": "2.17",
        "id": "widgets_OverviewMap_Widget_10",
        "name": "OverviewMap",
        "config": "configs/OverviewMap/config_widgets_OverviewMap_Widget_10.json"
      },
      {
        "uri": "widgets/HomeButton/Widget",
        "position": {
          "left": 7,
          "top": 75,
          "relativeTo": "map"
        },
        "version": "2.17",
        "id": "widgets_HomeButton_Widget_11",
        "name": "HomeButton"
      },
      {
        "uri": "widgets/MyLocation/Widget",
        "position": {
          "left": 7,
          "top": 110,
          "relativeTo": "map"
        },
        "version": "2.17",
        "id": "widgets_MyLocation_Widget_12",
        "name": "MyLocation",
        "config": "configs/MyLocation/config_widgets_MyLocation_Widget_12.json",
        "visible": false
      },
      {
        "uri": "widgets/AttributeTable/Widget",
        "position": {
          "relativeTo": "browser"
        },
        "version": "2.17",
        "id": "widgets_AttributeTable_Widget_13",
        "name": "AttributeTable",
        "config": "configs/AttributeTable/config_widgets_AttributeTable_Widget_13.json"
      },
      {
        "uri": "widgets/Splash/Widget",
        "visible": false,
        "position": {
          "relativeTo": "browser"
        },
        "version": "2.17",
        "id": "widgets_Splash_Widget_14",
        "name": "Splash"
      },
      {
        "uri": "widgets/ZoomSlider/Widget",
        "position": {
          "top": 5,
          "left": 7,
          "relativeTo": "map"
        },
        "version": "2.17",
        "id": "widgets_ZoomSlider_Widget_15",
        "name": "ZoomSlider"
      },
      {
        "uri": "widgets/ExtentNavigate/Widget",
        "position": {
          "top": 190,
          "left": 7,
          "relativeTo": "map"
        },
        "id": "widgets_ExtentNavigate_Widget_16",
        "name": "ExtentNavigate",
        "version": "2.17"
      },
      {
        "uri": "widgets/FullScreen/Widget",
        "visible": false,
        "position": {
          "top": 150,
          "left": 7,
          "relativeTo": "map"
        },
        "version": "2.17",
        "id": "widgets_FullScreen_Widget_17",
        "name": "FullScreen"
      }
    ],
    "panel": {
      "uri": "jimu/OnScreenWidgetPanel",
      "position": {
        "relativeTo": "map"
      }
    }
  },
  "map": {
    "3D": false,
    "2D": true,
    "position": {
      "left": 0,
      "top": 40,
      "right": 0,
      "bottom": 0
    },
    "itemId": "f357738175f445098277d0771984eb08",
    "mapOptions": {},
    "id": "map",
    "portalUrl": "https://vente.shsconsultores.es/portal",
    "mapRefreshInterval": {
      "useWebMapRefreshInterval": true
    }
  },
  "widgetPool": {
    "panel": {
      "uri": "themes/FoldableTheme/panels/FoldablePanel/Panel",
      "position": {
        "top": 5,
        "right": 5,
        "bottom": 5,
        "zIndex": 5,
        "relativeTo": "map"
      }
    },
    "widgets": [
      {
        "name": "BasemapGallery",
        "version": "2.17",
        "uri": "widgets/BasemapGallery/Widget",
        "config": "configs/BasemapGallery/config_widgets_BasemapGallery_Widget_26.json",
        "index": 2,
        "id": "widgets_BasemapGallery_Widget_26"
      },
      {
        "uri": "widgets/Legend/Widget",
        "version": "2.17",
        "id": "widgets_Legend_Widget_18",
        "name": "Legend",
        "index": 3,
        "config": "configs/Legend/config_widgets_Legend_Widget_18.json"
      },
      {
        "uri": "widgets/LayerList/Widget",
        "version": "2.17",
        "id": "widgets_LayerList_Widget_19",
        "name": "LayerList",
        "index": 4,
        "config": "configs/LayerList/config_widgets_LayerList_Widget_19.json"
      },
      {
        "name": "AddDataCategories",
        "version": "2.17",
        "uri": "widgets/AddDataCategories/Widget",
        "config": "configs/AddDataCategories/config_widgets_AddDataCategories_Widget_28.json",
        "index": 5,
        "id": "widgets_AddDataCategories_Widget_28"
      },
      {
        "name": "Edit",
        "version": "2.17",
        "uri": "widgets/Edit/Widget",
        "index": 6,
        "id": "widgets_Edit_Widget_25",
        "config": "configs/Edit/config_widgets_Edit_Widget_25.json"
      },
      {
        "name": "Filter",
        "version": "2.17",
        "uri": "widgets/Filter/Widget",
        "index": 7,
        "id": "widgets_Filter_Widget_24",
        "openAtStart": true,
        "config": "configs/Filter/config_widgets_Filter_Widget_24.json"
      },
      {
        "name": "InfoSummary",
        "version": "2.17",
        "IsController": false,
        "uri": "widgets/InfoSummary/Widget",
        "config": "configs/InfoSummary/config_widgets_InfoSummary_Widget_27.json",
        "index": 8,
        "id": "widgets_InfoSummary_Widget_27"
      },
      {
        "name": "Print",
        "version": "2.17",
        "uri": "widgets/Print/Widget",
        "config": "configs/Print/config_widgets_Print_Widget_20.json",
        "index": 9,
        "id": "widgets_Print_Widget_20"
      }
    ],
    "groups": []
  },
  "mobileLayout": {
    "widgetOnScreen": {
      "widgets": {
        "widgets/Scalebar/Widget": {
          "position": {
            "left": 7,
            "bottom": 40
          },
          "version": "1.4"
        },
        "widgets/Coordinate/Widget": {
          "position": {
            "left": 7,
            "bottom": 17
          },
          "version": "1.4"
        }
      }
    }
  },
  "loadingPage": {
    "backgroundColor": "#4b4a4a",
    "backgroundImage": {
      "visible": false
    },
    "loadingGif": {
      "visible": true,
      "uri": "configs/loading/images/predefined_loading_1.gif",
      "width": 58,
      "height": 29
    }
  },
  "wabVersion": "2.17",
  "isTemplateApp": true,
  "isWebTier": false,
  "httpProxy": {
    "useProxy": true,
    "alwaysUseProxy": false,
    "url": "",
    "rules": []
  },
  "dataSource": {
    "dataSources": {},
    "settings": {}
  },
  "logoAlt": "Cabildo de Tenerife",
  "logoLink": "https://www.tenerife.es/portalcabtfe/es/"
}