{
  "serviceURL": "https://vente.shsconsultores.es//server/rest/services/Utilidades/ServicioImprimirVENTE/GPServer/Exportar%20mapa%20Web",
  "defaultTitle": "VENTE 2.0",
  "defaultAuthor": "Cabildo de Tenerife",
  "defaultCopyright": "",
  "defaultFormat": "PDF",
  "defaultLayout": "A3 - Horizontal",
  "copyrightEditable": true
}
