{
  "name": "Edición - Priorización y planificación presupuestaria de senderos",
  "description": "Edición - Priorización y planificación presupuestaria de senderos VENTE 2.0",
  "createdTime": 1616747635860,
  "lastUpdated": 1618488487622,
  "creator": "siteadmin"
}