[api-updater (non-obsolete-error-filter)] 20/11/2021 17:36:04 : Starting D:/Unity/2020.3.7f1/Editor/Data/Tools/ScriptUpdater/APIUpdater.NonObsoleteApiUpdaterDetector.exe
[api-updater (non-obsolete-error-filter)] 
----------------------------------
jit/startup time      : 4522,7055ms
moved types parse time: 206ms
candidates parse time : 1ms
C# parse time         : 1126ms
candidates check time : 131ms
console write time    : 12ms

[api-updater (non-obsolete-error-filter)] 20/11/2021 17:44:13 : Starting D:/Unity/2020.3.7f1/Editor/Data/Tools/ScriptUpdater/APIUpdater.NonObsoleteApiUpdaterDetector.exe
[api-updater (non-obsolete-error-filter)] 
----------------------------------
jit/startup time      : 332,1489ms
moved types parse time: 59ms
candidates parse time : 1ms
C# parse time         : 255ms
candidates check time : 54ms
console write time    : 0ms

[api-updater (non-obsolete-error-filter)] 20/11/2021 17:45:33 : Starting D:/Unity/2020.3.7f1/Editor/Data/Tools/ScriptUpdater/APIUpdater.NonObsoleteApiUpdaterDetector.exe
[api-updater (non-obsolete-error-filter)] 
----------------------------------
jit/startup time      : 356,2125ms
moved types parse time: 58ms
candidates parse time : 1ms
C# parse time         : 247ms
candidates check time : 55ms
console write time    : 0ms

[api-updater (non-obsolete-error-filter)] 20/11/2021 18:10:19 : Starting D:/Unity/2020.3.7f1/Editor/Data/Tools/ScriptUpdater/APIUpdater.NonObsoleteApiUpdaterDetector.exe
[api-updater (non-obsolete-error-filter)] 
----------------------------------
jit/startup time      : 415,2473ms
moved types parse time: 58ms
candidates parse time : 1ms
C# parse time         : 228ms
candidates check time : 46ms
console write time    : 0ms

[api-updater (non-obsolete-error-filter)] 20/11/2021 22:35:17 : Starting D:/Unity/2020.3.7f1/Editor/Data/Tools/ScriptUpdater/APIUpdater.NonObsoleteApiUpdaterDetector.exe
[api-updater (non-obsolete-error-filter)] 
----------------------------------
jit/startup time      : 4544,8371ms
moved types parse time: 217ms
candidates parse time : 71ms
C# parse time         : 901ms
candidates check time : 77ms
console write time    : 9ms

[api-updater (non-obsolete-error-filter)] 20/11/2021 22:38:01 : Starting D:/Unity/2020.3.7f1/Editor/Data/Tools/ScriptUpdater/APIUpdater.NonObsoleteApiUpdaterDetector.exe
[api-updater (non-obsolete-error-filter)] 
----------------------------------
jit/startup time      : 89,9604ms
moved types parse time: 57ms
candidates parse time : 1ms
C# parse time         : 243ms
candidates check time : 54ms
console write time    : 0ms

[api-updater (non-obsolete-error-filter)] 20/11/2021 22:38:06 : Starting D:/Unity/2020.3.7f1/Editor/Data/Tools/ScriptUpdater/APIUpdater.NonObsoleteApiUpdaterDetector.exe
[api-updater (non-obsolete-error-filter)] 
----------------------------------
jit/startup time      : 91,3853ms
moved types parse time: 60ms
candidates parse time : 1ms
C# parse time         : 248ms
candidates check time : 56ms
console write time    : 0ms

[api-updater (non-obsolete-error-filter)] 20/11/2021 22:40:09 : Starting D:/Unity/2020.3.7f1/Editor/Data/Tools/ScriptUpdater/APIUpdater.NonObsoleteApiUpdaterDetector.exe
[api-updater (non-obsolete-error-filter)] 
----------------------------------
jit/startup time      : 90,2049ms
moved types parse time: 56ms
candidates parse time : 1ms
C# parse time         : 245ms
candidates check time : 57ms
console write time    : 0ms

