382

2:40 234

AL 227

243 234

2:46 2

od Bat

3:13 ied

3:13-15a Bd

4at 224

44 227
4:25 249

4:32 234

5:21 Bet

5:30 14

7351-52 240

752 4

&1 174,226
10 22
1033 138

W Bet

ne 226
11:26 2980
12:7 185, 188
13:5, 14 221
13:50 m2
1 221
1425,19 999

B 221

15:2 16, 174,226
15:21 221
Wl 221
175 223
17:7 159, 14tn
17:15 138
18:2 2980
18:4, 7, 19, 26 221

18:8 227

19:8 a1
20:29 328
21:20,22 27
21:26 a1
22:18 185, 188
22:19 a1
211 a1
2412 a1
25:4 135
26:11 a1

BEFORE JERUSALEM FELL

26:18
26:21
26:28
28:23-24

 

1 Corinthians
1:5
3:16
46-8
48
619
7:26
7:29-31
7:29-31, 86

10:11
10:32
11:25
13:1

16:17

2 Corinthians
5:19
616
8:9

10:5

Galatians

16-7
117, 18

21,2

3:27-29
3:29
424
5:7

2280
221
298n
227

142n, 285n.

88

86,88,89

185, 188,142n

174
$22
320

235n
235n
142n
278
185n
143n
M43
320
179

14

337
