282 ‘Tue Dispossessep

 

1 Corinthians 1 Thessalonians
1:20 a 15 194
a1 231
2:3 231 2 Thessalonians
a4 231 3:10 195, 214
212-14 67 315 35
521-13 195
6:11 192 E Timothy
6:20 149 412 65
7:22 209 5:8 215

11:23-34 210 5:9 81, 261

11:27-30 195,

15:57 227 2 Timothy

4:7 194

2 Corinthians 2:24 209
1:3-5 194 3:19 196-97
14 205 3:9 197
5:7 228, 232, 242 3316-17 66, 67
5:20 205 4:10 214
10:3-5 231, 232

W1:14-15 161 Titus

435, 199

Galatians 1:12 198

+ 1:13 199
ae i” 1:16 199
6:7 241 3 199
2:2-10 199
25 80, 199
2:7 199
ha 2:10 199
8 211-14 198, 199, 217
194 2:14 149
217 2:15 199
192, 198 31-2 199
198, 218 3:1 199
190 3:8 199
: 205 3:12:13 199

6:10-18 231 att 199

Philippians Hebrews

2:5-9 207-08 3:1 193

2:12-16 193 4:16 194

212 67 6:12 34

3:20 194 tt 228

4:13 228 11:2 228

12:1-2 194

Colossians 12:18-24 193-94

312 219 12:28 229

412 209 13:8 94
