384 BEFORE JERUSALEM FELL

17 118 65-6 243
at9 141, 142 610 139, 164,201
2 15, 115 610,11,17 1840
23 42,189 611 91
2:3,18 262 612 107
24,5 926 6:16 130
235,16 330 7 148, 174n, 212,985
2:5, 16,25 122, 193n, 142 nA 107, 108, 118
236,15 929n 7-7 248
28-11 822,828,824 71-8 232
29 148,222, 225,829 79 238
2:9, 14 212 72 107
2:9,10,16 148 7 107, 108
2:10 91, 150 74-8 116, 228, 225
216 188, 184 79 128
2:22 201,284 7:9,18,14 148
3 1,115 7 134n, 234
S:le-2 326 8 240
32 43 82 1B
3:3, 10 330 8:13 1340,
3:3, 11,20 128,142 9 240
38 262 91 118
39 148, 212, 222,225, 829 91-3 247
3:10 91, 188, 141, 142, 148, 9:1-12 10, 247
143n, 160, 164, 233n 93 91
311 184,141 o4 247
3:12 91 9:5, 10 2AT 248
3:15-18a 986 9:5-10 7
3:17 319,820,822 9:11 210,224,247, 829n
3:14 210n 9138 wT
4 163 10:1 us
41-225 $48 10:4 48
41-226 188 10:4,9,10 118
41, 2 18 106 184
411 2 10:11 9
51,6 18 u 16, 115, 165, 175, 181,
St 18 286, 24Q,240n
55 127 ul 165, 166, 174, 174n, 175,
59 128 16
6 115, 240, 240n Ha, 2 118, 165, 166, 167, 175,
611 9 236,248
619 238 inbg 205
6:1 18 LL-13 167
68-4 241 Lih-14 165
64 217,242 11:2 165, 176, 286,247, 2470.

69 238n 11:2b 176
