Scripture Index

New Testament

Matthew 17:27
5:5 227 21:20-21
5:10 267 21:28
53 132 22:24-30
5:48 64 22:24-30
6:10 274-275
6:24 51 John
715-20 249 1:8
10:28 g 3:27
11:30 228 3:35-36
12:30 51 5:21
12:36 xiii 5:24
13:13 143-44 7:37
13:30 265 10:10
13:24-30 296 11:14
13:33 83, 274 14:15
13:36-43. 296 15:10
13:39-40 235 15:13
16:24 162 16:7-11
21:43 130
22:41-46 141 Acts
23:11 333 1:8
24:32-39 129-130 ll
25:31-385 262 10:34
25:31-34 16 13:48
25:31-35 265 16:14
27:46 ll 18:3
28:11-15 234 25:11
28:18 297
28:18-20 26, 71, 275 Romans
211
Mark 2314-15
9:49 132 4:17-25
13;9-11 215 5:1-9
13:10 217 5:7-8
5:20
Luke 7:14-25
3:22 62 8:28
6:43 187-188 8:29
12:45-49 138 9:15-16
14:28-33 64-65 9:20-24

371

127
137
137
210
215

218
67
7
66
x
100
xii
103
xiii
xiii, 327
215
282

327
257
175
66-67
67
319
188

175
187
62
63
215
203
67-68
154
162
67
223
