Scripture Index 327

1 Corinthians Philippians
2:16 176 215 221
3 225 3:20 258
3:8-15 it
39 221 Colossians

til 151 116-17 26

11:32 221 7 31

15:13-17 ix, 69 2:8 221

151417 xi 3:2 258

15:24-25 160

15:24-26 261 E Timothy
15:25 220 4:10 994
15:26 100
15:27 278 Hebrews

; 9:15-23 163

HT Corinthians 11:6 141
5:17 132
5:19 220 1 Peter
710 22 3-7 226

Galatians
43 221 iH Peter

2:5 222

Ephesians 3:10 222
14-5 157, 224 ou 274
1:47 Gt
14 iit J john
1:19-22 278 1:8-9 153
2:2-3 221 3 221
246 145 44 222
2:8-10 154 45-6 221
5:16 308 5:19 221
5:22-33 226
5:25-27 149 Revelation
5:26-27 154 12:9-11 4

20:7-10 260-61, 267

Philippians 22:3 166

2:12 224 22:20 160
