194
410

Hebrews
12
1:3
9:15-16.
9:22-10:7
1025
1087
12:22

James
AL
5:8-9
5:17

1 Peter
29

45
47

2 Peter
1:19
1 John

217-18

Revelation
1:1

1aa

The Beast of Revelation

180

xiy
121

xiy-xv
210

210
121,133

1380
270

120
1830
270
2

xvi
24, 133

270

1830

10, 13, 21,22, 28,24, 76,
100, 114, 184

10, 14,22, 25,89,76,100,
114, 18

8

La

16
17

1:9

18a

10,15,22,24,76,86,176,
19

120
26,27,88,89,92,94,96,
98, 100, 114, 128, 186

18, 47, 48, 62n, 77, 81,
85,99, 104, 147

24,48

10, 15,22,24,76,86, 179
10, 14,22,28, 114, 184
24,85, 181, 175

a

19

26,88, 181

18,25

178

88, 181, 182, 181, 186
18,48,85

18,25

88

22, 28, 25, 26n, 88, 167,
1

18,25

85

89

18,25

24,85, 181, 175

19

89, 181

18,25

88, 128, 181, 181, 186
13, 14,22,25,48,86,114,
181, 184

22,28 258 26n, 88

18,25

88

179

176, 177
