174
Joshua

AT Chronicles
7:13-14
30:13-31:1

Job
Usil

Psalms

1
a3
9431-23

Proverbs
1:10-19
3:11-12

46

59
58
59
Hn?
117

130
131

31

153
153

136
145

33
38
37
61
102

142

 

 

Who Quns the Family?
24
35
47
ay
21
23:13-14 47
Song of Sotomen
if 74
139
17
32
22
Jonah
3:4 145
Zechariah
46 33
Malachi
2:14 8
NEW TESTAMENT
xxi
151
152
20
103
9

 
