AY ROR OZEC ASE Dome

OVERVIEW OF REVELATION

. Babylon: The Great Harlot (17:1-5)

. Babylon: The Mystery Explained (17:6-18)
. Babylon Is Fallen! (i8:1-8)

. Reactions to Babylon's Fail (18:9-20)

Babyion Is Thrown Down (18:20-24)

The Marriage Supper of the Lamb (19:1-10)
The Rider on the White Horse (19:11-16)
The Feast of the Scavengers (19:17-18)

. The Destruction of the Beasts (19:19-21)

The Binding of Satan (20:1-3)

The First Resurrection and the Last Battle (20:4-10)
The Final Judgment (20:11-15)

The New Creation (21:1-8)

The New Jerusalem (21:9-27)

The River of Life (22:1-5)

Come, Lord Jesus! (22:6-21)

47
