Numbers
35:9-15
35:12

Deuteronomy
1:4-4

 

Scripture Index

181
261

226

16, 21, 24

27, 120, 238, 255
17, 44, 46, 120
42, 47, 53, 54

49
49

81

53

15, 16, 25, 59, 214
50, 217

220

130, 209

220

53

108

59, 60, 62, 63, 65, 121
63

17

 

Deuteronomy

10:5 215
10:20 144
11:22 144
12:1 - 13:18 64
62
144
: 189
14:1-29 64
64
263
263
163
64
263
61
131, 212, 215
164

 

61
61, 189
206
64
181
261
189
101
189
21:22 181
22:13 - 23:14 64
22:23 181
22:25-27 18
23:2, 3 409
23:8 109
23:15 - 24:22 64
25:1-19 64
26:1-19 64
27-28 17, 285
27-30 7,77
27:1 - 30:20 78, 83
276-7 84
27:15-26 79, BF
28 219, 264
28:1-14 52, 78
28:12 277
28:15-68 78
28:30 143,

28:38-40 126
28:58-61 264
28;60-68 234

325
