Scripture Index 327

 

Judges J Samuel
11:9 221 13:8-14 227
13 308 13:19-22 983
14-15, 56 14:2 88
16:23. 223 14:18 144,
16:27 233 14:38 148
17-18 197 307
17:6 221 224
17:7 203 185,
18:1 221 102
19:1 203, 221 224
19:21 101 204
20:2 148 20:31 184, 186
21:25 221 21-2 Sam, 2 183
Qh: 225
‘Rath 2131-6 308
2:10 251 21:13 184
4 307 22:2 185
4d 88 22:6 Bs
P1119 25
22:20 225
308 23:13 307
182 24:2 307
222 25 185
71 25:13, 307
224 7 184
224 29 184
86, 222 30 308
225, 30:5 184
184, 223
112, 306 2 Saruel
183, 185 1:23 99
186 5:4 307
186, 5:11-12 75
185, 6:2 112, 306
224 6:3-7 142
186 112
14 237
233 227
233 227
224 227
224, 234 158
224 224
rel 307
159 141
224 99
224 90
224, 227 97
224 307
226 86, 268
224 a
307 146.

  
