Index ANS

fear, 134, 283
FEE, 2

Ferguson, Marilyn, 99, 366
fertility religion, 101, 345
fever, 179

fibers of power, 150
Findhorn, 101, 102

final judgment, 151, 209, 215, 327-28,

334, 343

finger operations, 256

finitude, 335

fireball, 50-51

fires, 51

fire walking, 65, 161

fish, 46, 66, 81

fish (grunion), 84

“flaps” (UFO's), 293, 295-96

flying saucers, see UFO's

folklore, 160, 315

folly, 139-40, 154

Fonda, Jane 366

“foo fighters,” 294

force, 45

foreign aid, 276-77, 287

form/matter, 29-30

Fort, Charles, 54, 245

Foundation for Economie Education
(FEE), 2

Fourier, Charles, 306

Franklin, Ben, 352

fraud, 194, 228-29, 235, 244, 248,
250, 260, 263, 267

freedom, 29

free gaads, 363

free will, 60

Freud, 22, 46, 56, 355

Freudianism, 112-14

friendship, 398-99

fringe, 374-75

fringe groups, 369-70

fundamentalists, 386, 393, 394

future, 67

future-orientation, 275, 281, 344,
348, 386

Gaiken, M. K., 100
garage door, 107

gardening, 101-2
Gauquelin, Michel, 77-82
genie, 264
Germany, 294
Gernreich, Rudi, 7
ghetto, 348
“Ghostbusters,” 11
ghosts, 44-48, 75, 98, 142
ghost stories, 143
gnosis
Castaneda, 135, 140, 142-43
Cayce, 202-25
gnostic, 183
gnosticism, 27, 60, 173, 216, 225,
335, 339, 341-43
God
covenant, 369
creation, 28, 210
creator, 41, 59
Greator-creature, 61, 63, 66,
210, 335
divinity of, 63
faith in, 157
future &, 67
grace, 62
“inconvenience,” 47
Judge, 41, 45
knowledge, 28, 57
law of, 373
noumenal realm, 44
plan of, 39
providence, 26, 45, 59-60
replacing, 368
revelation, 39
saved by man, 63
shoved out, 32, 45, 76
sovereignty, 39, 60, 369
spoke, 210
“tonal,” 149
union with, 335
vibration?, 221
gold, 337
grace, 32, 62, 64
Great Society, 11
Greeks, 29-30
Greenland, 289
Gross, Henry, 94
