308 Paradise Restored

Ephesians

  

5:14 134
6:10-17 73
6:10-18 213

Philippians

”
TA, 197

1

108

196

42, 72, 168, 198
108, 116

146

3:10 24

 

1 Thessalonians

1:10 419
81, 149, 183
160
143

 

2 Thessalonians

1:6-10 120
104
113
17

 

f Timothy

 

Titus
1:10-16

Hebrews
1:2
1:3
2:6-9
214
3-4
3112-14
6:4-8
BL
8:5
8:13
o4
9:11
9:23-24
9:26
10:12
10:19
10:19-39
10:25
10:27
10:30-31
10:36-39
1:10

108
108
108, 115
115
134
108

24
108
