Scripture Index

 

Proverbs
2:21-22 34
10:30 34
Us 35
13:22 36, 55
14:34 220
20:10 35
20:23 35
28:8 36
Ecclesiastes
2:26 36
Song of Solomon
412, 29
Isaiah
1:22 35
32
32, 121
6, 137
194
290
59, 60
7
57
6
6
40
25, 32, 46, 131,
200, 218
11:10 135
13:6-13 137
13:9-10 99
14:13 29
17:12 177
19:1 102
19:24-25 131
2411-6 24
25:6 62
25:6-9 32
27:1 a2
27:6 30, 44, 208
28:11-19 118
30:7 4)
30:26 134

32:13-15 46-47

Isaiah
32:13-17
32:15-17
34

34:4
35:1
351-2
35:9
40:3-5
40:4-11
41:17-20
42:1-12
42:4
45:22-23
49:1-2
49:5-13
49:6
31:3
51:9-10
S4:11-12
5413-17
56:3-8

011-3
60:1-22
60:3
60:4-16
60:4-18
O54
60:9
60:11
60:19-20
61:1-11
62:1-12
65:1-25
65:13-25
65:17-25
65:20
65:25
66:1
6621-24
66:3

Jeremiah
1:4
23

301

34, 207
207-08

6, 32

187

177

134

208

6

32

30

208

34.35

38

35

208

6

6

6

51

46, 203-04
224

32, 40, 42
60, 135

6

91

179
187
