396

F Corinthians
14:11
15:20

 

HL Corinthians
3:3
3:17
5:24

Galatians
3:16-17
4
5:6
6:16

Ephesians
1:45
6:12
6:10-18
6:17
6:20

Philippians
1:22-26
2:9-11
2:12b
3:19

Colossians
2:15b

Rebrews
4AQ
7:26-28
8:7-13.
B:B-114
8:9-11

MOSES AND PHARAOH

138
171

161, 163, 171, 251
186

157-58

158

247

157n
255
282

13

252
252
153

181
156
154
154
153

259
183-84
263
257

156

154
251-52
187
236
236

Hebrews
8:10
8:10-11
9
9:4

10:9

11:9

11:24

11:24-27

11:28

T Peter
1:18-19
1:24-25

IT Peter
3:8
3:9b
3:9-10
3:10

Revelation
3:16
10:9-10
12:5-6
12:13-14
1217
20
20:3
20:7-8
20:9
20:9-10
20:12-14
20:12-15
20:14
20:14-15
at
21:10-21
21:25
22
22:1-3

1570
298
158
157, 279
247

71
70
143n,

250n
266

154
170
170
170

357,
168

382

382

382

186

173

158

167, 173

158

151

158

136, 167
136, 247, 378
136, 175
379

379

136, 175

383
