Matthew
12:36
13;3-8
13:24-30
13:33
14:15-20
15:22-28
18:15-20
20:13
20:15
21:43
25:14-30
26:26
26:38
26:41
27:35
27:51
27:52-53
28:2
28:18
29:18

Luke

3:38

4:18-19
10:1
10:17
11:20
12:47-46
21:20-24
22:14
22:29-30
241

John

1:14

1:18

3:19
15:13
16:336
18:28
19:30
20:22

208
267

267

160

278

10

204

118

118

154

5

171

378

378

252

378

42n, 165
379

5, 158
153

191
247
278
12n
12

105
205
379
153
153
251

168
247
247
358
167
153
163n
168
163

Scripture Index

Acts

2

5:29

7

7:6
7224-25
13:33
22:3

Romans
14
1:18
2:11-12
2:12
2214-15
3:23
5:13-19
7
7:23
8:18-23
8:19-22
8:29-30
9:7-8
9:10-24

i

11:11-17

11:17-27

11:23-32

122k

12:26

13:1

13:1-7

14:12

16:20

F Corinthians
3:6
S115,
3:1-5
3:6-8
57
6:1-10
7:24-22
10:17
11:24
£2:12-14
12:12-27

395

163

136
13, 14

247
159

138

241, 237
236

153

236, 237
282

182
236-37
156

149
181
24

175
194
382
267
382
168
173
205
359
205
154

264
205
172
163, 172
153
204
259
163, 169
163
171
163, 168
