666

Hosea

Joel
2:10

Micah
4:1-4
4:4
6:6-8
6:9-12
6:16
7:2-3

Zechariah
14:5

Nahum
1:15

Habbakuk
2:4

Malachi
1:8
1:8-12
1:12
4:5-6

Matthew
5:5
5:17-19
5:21-48
5:31-32
5:41
5:43-48
5:45
6:12

LEVITICUS: AN ECONOMIC COMMENTARY

64-65
184

415
449
42,328
317
317
316

184
184
XXxi

5]
129
129
584n

411

xxi

280n, 654n
280, 654
81

550

191, 349
55

6:19-20
71
O17
W:19
11:30

 

25:34-40
25:40
25:45
27:21
27:51
27:62-66
28:18-20

Mark
8:36
8:47-49

Luke
2:46
4:16-21
47-19
4:18-19
4:18-21

 

56

261

158, 567
163

8!

244

220

8&5

220

83

84, 132
2440
280

156
103, 187, 207,
552n, 609, 610,
647

97,

196

313

375

375

129

184
105n
612, 634

81
68, 647

154

647

640

392, 654

426, 454, 469,
511, 514, 534,
