 

22:13
2214-15
22:16-17
22:19
22:28
22:21-24
22:24
22:25
22:25-27
22:26
22:27
22:31
23:1
2311-3
23:2
23:3
23:4
2324-5

23:6
23:6-7
23:7
23:7-9
23:8
23:9
239-12
23:10
23:10-11
23:10-19
23:12
23;14-19
23:19
23:20-33

 

Scripture Index

458, 777, 781, 1106

541, 563, 634, 1116

1045, 1149

393, 1045

608, 632, 615

614, 634

1045, 1050

537-38, 614, 627, 633

635, 636-37

608, 610, 611, 615,
619, 632

619

618, 630, 635

636, 640n

551, 638

642, 648

318

992

130, 668, 705, 706

679, 669, 670

709

705

597, 686

708

9540

759

757, 827

759

759, 785

699, 790

759, 767, 774, 778,
780, 827

759, 785

757, 778, 827

7599

680, 768

759, 785, 793, 827

669, 785, 827, 992

e11, 817

819

827

152

827-28

93, 826, 893

827

93

Exodus
23:24-26
23:25
23:25-26
23:26
23:27-30
23:29
23;29-30
23:32-33

 

973
859, 867

849, 856, 858, 863
977

961

777

859

96f

93

877

1008

992

804n, 903, 907, 912
148-49, 150, 843n
656

920

152, 811, 879
318

301, 313n
315

883

880, 881

880

661n

884

884

895

827

608-9

153, 811

913, 915, 918
885

885

885

885

B85

919

885

885

885

1219
