 

 

 

 

 

 

 

 

 

 

 

 

 

 

 

 

 

 

 

 

 

 

 

 

 

 

 

 

 

 

 

 

 

 

 

 

 

 

® ' ' ' : ' 2
o ‘ 1 . 1 ‘
BeAaiemrm mA ot'amecadciac <ae0;Aof
. . ae
g : ; / o« | B &

Bisel see seseisaaa! da Baal on

2 & 5

3s * ‘fe ‘TS ‘To ‘tT : ‘fe

ar) (le co © Ley 1 hes = fa pte!

;fA& » fe 1 [os [ed on 1 [os

& 5

gS FAs meet maAaA < ot A mad ti <a

s < «

2 8
Sees, od dt, oes e Saaigasel oa
& i i 3 ; :

* [-. > Ts ' [> > | To : >
|e 1 | xt iad BS 11 a
EX le ‘TN “ cla 1 [aN
