THE DAYS OF VENGEANCE

1 Corinthians Galatians
&4 1082 ze
108

a0

123
384
281, 449

133
205, 206
235
13L

Sa
149, 298, 570
136

 

 

Ephesias

99, 133, 568
1h

103, 463

122, 206

132, S25

542

267

3000

$42

323,

70, 475, 533

81, 553

390

5 578

123 2 102
: 318, 332, 545

345

314
330

(17n, 143, 332

30, 64, 89, 139,
284, 318, 510,
518

 

47
ao
104
120, 125
412
104
SIT
64, 89, 149, 284,
8, 332, 484,

510, 514, $18
$33, 623
196, $33,
265, 463, $45
463 139, 312, 317,
545, $46 502, 503
272, 291, 336 $42
310 117n, 517
546 340
448
54
265
265
231, 318
2
1
$02
28n, 509

 
