SCRIPTURE INDEX

Old Testament

Genesis 21:28-32 113
1 72 22 76
1:26-28 345 22:1-9 15
3:5 189 22:8 77
3:19 284 22:18 107n
Q:1-17 147n 22:18-19 114
9:6 147, 152, 156 22:22-24 144, 145
14:17-20 179 22:25-27 77, 102n
17:14 189 23:9 238
19:5-9 102n 28:5-6 284n
38:7 272 39:29 284n
38:20 272
46:12 272 Leviticus
49:10 273, 305 3:45 277
6:10 283
Exodus 10:8-11 175
12:48 189 13:4748 284
12:49 24 16:30-34 283
13:2 277 18:3 191n
19:6 256 18:6-28 102n
20:1-3 63, 181 18:21 276
20:4-6 102n 18:21-80 191n
21:16 77 18:22 102n
21:17 151 18:23 278
21:22-23 102n 18:24-27 77, 181

21:22-25 75 18:28 287
