Acts
31-11
8:37-38
10
12:21-23
20:27
23:29
24:5-6
25:1-2
25:7
25:11
25:20
25:24

Romans
1:18
1:18-21
1:20f

 

 

THEONOMY: AN INFORMED RESPONSE

299
151-153
242
183
307
299
160

242
274
293
100
296
159
158
158
158
152, 157-150
160
159

154, 155
102
157
101
19in
156
154
44

53

157
153-57
139
156
148

44

2:14-15
2:15
2:17-20
3:1-2
3:9
3:19
3:19-20
3:20
3:23
3:31
4:16
6-7
6:4-11
77
7:9-25
TAZ

8

8:3-4
8:4

8:7
8:17
12-13
12:17
12:17-19
12:17-13:10
12:19
12:21
13:3-4
13:4
13:10
13:1-7
18:2
13:3-4,
13:4
13:4, 6
13:8
13:8-10

102
53
109
44
77, 102
156, 181
102
299, 306
102
156, 176, 299
184
228
227
306
227
139, 143, 156,
172, 176, 178
229
156
155, 305
143
228-29
139
137
138
137
138
138
154
249, 250
240
81
138
152
138, 150
138, 351n
305
299
