300

1 Chronicles
28:2

2 Chronicles
3:1

 

4-7

Nehemiah
8:13-18
9:19-20

 

 

40, 183

Paradise Restored

Psaims
50:10
55
57:1
59

95:11

97:1

99:7
104:3
104:26
105:39
105:43-45
107:1-9
109
110:1
110:6
115:3
132:7-8
132:13-14
135:6
137:7
138:4-5
140
148:7
149:5-9

199

216

59

216

59

9, 208

57, 59, 199
