“7
2:21-22
10:30
13:22
14:34
2u:17

Ecclesiastes
2:26
5:8

Isaiak
1:21-23
2:2-4
B12
9:1-7
9:2-7
936-7
9:7

it

141-5.

11:9

14:14

30:17

31:3

34:4

35:5

44:9-20

45:5-7

52:5

55:9

57:19

60:22

61:2

68:17-25

feremiah
1:10
1:18

16:12-13

16:15

Scripture Index

Jeremiah
87 17:9
26 23:23-24
26 29:11
26 31:27-34
340 31:31
140 92:24-44
92:27
46:47-51
49:28-33
%. 49:34-39
Ezekiel
36:26
201
220 048
131 Daniel
243 1:2
168 1:5
154 23
214 2
71 2:2
161 2319-45
xacxvil 2:31-34
8 2344-45
40 2:44
152 4:17
xxiv 4:28.37
162 4:34-35
133 4:34
215 5:21
210 6
71 713-14
276 8:14
40
161, 162 Hosea
115-17 510-14
Joel
225 2:28-32
225 ;
274 Micah
175 39

87

71

275
125
275
275
152
275
275
275

226
39

112, 113
u3

121

109

22

114

168

168, 242
114

354

272

158, 215
208

22

196
211, 354
62

325

158

325

381
