SCRIPTURE INDEX

OLD TESTAMENT
Genesis

204 18:19 165
72, 157, 184, 185, 18:23 55

186, 194 18:25 55
162 18:28 55
127 18:32 55
29 19:4-5 94
29 19:14 55, 56
185, 186 24:67 xvii
40 25:2 xvit
170 41:38-49 124
29, 40, 44
164 Exodus
44 1:8-14 124
44 1285-22 103
44 1:31 124
44 3-15 106
55 3:14 75
44 3:22 75
55 5:20-21 xvi
44 15:20-21 133
44 16:3 7
44 18 31, 35, 101
124 18:13 75
30, 54, 185 18:16 al
185 18:17-26 140, 188
29 18:17-27, 0 211
30 18:19-20 42
54 18:20-21 36
54 18:21 46, 74, 112, 139
86, 94 19:3 205
196 19:5 205

 

243
