664, LEVITICUS: AN ECONOMIC COMMENTARY

6:19 462 II Kings

8 101, 248 2:23-24 574

8:15 18-19, 103, 110, 5:1-2 165n
365 5:2 185

8:17 11 6:24-30 575

9:22 76 17:6-8 572n

14:45 257 20:1-6 545, 546

15 592 22:46 xxiv

15:21 584 23:7 xxiv

16 592 23:21 xiii

17:52 125

18:25 340n I Chronicles

24:1 456 12:3-6 505

II Samuel II Chronicles

2:13-14 76 26:21 172

8:2 64 28:3 526

8:6 64 31:5 152

12:72 377 35:13 44

15:2-6 258 36:17 312, 50]

24 90n 36:19-21 576

24:15 95n, 456 36:20-21 397

24:24 50 36:21 20, 312, 366,

447, 454, 456

I Kings

11:5 325 Esther

WL:7 325 3:7 356, 409

12:25-29 12

12:32 12 Ecclesiastes

14:24 xxiv 9:2 192

17:1 574 9:7 161

17:14-15  459n 12:12 xl

18:21-22 0 xx

19:15-18 544 Job

20:23 333n 2:9 373

20:28 338n 31:6 321
