Index

exploitation, 156

exploitation theory, 119-124

faith in revolution, lxxit

faith of, 55

fall of man, 39-40

Faust &, xxi

final society, 101

fragmentary tegacy, liv

frantic reading, xx, fii

freedom, 66

Golden Age, 49, 73-74, 78-79, 88,
99, 101

gradualism, 133

graduate student, xxix

Halle on, xxiv-xav

history, 62, 67-69, 88-90, 169

hoarding, 139-140

bome (1864), 252-253

humanism, 30-33

ideas, 48

importance of, xxxi-xxxii, xl, xiii,
Ini, 4, 18

income, 1840's, 243-245

indeterminism, 62-63

Industrial Reserve Army, 132-133, 135

industrialism, 38

inevitabitity, 62, 97, 98

inheritances, 249-251

investor, 282, 252

job hunting, 248

journalism, xl-xii, v

journalist, 9-10, 59, 239-240

kept man, xix

kingdom of freedom, 99, 104-105

labor theory, liii, 113-119, 148-149

law, 54

law-chance, 67-69

London years, 247-251

lunatic, 5

malinvestment, 140-142

managers, 158

materialism, 54

“mature,” lvii-lix, 83-84, 90-93

275

Mazzini on, 200dv

M-C-M’, 120, 124

“mellowing,” 84

missing volumes, xxvi

mode of production, 30, 67-68

money, 103, 120, 139-140, 180-183,
185-186,

moralism, 97-98

morality, 48-49

nature-freedom, 104-105

necessity, 104

optimist, 99

original of man, xv

overproduction theory, 136-140

paganism, 78-79, 85

Paris Commune, 79-80, 83

pawn brokers, xliii, 13, 253

perfection, 86n

philosphy, 52, 110-111

planning, 102

police informant, Ivi

pragmatism, 94

praxis, xvii, 71-73

pre-economist, I

predictins, 132

pre-history, 88

price of production, 149-151

prices, 119

private property, 39-40, 46, 88, 99

production, 35, 94, 105

production-distribution, 143

profit, 124-125, 134, 146-149,
155-157, 159-160

profits, 122-193

progress, 51

proletariat, 51, 58-59, 80, 81-82,
87, 90-91, 99, 110

Prometheus &, xx, 9, 36

prophecies, 84

prophet 2, 70

rational-irrational, xvii

reading, 238

realism, 34-35
