SCRIPTURE INDEX

Genesis II Chronicles
3:5 32 12:1-2 45
12:6-7 46
Exodus
23:27-30 97-98 I Samuel
8:18-20 24
Leviticus
26:40-42 110 II Samuel
15:12-13 20
Joshua 13:28-29 20
1:6-7 92 15:2-6 21
Numbers Psalms
22:16-18 75 21-5 7

  
  

31:7-8 75 28-12 91
20:7 96
Deuteronomy 68:17 96
31:9-13 35
Proverbs
I Kings 12:23 17
12:12 45
18:21 17 Jeremiah
22:8 59 27:10 58
22:18 59
Isaiah
Joshua 32:3-6 84

1:6-7 92
