Matthew
3:14-15
3:17
46
5:4
5:48
6:9-10
6:24
6:33
7:15-20

10:27-28
11:29-30
12:30
13:7
13:22
13:24-43

20:15

22:37

22:38-39

25:27

28:18
28: 18-20
28:19-20

Mark
14:61-64

Luke

4:18-19
12:48
1428-30
16:19-31

John
£2
3:35-36
3:36

121
100

6

147
100
24

19, 39
40

64

40, 59
17, 19, 49

145
125, 151
18

18

118

4

9

23-24

9

20
14
118
134
119

56, 62
5

12

Scripture Index

NEW TESTAMENT

 

165

63
63, 150
140, 141
89, 121
