21-23
21:22-24
22:1
22:21
23:9

Leviticus
6:5

SCRIPTURE INDEX

OLD TESTAMENT

Leviticus
219n TAS 192n
165, 166
48
166
241
192n
166
166
166
166
149
149
159

156

133
239

151
91, 220

199
162
151

32

154

 
