100

95

100

95, 115, 186
95,99

100

182

190

9

6

9

96,98, 182
9

26, 27n, 90,96
99

xvii

26,96, 100

Scripture Index

27:24-25
2745
27:53
27:59-62
27:65-66
28:18-20

Mark
831
a1
1082-84
12:13-17
8
1588

Lake
425
9:22

12:21

13:32

1615

17:b

18:11-12

19:28

20:20-26

21

215-6,

2135-74

21:5-28

21:6

21:18

21:20

23:20-21

21:20-24

21:21

21:24

21:27

21:28

21:24

22:30

23-27-31

91

12

13

aT

113

él

114, 115, 186
94

94

118

"7

118

77

u3

W

13

él

114, 115, 128, 186
116

15

100

120

181

116

o4

ix

116, 121
120

94

94

114, 115
1380
100

191
