166 Liberating Planet Earth

1 Corinthians Colossians
10:45 21 11348 11
1 139
11.28 95 2 Thessalonians
2 97, 119, 155 31095
15:24 92
15:24-25 22 1 Timothy
15:24-26 9 a3 © 98
2 Corinthians 214 23,55
3:18 137 3 for
517-20 67 35 *
5:21 100 Hebrews
8 94
10:3-5 139 an
12:14 7 20
Galatians James
4:7-9 14 4:25 150
41-4 20-21
Ephesians
2:8-9 3, 63 J John
2:10 64 23-7 150
5:23 119
6:1-3 73 Revelation
6:3 ” 1s 9
a 127-11 19-20
Philippians 12:12 60
2:10 155 20 8, 20, 132
2:12 55, 130 20:78 145

3:20-21 12 20:9 145
