266

Ezekiel
38-39
40-48
43;19-20

Daniel

2
2:20
2:31-34
2:34
2234-35,
2:35
2:44
2744-45,
4:34
4:35
7
713-14
7:26-27
9:24.27
9:26-27
9:27
9:31
11:31
11:41
12:11

Hosea
4:1
12:2

Jeet
2:2
2:28-32

Amos
1:3-2:5
5:7
5:18-20
5:20
8:2-9
8:9

The Debate over Christian Reconstruction

136n
127
71-72

70, 93, 101

4

53

190

140, 141, 191, 242
93

8, 70, 125-30, 219n
237-238

238-41

238

128

238

128, 129, 239

132
132

133
135n

150
137
135n
135
135n
135

Obadiah
4

Jonah

Habakkuk
1:8

Zephaniah
1:4
415

Hogeai
26
2:21
2:22

Zechariah
5:4
S:5-11
834-6
9:10

14:9

14:16

14:20

Malachi
3:3-4

238

150n
149

226
132
40

150n

238

135n,
135

135
135
136

241
239
226
93
93
92
92

92
