Answer Keys for Liberating Planet Earth

 

 

 

 

 

 

 

 

 

 

 

 

 

 

| Page # Question Answer Page # Question Answer

' Te] 1 (9 A | 10 (19 D

 Lconty cont.

' cont, (H Cc cont, (20) B

1 (lo) A il, A
aq ic
(2) B CONCLUSION
(13) ~D 75. * D
(14) 2, Cc
(8s) A FR a
(16 8B 76. 4, B
ay oD _ 5B A
(18s) A ‘ D
