John
1:14
1:29
3:3, 5
3:10, 12
3:1?
3:30
4:21
5:19, 30
5:22
5:24-29
5:27
5:28
5:28-29
5:39
6:15
6:39-40
6:44
7:38
12:12-15
12:15-16
12:31-32
12:32
12:48
14:3
14:6
14:16, 18
15:5
15:5-6
16:7-15
16:11
17:1,3
17:4-5
17:17
17:18
18:30-31
18:33-37
18:36,

Select Scripture Index

357

265

243

157
265, 461
214
355, 475
218
290, 403
417

291

286, 291
288

325

225
286, 336
245

251

217

227
244-245
268

293

272

273

272

260

255

257

259

273

456

31

45

230
226-228
242

18:36-37

Acts
1:7
1:8
1:9-11
2:5
2:19-21
2:30-33
2:33
2:34-36
3:15
3:19-21
3:20
3:24
4:12
4:27-28
5:31
7:51-52
8:9-10
13:32-34
13:33-34
17:6-7
17:7
Wl
17:13
17:31
24:15
26:18

Romans
1:3,4
1:16
1:32

2:5
2:5-8

218, 222

332
261
275
345
488
151, 220
221
221
222
486-491
489
490
260
103
222
380
343
152
197
385
222
291
385
291
288
259

219
505, 522
138, 289,
465
289
291

555
