308

Deuteronomy

28

31:12
32:21
33:17

Joshua
1:14
4:12
54-7
915

Judges

4

5

TAL
11:40
13:7
13:14
17:78.
19:14.
20:2

7 Samuel
2:22

22:18

25:41

27

28

2 Samuel
54
11:8
1318
23:4

1 King
12:8
12:258,
2 Kings
3:
14:21

181

222
169
215

215
215
101

297

46
46
215
48
249
249

6in.
6in.

296

48

264
222
134
135

256
222
265
241

257
61

256
257

The Sociology of the Church

2 Kings
22:8
22:10

2 Chronicles
1:3
16:12
19:11
26:1-23
35:12
Ezra
4:8 - 6:18
712-26
9:3

Job

135:13-14

Proverbs
4:22

Ecclesiastes
12:7

255
255

296
288
62f,
281

232

170
170
212

182
182
221

89
281
96
295
281
181
181
281
281
281
281
281
239

284

223
