724 POLITICAI. POLYTHEISM

 

1 Samuel Proverbs
8 294 8:36 156
13:9-15 526 Wl 588
IE Samuel Ecclesiastes
2 6 12:12 ix
12:14 626 .
165-14 275 Eackiel
13:10-16 92
I Kings
2:8-10 275
8:1 103 :
10:1-3 76 153
12:96-31 655, 702 6
12:28 565, 634 40
12:31 565 36
16:29-33 64 36
18:21 46, 64, 626, 634 30
18:39 634 36
19:18 565 39
40-41
HE Chronicles 41
hl 122 38
22:19 526 296
620
eb 608
42:12 144
Jeremiah
Psalms 4:14 602
2:9-12 xii 9:22:24 40
19:7 54 5:25, 4t
24:1 at 6:13-17 1
251213 41-42 11-15 306
37:9 481, 541 42:19 as
wa 54 Lamentations
21-5, 67 1:9 58
101:2 54
101:6 54
110:1-3 518 80
110:1-3 605 518
119:37-46 67 fon
119:46 72

119:99-100 575
1192113 629
119:126 627
139:7-8 66

  

556
