Genesis
1:28
2:16
2:17
3:1-13
3:7-8
3:12
3:13
3:14-19
3:15
3:16
3:17
3:18-19
3:21
3:23-24
4:3-8
12:1-4
13:2
15:13
15:18-21
18:11-14
19:1-26
25:27-34
27:27-29
30:31-43
45:19-20
48:1-20
50;24-26

Exodus

B:7-40
3:8

SCRIPTURE INDEX

OLD TESTAMENT

 

34:21-12
3521-35,

161
