Ezekiel
36:26-27

Daniel

2:31-34

2:34.35

 

Scripture Index

84, 101

97
87
48

$:1-30
3:15
44-45

Micah
6:6-8

Habakkuk

2:4

NEW TESTAMENT

96

10, 86

96

78

51

97, 98, 102
27

73

105

60, 88, 97

86

86

86

38

16, 48, 60, 125, 179

96

2:27-28
7:9

Luke

4:16-30
4:21
4:43
8:1
10:9
11:20

17:21
22:42

John
4:34

6:15
14:15

205

110
38
87, 97

36

35

85n
101

96
97
96
96
96
88, 97

97
102

102
155
17, 58, 102
