190 The Beast of Revelation

Psalms Daniel

187-15 26,90 7 41
188 ” 79 4
2513 xxv 710 138
464 112 73 26, 270, 90,95, 960
48:1 112
48:2 1g Hoses
48:8 112 ‘6 wi
873 12
904 183 128 m7
97:2 9

104:3 26,90 Joel

10 xevi, xxvii 21-2 26,90
No:1-2 savinon ti

. Amos

Isaiah 78-9 10

19-10 118

1:22a 118

41 2 Nealeere
116-9 40 12 9%
ng 112
19:1 26,90 abkuk
3411 10 :
oe ne 12 8
B21 12
567 12 Zephaniah
57:13 112 LI-IS ——26,90
6511 112
6526 112 Zacheriah

1210 90,95, 95n

Lamentations

28 10 Matthew

26 4

Ezskiel 2:20 4
1646-49 118 45 112
327-8 20 5:35 112
34:25 40 106 129
43:19 xvi 13:20-22 180

48 1880, 13:24-31 xxii
