INDEX

Aberhast, William, 23, 57, 238
activism, xiv

Adam, 45, 87

Alberta, xii, 1-2, 28, 29, 56-58
armament, 146

auction, 45, 88-89, 113
authority, 102, 197-98, 206

Bank of England, 137, 166-67
bank run, 12, 230
bankers, 217, 221
banking
abolition of, 69-70
central, 11
commercial, 148
credit failure, 121
depositors, 206
Douglas vs., 90-91, 204
exploitation?, 180-81
fractional reserve, 137, 148
fractional reserves, 160-61,
229-230
Jackson vs., 11
loans, 59
millennium &, 217
nationalized, 148
panic, xvii
real bills, xvi-xvii

State, 42, 152
baptism, 22
Bell, Daniel, 94
Bell, Don, 8
Bible, 17-23, 43, 210
Biddle, Nicholas, 11
blueprint, 55-80, 185-86
boom-bust, xvi
buggy whip, 229
bulldozers, 169
bureaucracy, 72, 188-192, 196
Bush, George, 10
business, xvi

capacity, 97-98
capital
allocating, 152
financial, 168
goods, 121-24
growth &, 151
human, 200
monetization, 62
national, 200
real, 168
return on, 171
valuation, 61-64
capital goods, 121-24, 169
capitalism
