18
4:14

Revelation
2:9-10
2:26-29
5:8-10
5:10

6:10
6:12-17

Scripture Index

 

65

1 7:16-17
12:12

215-216

224 20:11-15

84-86 20:14-15

86 21:4

86 21:22-27

292 22:5

22:20

373

100-101
129

18

86

17

9, 289
101
262

86

255
