Scripture Index

  

Deuteronomy
219 1:10 163, 165
189n xxxvi
232 433,
41:57 232, 233 170, 470
45:6 189n 117, 439
47:9 1891 174
4713-22 228 7
41415 298 174
47:15-16 231 “
ATAG-17 238 ut
47:18 234 us
47:22 234 te
47:23 934 163
49:28-31 161 1130
50:13 161 1130
457
Exodus 457
“7 231 460
112 231 178
3:2 201 158
3:5 201 82n
4:10, 11496 117, 439
525-14 4 440
12:37 163, 204, 231 174
20:8-11 66 175
20:11 428 231
20:12 123, 170
22:95-27 445 64, 107, 436
22:30 70
23:26 114, 165 201
23;29-30 165 165
23:31 165
33:11 201,
33:20 201 185
185
Leviticus 185
7:31-32 1130 185
12:3 70 185
13:12 72 185
19:35 Ban 186
2310-11 72 66n
25:23-28 445 185f
Numbers F Samuel
14 108 16:7 436

35:30 457 17:20 140
