Psalms

119:152
119:160
127:1-2
135:5-6
135:5-7
147:15-18
148:13
150:1-2

Proverbs
“7
3:6
4:23
4:26
5:23
6:3
6:23
10:27
41:9
11:10-11
12:4
12:17
12:17-22
12:22
13:24
14:12
14:26-27
14:34
15:16
15:33
16:4
16:9
16:10
16:12-18
16:17
18:12
12:1
22:4
22:6
23:3
2313-14

96.
27, 97
94
80

wo

8, 59
59

54
4, 21, 129
54
84

80, 92
84

139
55
19, 129, 134

Scripture Index

Proverbs
24:10-12
24:21
28:1
29:2
29:18
30:5-6
S119
31:10-31

175

118, 157
69
7”

71-72

96-97
