INDEX

academics, xxix, Ixi-di
accidents, 64, 65, 78
action, 178-179
Adam, 939; 233
agriculture, 207, 209n, 230
alienation, 37-47
Christian view, 85
classes &, 49
crude communism, 81
de-emphasis later?, I, lexi
fall of man, 169-170
Golden Age, 49, 78
Hegel, 25
money, 181-182
popular theme today, ivi
private property, 99
production &, 44-45
Alvarez, Santiago, 4
anarchy, 200
antinomy, 106
anti-Semitism (Marx's), xiii, 181-182
arbitrariness, 226
Arninianism, xiv
Aron, Raymond, 86n, 98
Assassins, 77
association (see also state), 100
atheism, xviii, 3, 34
Augustine, xviii, 88
automation, 135-136
autonomy
dependence; 106
freedom &, xii

Kant, xf

logic &, 19-20

Marx on, 35

responsibility &, xiv

Van Til on, 19-20
Aveling, Eleanor Mars, xf

‘Buabeuf, 77-78, 91

Bakunin, Michael, xxxv-xxxvi, Lexiii,
83, 108, 165

Bales, James, xxvii

banking, 142

Baran, Paul, 128

Barone, Enrico, 195-196.

Bauer, Bruno, 27

Bergson, Abram, 202

Billington, James, xiii, xx, lxiii-lxvi, 76n

Birch, Una, 77n

black markets, 218

Blain, Joel, bxii

biat, 218,

Bloom, Allan, xxxviii

blueprints, xxx

Bober, M. M,, 54, 155

Bockmuehl, Klaus, xxii, xxvii

Bogomils, 77

Bohm-Bawerk, Eugen von, Ivilvii,
118-19, 144-154

Bonaparte, Louis Napoleon, 58-59

book reviewing, bei

Borovitski, I., 216

Bortkiewicz, L., 152

269
