Diagram 12.10
The Mosaic Tabernacle

 

 

“highest heavens”
Holy of Holies

 

   

 

+ DP meen

Holy Place

 

 

oN

 

firmament

ocean

Laver

 

Altar (Mounlain)

 

 

 

base of mountain
gate of heaven arca

“Doorway” — place of slaughter

 

 

 
