1 Timothy
48
2 Timothy
17
Hebrews
49
4:12
10:31
11:13
11:16

13:4

xv, 101

253
58, 61
248

xiv, 100
253
236

Scripture Index
Joes
212
2:13
4:12
5:4
I Peter
4:17
1 John
3:15, 20
Revelation
6:16

279

xii, 67

10

204

60

262
