1228 TOOLS OF DOMINION

 

Romans
1076 13 191-92
Bid 13:1-7 49, 292, 423, 685
110 13:4 3t6n
278 138 473n, 736, 737, 754,
154 958
964 14:5 914
986 14:5-6 alan
961
758, 959 I Corinthians
got aie?
952 :
Qe16 992
63, 89, 675, 849 Sot 803
S24 34-15 330, 960
1022 31214 728
819n 31345 802
292 6:2-4 842-43
954 6:4 107
958 7:16 958
331 717-19 1022
189 7:19 269
691, 959 721 145, 196, 195
537 7:22-238 138
601 7:93 337
816, 959, 1090 8 47
193 9:9 519
229 9:9-10 RB
212n 9:9-14 99
456 10:21 286
834 14:34 268-69
956 14:34-35 830, 843
9:17 68 15 694
9:17-22 959 15:24 871
9:18 954 15:25 B71
9119-21 69
9:22 963 I Corinthians
u 293, 302, 663, 981 724 221
116-11 1039 11:2 227, 228
Wtt7— BStn
11-27 840-41 Galatians
HAT-I9 2660 t14 1027
12:1 876, 891 327-28 © 267
12:17-13:7 344 3:28 847
12:19 389, 531 45 267
12:20 766, 957 47 228

12:20-21 778 4:26 267
