Scripture Index

 

242-84 351 1811, 12 320
242,38 2 19:28 170
243 351 20:20-26 269
248-8, 15-16, 242 a1 850
8 21:20 176, $50n
246,7 2 21:20,28,24 850
241-84 16, 284 21:20-24 49
2418 234 21:21 176
2415 180, 195n, $49, 850n 224 175,176
2415-16 180, 181 22:20 148
2416 238 22:30 2280
2419-21 350 23:28-31 130
W21 180, 284 2444-53 226
24:21-34 142n 2447 4
2422 233,
2480 128, 180 ohn
2482 140, 234 1:11 221n
2484 180, 181,242, 351 213 140
26:4 i 72 140
26:14-15,47 124 e44 29
uo 11:53 124
128, 142n 11:55 140
128 12:31 337
14 A 383
lat 18:30-31 128
27:24-25 124 18:36 174
27:53 170 18:38 194
27:59-62 124 1889, 40 194
27:65-66 124 196,15 194
19:11 124
Mark 19:12 124
15 248n : 1914-15 124
3:18 210 19:15, 159
8:31 170 19:16 241n
1032-34 170
B 1% Acts
1 226
Luke 18 16, 174>991.
21 148 Ill 128
9:22 170 2 226
12:21 320 25 221
13:32 170 Qh 16,221
13:33 240n 216 254
1615 920 216-17 185n
Vl 170 2:20 234

188 185, 138 2:22-23,86 124
