264

Deuteronomy

 

The Debate over Christian Reconstruction

2 Chronicles

 

32 112 133
149
239 Job
15 1:6-12 155
149 1 155
28, 68 2: 155
142 42:10-17 156
a Psalms
188
6 13 60
67 22 18
205 27-8 93
162 2:8 202
205 2:9, 12 18
205 2:10-12 23, 149-50
150 86 166
» ind a3
uM 16:1 ry
42 19:4 40
23, 60, 132, 237 22:27 98, 142
5061 22:28 53
61 22:29 93
137 27:13 100
227m 47853
ot 50 219
187 50:10
58:4 192n
728-11 93
188 9:4 Ot
50 9:71
239 104:3 138
a 105:8 91, 220
15:30 74
119:1 21
137 119:46-47 150
91 119:62-64 187
19:71 25
119:105 27, 42
133 1274 Po)

243 140:3 192n
