name,solution
C0000001,0
C0000002,0
C0000003,0
C0000004,0
C0000005,0
C0000006,6
C0000007,0
C0000008,0
C0000009,6
C0000010,0
C0000011,0
C0000012,0
C0000013,48
C0000014,0
C0000015,40
C0000016,40
C0000017,0
C0000018,0
C0000019,78
C0000020,0
C0000021,12
C0000022,0
C0000023,0
C0000024,0
C0000025,0
C0000026,0
C0000027,0
C0000028,0
C0000029,0
C0000030,0
C0000031,0
C0000032,48
C0000033,0
C0000034,0
C0000035,12
C0000036,0
C0000037,0
C0000038,0
C0000039,0
C0000040,0
C0000041,0
C0000042,0
C0000043,0
C0000044,0
C0000045,64
C0000046,0
C0000047,65
C0000048,0
C0000049,0
C0000050,0
C0000051,0
C0000052,0
C0000053,0
C0000054,0
C0000055,0
C0000056,3
C0000057,3
C0000058,3
C0000059,4
C0000060,4
C0000061,4
C0000062,9
C0000063,9
C0000064,9
C0000065,15
C0000066,4
C0000067,9
C0000068,11
C0000069,11
C0000070,17
C0000071,65
C0000072,29
C0000073,17
C0000074,57
C0000075,57
C0000076,57
C0000077,57
C0000078,29
C0000079,57
C0000080,81
C0000081,81
C0000082,55
C0000083,57
C0000084,77
C0000085,89
C0000086,83
C0000087,101
C0000088,109
C0000089,11
C0000090,11
C0000091,17
C0000092,65
C0000093,77
C0000094,89
C0000095,83
C0000096,101
C0000097,121
C0000098,123
C0000099,124
C0000100,125
C0000101,126
C0000102,3
C0000103,3
C0000104,4
C0000105,0
C0000106,0
C0000107,1
