digraph bwttKernel_tapnfold_2{
	NodeInput5 [shape=invhouse, label="so\nID: 5"];
	NodeCast6 [label="{HWOffsetFix:10, 0, UNSIGNED}\nID: 6"];
	NodeInput2 [shape=invhouse, label="si\nID: 2"];
	NodeCast9 [label="{HWOffsetFix:10, 0, UNSIGNED}\nID: 9"];
	NodeMappedRom52 [label="MappedRom 'mappedRomX':\n{HWOffsetFix:32, 0, TWOSCOMPLEMENT} x 1000\nID: 52"];
	NodeCast10 [label="{HWFloat:8, 24}\nID: 10"];
	NodeCast7 [label="{HWFloat:8, 24}\nID: 7"];
	NodeSub12 [label="-\nID: 12"];
	NodeFIFO67 [shape=plaintext, label=<<TABLE BORDER="0" CELLSPACING="0" CELLBORDER="1"> <TR><TD></TD></TR><TR><TD>6</TD></TR><TR><TD>ID: 67</TD></TR> <TR><TD></TD></TR> </TABLE>>];
	NodeFIFO68 [shape=plaintext, label=<<TABLE BORDER="0" CELLSPACING="0" CELLBORDER="1"> <TR><TD></TD></TR><TR><TD>6</TD></TR><TR><TD>ID: 68</TD></TR> <TR><TD></TD></TR> </TABLE>>];
	NodeMappedRom54 [label="MappedRom 'mappedRomRho':\n{HWFloat:8, 24} x 1000\nID: 54"];
	NodeSub13 [label="-\nID: 13"];
	NodeDiv14 [label="/\nID: 14"];
	NodeOutput26 [shape=house, label="px\nID: 26"];
	NodeFIFO70 [shape=plaintext, label=<<TABLE BORDER="0" CELLSPACING="0" CELLBORDER="1"> <TR><TD></TD></TR><TR><TD>48</TD></TR><TR><TD>ID: 70</TD></TR> <TR><TD></TD></TR> </TABLE>>];
	NodeFIFO69 [shape=plaintext, label=<<TABLE BORDER="0" CELLSPACING="0" CELLBORDER="1"> <TR><TD></TD></TR><TR><TD>40</TD></TR><TR><TD>ID: 69</TD></TR> <TR><TD></TD></TR> </TABLE>>];
	NodeMul15 [label="*\nID: 15"];
	NodeSub16 [label="-\nID: 16"];
	NodeOutput31 [shape=house, label="bx\nID: 31"];
	NodeMappedRom53 [label="MappedRom 'mappedRomY':\n{HWOffsetFix:32, 0, TWOSCOMPLEMENT} x 1000\nID: 53"];
	NodeCast11 [label="{HWFloat:8, 24}\nID: 11"];
	NodeCast8 [label="{HWFloat:8, 24}\nID: 8"];
	NodeSub17 [label="-\nID: 17"];
	NodeDiv19 [label="/\nID: 19"];
	NodeOutput36 [shape=house, label="py\nID: 36"];
	NodeFIFO72 [shape=plaintext, label=<<TABLE BORDER="0" CELLSPACING="0" CELLBORDER="1"> <TR><TD></TD></TR><TR><TD>48</TD></TR><TR><TD>ID: 72</TD></TR> <TR><TD></TD></TR> </TABLE>>];
	NodeMul20 [label="*\nID: 20"];
	NodeSub21 [label="-\nID: 21"];
	NodeOutput41 [shape=house, label="by\nID: 41"];
	NodeOutput46 [shape=house, label="siRho\nID: 46"];
	NodeOutput51 [shape=house, label="soRho\nID: 51"];
	NodeInput5 -> NodeCast6[color="/dark28/1" photon_data="EDGE,SrcNode:5,SrcNodePort:data"];
	NodeInput2 -> NodeCast9[color="/dark28/2" photon_data="EDGE,SrcNode:2,SrcNodePort:data"];
	NodeCast6 -> NodeMappedRom52[color="/dark28/3" photon_data="EDGE,SrcNode:6,SrcNodePort:o"];
	NodeCast9 -> NodeMappedRom52[color="/dark28/4" photon_data="EDGE,SrcNode:9,SrcNodePort:o"];
	NodeMappedRom52 -> NodeCast10[color="/dark28/5" photon_data="EDGE,SrcNode:52,SrcNodePort:datab"];
	NodeMappedRom52 -> NodeCast7[color="/dark28/6" photon_data="EDGE,SrcNode:52,SrcNodePort:dataa"];
	NodeCast10 -> NodeSub12[color="/dark28/7" photon_data="EDGE,SrcNode:10,SrcNodePort:o"];
	NodeCast7 -> NodeSub12[color="/dark28/8" photon_data="EDGE,SrcNode:7,SrcNodePort:o"];
	NodeCast6 -> NodeFIFO67[headport="n" color="/dark28/1" photon_data="EDGE,SrcNode:6,SrcNodePort:o"];
	NodeCast9 -> NodeFIFO68[headport="n" color="/dark28/2" photon_data="EDGE,SrcNode:9,SrcNodePort:o"];
	NodeFIFO67 -> NodeMappedRom54[tailport="s" color="/dark28/3" photon_data="EDGE,SrcNode:67,SrcNodePort:output"];
	NodeFIFO68 -> NodeMappedRom54[tailport="s" color="/dark28/4" photon_data="EDGE,SrcNode:68,SrcNodePort:output"];
	NodeMappedRom54 -> NodeSub13[color="/dark28/5" photon_data="EDGE,SrcNode:54,SrcNodePort:datab"];
	NodeMappedRom54 -> NodeSub13[color="/dark28/6" photon_data="EDGE,SrcNode:54,SrcNodePort:dataa"];
	NodeSub12 -> NodeDiv14[color="/dark28/7" photon_data="EDGE,SrcNode:12,SrcNodePort:result"];
	NodeSub13 -> NodeDiv14[color="/dark28/8" photon_data="EDGE,SrcNode:13,SrcNodePort:result"];
	NodeDiv14 -> NodeOutput26[color="/dark28/1" photon_data="EDGE,SrcNode:14,SrcNodePort:result"];
	NodeCast7 -> NodeFIFO70[headport="n" color="/dark28/2" photon_data="EDGE,SrcNode:7,SrcNodePort:o"];
	NodeMappedRom54 -> NodeFIFO69[headport="n" color="/dark28/3" photon_data="EDGE,SrcNode:54,SrcNodePort:dataa"];
	NodeDiv14 -> NodeMul15[color="/dark28/4" photon_data="EDGE,SrcNode:14,SrcNodePort:result"];
	NodeFIFO69 -> NodeMul15[tailport="s" color="/dark28/5" photon_data="EDGE,SrcNode:69,SrcNodePort:output"];
	NodeFIFO70 -> NodeSub16[tailport="s" color="/dark28/6" photon_data="EDGE,SrcNode:70,SrcNodePort:output"];
	NodeMul15 -> NodeSub16[color="/dark28/7" photon_data="EDGE,SrcNode:15,SrcNodePort:result"];
	NodeSub16 -> NodeOutput31[color="/dark28/8" photon_data="EDGE,SrcNode:16,SrcNodePort:result"];
	NodeCast6 -> NodeMappedRom53[color="/dark28/1" photon_data="EDGE,SrcNode:6,SrcNodePort:o"];
	NodeCast9 -> NodeMappedRom53[color="/dark28/2" photon_data="EDGE,SrcNode:9,SrcNodePort:o"];
	NodeMappedRom53 -> NodeCast11[color="/dark28/3" photon_data="EDGE,SrcNode:53,SrcNodePort:datab"];
	NodeMappedRom53 -> NodeCast8[color="/dark28/4" photon_data="EDGE,SrcNode:53,SrcNodePort:dataa"];
	NodeCast11 -> NodeSub17[color="/dark28/5" photon_data="EDGE,SrcNode:11,SrcNodePort:o"];
	NodeCast8 -> NodeSub17[color="/dark28/6" photon_data="EDGE,SrcNode:8,SrcNodePort:o"];
	NodeSub17 -> NodeDiv19[color="/dark28/7" photon_data="EDGE,SrcNode:17,SrcNodePort:result"];
	NodeSub13 -> NodeDiv19[color="/dark28/8" photon_data="EDGE,SrcNode:13,SrcNodePort:result"];
	NodeDiv19 -> NodeOutput36[color="/dark28/1" photon_data="EDGE,SrcNode:19,SrcNodePort:result"];
	NodeCast8 -> NodeFIFO72[headport="n" color="/dark28/2" photon_data="EDGE,SrcNode:8,SrcNodePort:o"];
	NodeDiv19 -> NodeMul20[color="/dark28/3" photon_data="EDGE,SrcNode:19,SrcNodePort:result"];
	NodeFIFO69 -> NodeMul20[tailport="s" color="/dark28/4" photon_data="EDGE,SrcNode:69,SrcNodePort:output"];
	NodeFIFO72 -> NodeSub21[tailport="s" color="/dark28/5" photon_data="EDGE,SrcNode:72,SrcNodePort:output"];
	NodeMul20 -> NodeSub21[color="/dark28/6" photon_data="EDGE,SrcNode:20,SrcNodePort:result"];
	NodeSub21 -> NodeOutput41[color="/dark28/7" photon_data="EDGE,SrcNode:21,SrcNodePort:result"];
	NodeMappedRom54 -> NodeOutput46[color="/dark28/8" photon_data="EDGE,SrcNode:54,SrcNodePort:datab"];
	NodeFIFO69 -> NodeOutput51[tailport="s" color="/dark28/1" photon_data="EDGE,SrcNode:69,SrcNodePort:output"];
}
