2,NodeCounterV1,0
4,NodeEq,0
7,NodeAnd,0
8,NodeInput,0
29,NodeCast,0
57,NodeMappedRom,0
32,NodeMul,0
11,NodeAnd,0
12,NodeInput,0
33,NodeAdd,0
55,NodeMappedRom,0
30,NodeCast,0
34,NodeSub,0
38,NodeMul,0
15,NodeAnd,0
16,NodeInput,0
35,NodeMul,0
19,NodeAnd,0
20,NodeInput,0
36,NodeAdd,0
56,NodeMappedRom,0
31,NodeCast,0
37,NodeSub,0
39,NodeMul,0
40,NodeAdd,0
42,NodeLt,0
23,NodeAnd,0
24,NodeInput,0
43,NodeLt,0
44,NodeAnd,0
27,NodeAnd,0
28,NodeInput,0
45,NodeGt,0
46,NodeAnd,0
49,NodeMux,0
54,NodeOutput,0
60,NodeCounterV1,0
61,NodeStreamOffset,0
63,NodeOutputMappedReg,0
66,NodeCounterV1,0
69,NodeEq,0
67,NodeFlush,0
