digraph secondKernel_tapnfold_1{
	NodeConstantDouble1 [shape=box, label="1.0\nID: 1"];
	NodeInputMappedReg0 [shape=box, peripheries=2, label="tokensIndex\nID: 0"];
	NodeCounterV12 [shape=hexagon, label="cnt\nID: 2"];
	NodeConstantDouble3 [shape=box, label="0.0\nID: 3"];
	NodeEq4 [label="==\nID: 4"];
	NodeInput8 [shape=invhouse, label="px\nID: 8"];
	NodeCast29 [label="{HWOffsetFix:10, 0, UNSIGNED}\nID: 29"];
	NodeMappedRom57 [label="MappedRom 'mappedRomRho':\n{HWFloat:8, 24} x 1000\nID: 57"];
	NodeMul32 [label="*\nID: 32"];
	NodeInput12 [shape=invhouse, label="bx\nID: 12"];
	NodeAdd33 [label="+\nID: 33"];
	NodeMappedRom55 [label="MappedRom 'mappedRomX':\n{HWOffsetFix:32, 0, TWOSCOMPLEMENT} x 1000\nID: 55"];
	NodeCast30 [label="{HWFloat:8, 24}\nID: 30"];
	NodeSub34 [label="-\nID: 34"];
	NodeMul38 [label="*\nID: 38"];
	NodeInput16 [shape=invhouse, label="py\nID: 16"];
	NodeMul35 [label="*\nID: 35"];
	NodeInput20 [shape=invhouse, label="by\nID: 20"];
	NodeAdd36 [label="+\nID: 36"];
	NodeMappedRom56 [label="MappedRom 'mappedRomY':\n{HWOffsetFix:32, 0, TWOSCOMPLEMENT} x 1000\nID: 56"];
	NodeCast31 [label="{HWFloat:8, 24}\nID: 31"];
	NodeSub37 [label="-\nID: 37"];
	NodeMul39 [label="*\nID: 39"];
	NodeAdd40 [label="+\nID: 40"];
	NodeConstantDouble41 [shape=box, label="1.2\nID: 41"];
	NodeLt42 [label="<\nID: 42"];
	NodeInput24 [shape=invhouse, label="siRho\nID: 24"];
	NodeLt43 [label="<\nID: 43"];
	NodeAnd44 [label="&\nID: 44"];
	NodeInput28 [shape=invhouse, label="soRho\nID: 28"];
	NodeGt45 [label=">\nID: 45"];
	NodeAnd46 [label="&\nID: 46"];
	NodeConstantRawBits48 [shape=box, label="0.0\nID: 48"];
	NodeConstantRawBits47 [shape=box, label="1.0\nID: 47"];
	NodeMux49 [shape=invtrapezium, label="MUX\nID: 49", height=0.5];
	NodeOutput54 [shape=house, label="output\nID: 54"];
	NodeConstantDouble1 -> NodeCounterV12[label="enable" color="/dark28/1" photon_data="EDGE,SrcNode:1,SrcNodePort:value"];
	NodeInputMappedReg0 -> NodeCounterV12[label="max" color="/dark28/2" photon_data="EDGE,SrcNode:0,SrcNodePort:tokensIndex"];
	NodeCounterV12 -> NodeEq4[color="/dark28/3" photon_data="EDGE,SrcNode:2,SrcNodePort:count"];
	NodeConstantDouble3 -> NodeEq4[color="/dark28/4" photon_data="EDGE,SrcNode:3,SrcNodePort:value"];
	NodeEq4 -> NodeInput8[headport="w" color="/dark28/5" ];
	NodeEq4 -> NodeInput12[headport="w" color="/dark28/6" ];
	NodeEq4 -> NodeInput16[headport="w" color="/dark28/7" ];
	NodeEq4 -> NodeInput20[headport="w" color="/dark28/8" ];
	NodeEq4 -> NodeInput24[headport="w" color="/dark28/1" ];
	NodeEq4 -> NodeInput28[headport="w" color="/dark28/2" ];
	NodeCounterV12 -> NodeCast29[color="/dark28/3" photon_data="EDGE,SrcNode:2,SrcNodePort:count"];
	NodeCast29 -> NodeMappedRom57[color="/dark28/4" photon_data="EDGE,SrcNode:29,SrcNodePort:o"];
	NodeInput8 -> NodeMul32[color="/dark28/5" photon_data="EDGE,SrcNode:8,SrcNodePort:data"];
	NodeMappedRom57 -> NodeMul32[color="/dark28/6" photon_data="EDGE,SrcNode:57,SrcNodePort:dataa"];
	NodeMul32 -> NodeAdd33[color="/dark28/7" photon_data="EDGE,SrcNode:32,SrcNodePort:result"];
	NodeInput12 -> NodeAdd33[color="/dark28/8" photon_data="EDGE,SrcNode:12,SrcNodePort:data"];
	NodeCast29 -> NodeMappedRom55[color="/dark28/1" photon_data="EDGE,SrcNode:29,SrcNodePort:o"];
	NodeMappedRom55 -> NodeCast30[color="/dark28/2" photon_data="EDGE,SrcNode:55,SrcNodePort:dataa"];
	NodeAdd33 -> NodeSub34[color="/dark28/3" photon_data="EDGE,SrcNode:33,SrcNodePort:result"];
	NodeCast30 -> NodeSub34[color="/dark28/4" photon_data="EDGE,SrcNode:30,SrcNodePort:o"];
	NodeSub34 -> NodeMul38[color="/dark28/5" photon_data="EDGE,SrcNode:34,SrcNodePort:result"];
	NodeSub34 -> NodeMul38[color="/dark28/6" photon_data="EDGE,SrcNode:34,SrcNodePort:result"];
	NodeInput16 -> NodeMul35[color="/dark28/7" photon_data="EDGE,SrcNode:16,SrcNodePort:data"];
	NodeMappedRom57 -> NodeMul35[color="/dark28/8" photon_data="EDGE,SrcNode:57,SrcNodePort:dataa"];
	NodeMul35 -> NodeAdd36[color="/dark28/1" photon_data="EDGE,SrcNode:35,SrcNodePort:result"];
	NodeInput20 -> NodeAdd36[color="/dark28/2" photon_data="EDGE,SrcNode:20,SrcNodePort:data"];
	NodeCast29 -> NodeMappedRom56[color="/dark28/3" photon_data="EDGE,SrcNode:29,SrcNodePort:o"];
	NodeMappedRom56 -> NodeCast31[color="/dark28/4" photon_data="EDGE,SrcNode:56,SrcNodePort:dataa"];
	NodeAdd36 -> NodeSub37[color="/dark28/5" photon_data="EDGE,SrcNode:36,SrcNodePort:result"];
	NodeCast31 -> NodeSub37[color="/dark28/6" photon_data="EDGE,SrcNode:31,SrcNodePort:o"];
	NodeSub37 -> NodeMul39[color="/dark28/7" photon_data="EDGE,SrcNode:37,SrcNodePort:result"];
	NodeSub37 -> NodeMul39[color="/dark28/8" photon_data="EDGE,SrcNode:37,SrcNodePort:result"];
	NodeMul38 -> NodeAdd40[color="/dark28/1" photon_data="EDGE,SrcNode:38,SrcNodePort:result"];
	NodeMul39 -> NodeAdd40[color="/dark28/2" photon_data="EDGE,SrcNode:39,SrcNodePort:result"];
	NodeAdd40 -> NodeLt42[color="/dark28/3" photon_data="EDGE,SrcNode:40,SrcNodePort:result"];
	NodeConstantDouble41 -> NodeLt42[color="/dark28/4" photon_data="EDGE,SrcNode:41,SrcNodePort:value"];
	NodeMappedRom57 -> NodeLt43[color="/dark28/5" photon_data="EDGE,SrcNode:57,SrcNodePort:dataa"];
	NodeInput24 -> NodeLt43[color="/dark28/6" photon_data="EDGE,SrcNode:24,SrcNodePort:data"];
	NodeLt42 -> NodeAnd44[color="/dark28/7" photon_data="EDGE,SrcNode:42,SrcNodePort:result"];
	NodeLt43 -> NodeAnd44[color="/dark28/8" photon_data="EDGE,SrcNode:43,SrcNodePort:result"];
	NodeMappedRom57 -> NodeGt45[color="/dark28/1" photon_data="EDGE,SrcNode:57,SrcNodePort:dataa"];
	NodeInput28 -> NodeGt45[color="/dark28/2" photon_data="EDGE,SrcNode:28,SrcNodePort:data"];
	NodeAnd44 -> NodeAnd46[color="/dark28/3" photon_data="EDGE,SrcNode:44,SrcNodePort:result"];
	NodeGt45 -> NodeAnd46[color="/dark28/4" photon_data="EDGE,SrcNode:45,SrcNodePort:result"];
	NodeAnd46 -> NodeMux49[headport="w" color="/dark28/5" photon_data="EDGE,SrcNode:46,SrcNodePort:result"];
	NodeConstantRawBits48 -> NodeMux49[color="/dark28/6" photon_data="EDGE,SrcNode:48,SrcNodePort:value"];
	NodeConstantRawBits47 -> NodeMux49[color="/dark28/7" photon_data="EDGE,SrcNode:47,SrcNodePort:value"];
	NodeMux49 -> NodeOutput54[color="/dark28/8" photon_data="EDGE,SrcNode:49,SrcNodePort:result"];
}
