0.830 -0.140 0.770 0.150 0.930 0.350 0.860 -0.080 -0.510 -0.790 
0.620 -0.730 -0.100 -0.410 0.630 0.260 0.400 -0.740 0.720 0.360 
-0.890 0.680 0.670 -0.710 0.820 0.300 -0.380 0.230 -0.330 0.350 
0.290 -0.980 -0.780 -0.420 -0.310 0.670 0.930 -0.440 -0.890 -0.580 
-0.710 0.730 -0.790 0.190 0.840 0.370 0.980 0.240 0.150 0.700 
-0.870 0.260 -0.090 0.800 0.560 -0.270 -0.380 0.700 0.960 -0.190 
0.050 0.250 -0.160 0.270 0.360 0.050 -0.540 0.290 0.130 -0.430 
0.240 -0.050 0.820 0.450 -0.860 0.670 -0.660 0.640 -0.570 0.500 
-0.130 -0.920 -0.240 0.780 0.880 0.840 -0.970 -0.490 0.540 0.990 
0.320 -0.400 -0.240 0.680 0.390 -0.880 -0.740 0.860 -0.060 0.390 