<?xml version="1.0" encoding="UTF-8" standalone="no"?>
<!-- Created with Inkscape (http://www.inkscape.org/) -->

<svg
   width="111.88651mm"
   height="111.80431mm"
   viewBox="0 0 111.88651 111.8043"
   version="1.1"
   id="svg57192"
   inkscape:version="1.1.2 (0a00cf5339, 2022-02-04)"
   sodipodi:docname="fme_flow_hosted.svg"
   xmlns:inkscape="http://www.inkscape.org/namespaces/inkscape"
   xmlns:sodipodi="http://sodipodi.sourceforge.net/DTD/sodipodi-0.dtd"
   xmlns="http://www.w3.org/2000/svg"
   xmlns:svg="http://www.w3.org/2000/svg">
  <sodipodi:namedview
     id="namedview57194"
     pagecolor="#ffffff"
     bordercolor="#000000"
     borderopacity="0.25"
     inkscape:pageshadow="2"
     inkscape:pageopacity="0.0"
     inkscape:pagecheckerboard="0"
     inkscape:document-units="mm"
     showgrid="false"
     fit-margin-top="0"
     fit-margin-left="0"
     fit-margin-right="0"
     fit-margin-bottom="0"
     inkscape:zoom="2.1997092"
     inkscape:cx="285.49228"
     inkscape:cy="237.5314"
     inkscape:window-width="3770"
     inkscape:window-height="1536"
     inkscape:window-x="2630"
     inkscape:window-y="27"
     inkscape:window-maximized="1"
     inkscape:current-layer="layer1" />
  <defs
     id="defs57189">
    <style
       id="style64780">.cls-1,.cls-13{fill:#d33833}.cls-1,.cls-10,.cls-11,.cls-14,.cls-15,.cls-16,.cls-17,.cls-4,.cls-5,.cls-7,.cls-8{fill-rule:evenodd}.cls-14{fill:#ef3d3a}.cls-15{fill:#231f20}.cls-4{fill:#f0d6b7}.cls-5{fill:#335061}.cls-7{fill:#dcd9d8}.cls-8,.cls-9{fill:#f7e4cd}.cls-10{fill:#49728b}.cls-11,.cls-12{fill:#fff}.cls-16{fill:#81b0c4}.cls-17{fill:#1d1919}.cls-18{isolation:isolate}</style>
  </defs>
  <g
     inkscape:label="Layer 1"
     inkscape:groupmode="layer"
     id="layer1"
     transform="translate(31.008326,-44.621253)">
    <path
       style="fill:#004682;fill-opacity:1;stroke-width:2.10282"
       d="m -248.715,134.09667 c -1.12268,-0.9917 -8.93041,-7.60347 -17.35052,-14.69284 -8.42011,-7.08936 -21.01197,-17.69309 -27.98194,-23.563835 l -12.6727,-10.674094 V 73.689864 62.213824 l 2.2964,-1.566005 c 10.78603,-7.355456 19.96776,-13.522949 20.13043,-13.521907 0.10829,7.94e-4 0.7235,1.034066 1.36712,2.29639 1.46609,2.875315 5.18428,6.639952 8.06294,8.16369 1.14888,0.608121 2.24845,1.105672 2.4435,1.105672 0.19505,0 -0.16919,-0.778407 -0.80943,-1.72979 -1.81263,-2.693548 -3.17886,-5.816663 -4.12171,-9.421881 -0.71982,-2.752508 -0.87132,-4.134332 -0.90336,-8.240083 -0.0443,-5.670854 0.50601,-8.214124 2.86787,-13.254214 2.88842,-6.163702 5.83133,-9.917438 14.14699,-18.0447529 3.54182,-3.4615993 6.92574,-7.0431606 7.51983,-7.95902903 2.16907,-3.34391257 3.364,-8.17045497 2.95678,-11.94303507 -0.42599,-3.946549 -1.715,-7.81119 -3.14955,-9.442807 -0.83807,-0.953196 -0.23307,-1.088443 2.04971,-0.458219 4.13277,1.140963 9.33013,5.373061 11.40599,9.287648 1.90164,3.5860539 3.08805,9.6973785 2.54423,13.10568277 l -0.25619,1.60570593 -1.87114,-1.68406493 c -1.88915,-1.70028127 -4.77497,-3.08049347 -4.75076,-2.27215957 0.007,0.2225331 0.23391,1.32316267 0.50499,2.44584265 0.27108,1.12268265 0.49527,3.19554225 0.49819,4.60635875 0.0138,6.6387534 -2.94812,12.1412714 -11.89581,22.0998284 -5.57468,6.204473 -7.62302,9.638445 -9.26812,15.537703 -0.98926,3.547407 -1.08294,12.323556 -0.16824,15.761266 0.79702,2.995435 2.98327,7.362397 4.60778,9.203862 1.68359,1.908434 4.71738,4.146915 4.36076,3.217585 -0.89631,-2.335742 -1.66595,-7.164766 -1.68148,-10.550313 -0.0148,-3.216783 0.11361,-4.124439 0.9142,-6.463919 1.83101,-5.350547 4.55934,-9.178743 11.94215,-16.75633 7.55055,-7.749759 9.80761,-11.006439 11.08232,-15.990504 0.81365,-3.181363 0.89553,-9.052141 0.16032,-11.4950763 -0.27381,-0.9097962 -0.45207,-1.6999452 -0.39613,-1.7558887 0.0559,-0.055941 1.00716,0.3551581 2.11382,0.9135533 6.42385,3.2413517 10.56459,9.3653137 11.23903,16.6220167 0.22033,2.370661 -0.36294,7.042547 -0.92241,7.388317 -0.17033,0.105265 -0.30968,0.04329 -0.30968,-0.137707 0,-0.807384 -3.118,-4.056161 -4.7403,-4.939131 -0.97326,-0.529709 -1.82952,-0.903139 -1.90282,-0.829842 -0.0733,0.0733 0.0793,0.968762 0.33903,1.989921 0.96632,3.79884 1.2687,7.031249 0.88755,9.487884 -0.79701,5.136822 -2.68714,7.880665 -11.38236,16.523406 -7.00445,6.962183 -8.21582,8.513577 -10.02034,12.832988 -0.8061,1.929532 -0.89075,2.547294 -0.87544,6.38866 0.0155,3.889058 0.33797,5.907477 1.39115,8.707874 0.0771,0.205053 -0.58304,0.649031 -1.467,0.986621 -2.13108,0.813869 -4.29707,3.021719 -5.00623,5.102992 -2.33847,6.863038 2.68388,13.695547 9.5501,12.992137 3.41564,-0.34991 6.59809,-2.84644 7.80645,-6.123911 0.5836,-1.582899 0.53283,-4.294444 -0.11605,-6.198809 -0.72381,-2.124278 -3.24956,-4.711657 -5.15741,-5.283263 -1.68534,-0.504942 -2.02464,-1.504619 -1.41194,-4.159996 0.8619,-3.73539 2.33234,-5.330301 8.83757,-9.585666 4.54888,-2.975632 11.38742,-9.724777 13.48745,-13.311151 2.72186,-4.648311 4.08893,-10.024721 3.64666,-14.34157 l -0.23028,-2.247614 0.98881,0.697002 c 0.96287,0.678715 15.97138,10.59547 26.77123,17.688867 l 5.37005,3.527081 -0.0969,3.464224 -0.0968,3.464221 -19.05155,15.95075 c -10.47835,8.772912 -23.98879,20.082945 -30.0232,25.133415 l -10.97164,9.18267 v 3.89565 3.89565 l 1.95618,-1.62873 c 1.0759,-0.8958 6.70206,-5.60515 12.50258,-10.46522 5.80051,-4.86007 13.84044,-11.596 17.86651,-14.96872 20.3153,-17.018594 27.48946,-22.972441 27.6809,-22.972441 0.11568,0 0.21032,1.665957 0.21032,3.702122 v 3.702118 l -12.1377,10.161283 c -6.67573,5.588708 -13.77013,11.539118 -15.76532,13.223138 -1.99519,1.68402 -5.75706,4.84615 -8.35972,7.02696 -2.60266,2.18081 -9.12851,7.65388 -14.5019,12.16237 -5.37339,4.5085 -9.96617,8.19306 -10.20619,8.18791 -0.24001,-0.005 -1.35494,-0.82074 -2.47762,-1.81244 z"
       id="path65276" />
    <g
       id="g87728"
       transform="translate(-131.12884,5.9697327)">
      <path
         style="fill:#0a2363;fill-opacity:1;stroke-width:0.743458"
         d="m 177.06905,128.54771 -11.45939,-11.4605 0.004,-15.78119 c 0.003,-10.759722 -0.0362,-15.855996 -0.12193,-16.016262 -0.12382,-0.23141 -0.37287,-0.235061 -16.02303,-0.235061 H 133.57142 L 122.10827,73.597926 c -6.30473,-6.301224 -11.44932,-11.526485 -11.43238,-11.611689 0.036,-0.180911 1.29064,-1.827043 2.71354,-3.560077 1.38586,-1.687957 4.44923,-4.74949 6.45861,-6.454735 2.12119,-1.800141 3.56301,-2.89233 3.76489,-2.851933 0.0861,0.01722 5.29095,5.165949 11.56642,11.44162 6.55679,6.557036 11.46561,11.375892 11.54086,11.329389 0.0933,-0.05768 0.13091,-4.722048 0.13091,-16.244522 0,-11.414302 0.038,-16.187123 0.12952,-16.243649 0.1297,-0.08016 0.4867,-0.13399 3.17822,-0.479253 1.97597,-0.253473 7.35685,-0.358397 9.68262,-0.188801 3.19219,0.232775 5.28079,0.524057 5.43168,0.75752 0.0557,0.08624 0.0979,7.382687 0.0937,16.214323 -0.007,13.673989 0.0175,16.062735 0.16081,16.092638 0.0926,0.01931 5.28834,-5.082103 11.54594,-11.336488 6.25764,-6.254382 11.44607,-11.371606 11.52986,-11.371606 0.2118,0 2.2683,1.591754 4.13491,3.200476 1.69497,1.460797 4.28371,4.045802 5.75154,5.743271 0.9507,1.09942 3.08911,3.855103 3.08911,3.980794 0,0.03906 -5.14511,5.216067 -11.4336,11.504466 -6.28848,6.2884 -11.41245,11.496903 -11.3866,11.574452 0.0355,0.106479 4.0188,0.155718 16.27158,0.201137 l 16.22462,0.06014 0.093,0.541264 c 0.24254,1.412007 0.46567,3.655864 0.59486,5.982231 0.15465,2.784491 0.0236,6.473637 -0.32845,9.243716 -0.10015,0.78814 -0.21447,1.68988 -0.25405,2.00388 l -0.0719,0.57091 -16.24129,0.0305 c -13.19853,0.0248 -16.25106,0.0598 -16.29342,0.18688 -0.0292,0.0877 4.97851,5.18277 11.40119,11.60007 10.61458,10.6057 11.44215,11.46154 11.30104,11.68746 -0.3343,0.53529 -2.38471,3.09077 -3.43482,4.28088 -2.6068,2.95434 -6.97508,6.91429 -9.19183,8.33263 l -0.30073,0.19239 z"
         id="path77576" />
      <path
         style="fill:#d5ab00;fill-opacity:1;stroke-width:0.743458"
         d="m 153.28611,150.40606 c -2.02584,-0.0828 -6.1327,-0.57339 -6.3477,-0.75829 -0.0512,-0.044 -0.0927,-7.25931 -0.0922,-16.03396 0,-8.77464 -0.0311,-16.03713 -0.0701,-16.13885 -0.0391,-0.10172 -0.13155,-0.18494 -0.20556,-0.18494 -0.074,0 -5.23854,5.10142 -11.47672,11.33648 -7.57232,7.56856 -11.40921,11.32291 -11.54393,11.29561 -0.33615,-0.0681 -1.89897,-1.25349 -3.88226,-2.94469 -1.1484,-0.97926 -4.77972,-4.55149 -5.50619,-5.41661 -0.21415,-0.255 -0.67932,-0.79627 -1.03373,-1.20282 -0.74956,-0.85979 -2.14323,-2.67795 -2.35254,-3.06906 -0.0793,-0.14822 -0.127,-0.32121 -0.10591,-0.38443 0.0212,-0.0632 5.13953,-5.21794 11.37436,-11.45493 6.23482,-6.23699 11.33604,-11.40547 11.33604,-11.48551 0,-0.11312 -3.58703,-0.14552 -16.10907,-0.14552 -17.743159,0 -16.48709,0.0552 -16.48709,-0.72436 0,-0.19048 -0.0495,-0.6061 -0.10997,-0.92359 -0.4438,-2.329809 -0.6731,-7.219585 -0.48932,-10.435085 0.1901,-3.326045 0.58632,-6.281494 0.86591,-6.4589 0.0849,-0.05387 7.41439,-0.09877 16.28778,-0.09979 l 16.13341,-0.0019 15.82912,15.825375 c 8.70604,8.70396 15.88424,15.79134 15.95157,15.74972 0.14322,-0.0885 0.17347,32.63101 0.0304,32.85093 -0.0486,0.0747 -0.9481,0.25325 -1.9989,0.39681 -2.88073,0.39355 -6.62016,0.54626 -9.9973,0.40825 z"
         id="path77615" />
    </g>
  </g>
</svg>
