<?xml version="1.0" encoding="UTF-8" standalone="no"?>
<!-- Created with Inkscape (http://www.inkscape.org/) -->

<svg
   width="135.5815mm"
   height="112.54507mm"
   viewBox="0 0 135.5815 112.54507"
   version="1.1"
   id="svg871"
   inkscape:version="1.1.2 (0a00cf5339, 2022-02-04)"
   sodipodi:docname="browser.svg"
   xmlns:inkscape="http://www.inkscape.org/namespaces/inkscape"
   xmlns:sodipodi="http://sodipodi.sourceforge.net/DTD/sodipodi-0.dtd"
   xmlns="http://www.w3.org/2000/svg"
   xmlns:svg="http://www.w3.org/2000/svg">
  <sodipodi:namedview
     id="namedview873"
     pagecolor="#ffffff"
     bordercolor="#000000"
     borderopacity="0.25"
     inkscape:pageshadow="2"
     inkscape:pageopacity="0.0"
     inkscape:pagecheckerboard="0"
     inkscape:document-units="mm"
     showgrid="false"
     inkscape:zoom="0.77771465"
     inkscape:cx="198.65898"
     inkscape:cy="417.24815"
     inkscape:window-width="2560"
     inkscape:window-height="1403"
     inkscape:window-x="0"
     inkscape:window-y="160"
     inkscape:window-maximized="1"
     inkscape:current-layer="layer1" />
  <defs
     id="defs868" />
  <g
     inkscape:label="Layer 1"
     inkscape:groupmode="layer"
     id="layer1"
     transform="translate(-52.472144,-38.088779)">
    <g
       id="g903"
       transform="translate(15.309281,-54.092784)">
      <path
         style="fill:#faa89b;stroke-width:0.264583"
         d="m 78.958299,204.65783 c 14.297421,-0.0378 37.693201,-0.0378 51.990621,0 14.29742,0.0378 2.59953,0.0688 -25.99531,0.0688 -28.594842,0 -40.292732,-0.0309 -25.995311,-0.0688 z M 50.3833,204.41644 c 0.181901,-0.0734 0.479557,-0.0734 0.661458,0 0.181902,0.0734 0.03307,0.13345 -0.330729,0.13345 -0.363802,0 -0.51263,-0.0601 -0.330729,-0.13345 z m 108.47916,0 c 0.1819,-0.0734 0.47956,-0.0734 0.66146,0 0.1819,0.0734 0.0331,0.13345 -0.33073,0.13345 -0.3638,0 -0.51263,-0.0601 -0.33073,-0.13345 z m -117.164289,-4.52113 -0.641433,-0.7276 0.727604,0.64143 c 0.400183,0.35279 0.727604,0.68021 0.727604,0.7276 0,0.20751 -0.214259,0.0386 -0.813775,-0.64143 z m 126.226269,0.0661 c 0.34178,-0.36381 0.68094,-0.66146 0.7537,-0.66146 0.0728,0 -0.14734,0.29765 -0.48912,0.66146 -0.34177,0.3638 -0.68094,0.66145 -0.7537,0.66145 -0.0728,0 0.14734,-0.29765 0.48912,-0.66145 z M 37.262056,190.56875 c 0,-0.3638 0.06005,-0.51263 0.133452,-0.33073 0.0734,0.1819 0.0734,0.47956 0,0.66146 -0.0734,0.1819 -0.133452,0.0331 -0.133452,-0.33073 z m 135.202074,0 c 0,-0.3638 0.0601,-0.51263 0.13345,-0.33073 0.0734,0.1819 0.0734,0.47956 0,0.66146 -0.0734,0.1819 -0.13345,0.0331 -0.13345,-0.33073 z M 62.884862,167.81458 c 0,-0.14552 0.119063,-0.26458 0.264583,-0.26458 0.145521,0 0.264584,0.11906 0.264584,0.26458 0,0.14552 -0.119063,0.26459 -0.264584,0.26459 -0.14552,0 -0.264583,-0.11907 -0.264583,-0.26459 z m 14.552083,0 c 0,-0.14552 0.119062,-0.26458 0.264583,-0.26458 0.145521,0 0.264583,0.11906 0.264583,0.26458 0,0.14552 -0.119062,0.26459 -0.264583,0.26459 -0.145521,0 -0.264583,-0.11907 -0.264583,-0.26459 z m 19.99305,-0.0776 c 0.09936,-0.26094 0.247304,-0.40779 0.328766,-0.32632 0.08146,0.0815 1.7e-4,0.29495 -0.180652,0.47443 -0.261308,0.25936 -0.291698,0.22897 -0.148114,-0.14811 z m 14.596245,-0.20824 c 0.0936,-0.35777 0.21349,-0.47771 0.27955,-0.27955 0.0636,0.19089 -0.0101,0.47286 -0.16386,0.62661 -0.19634,0.19634 -0.23077,0.093 -0.11569,-0.34706 z m 34.48784,-0.39771 c 0.0127,-0.30823 0.0754,-0.37092 0.15985,-0.15986 0.0764,0.191 0.067,0.4192 -0.0209,0.50712 -0.0879,0.0879 -0.15046,-0.0684 -0.13897,-0.34726 z m -49.477081,-0.26459 c 0.0127,-0.30822 0.07539,-0.37092 0.159851,-0.15985 0.07643,0.19099 0.06703,0.4192 -0.02088,0.50712 -0.08792,0.0879 -0.150452,-0.0684 -0.138964,-0.34727 z m 49.741661,-1.05833 c 0.0127,-0.30823 0.0754,-0.37092 0.15985,-0.15985 0.0764,0.19099 0.067,0.4192 -0.0209,0.50712 -0.0879,0.0879 -0.15045,-0.0684 -0.13897,-0.34727 z m -42.35422,-11.22274 c 0,-0.14552 0.12609,-0.26459 0.2802,-0.26459 0.15411,0 0.20662,0.11907 0.11668,0.26459 -0.0899,0.14552 -0.21603,0.26458 -0.2802,0.26458 -0.0642,0 -0.11668,-0.11906 -0.11668,-0.26458 z m 34.57222,0.0882 c -0.097,-0.097 -0.17639,-0.29942 -0.17639,-0.44979 0,-0.16579 0.12324,-0.15017 0.31309,0.0397 0.17221,0.1722 0.25158,0.3746 0.17639,0.44979 -0.0752,0.0752 -0.21607,0.0573 -0.31309,-0.0397 z"
         id="path917" />
      <path
         style="fill:#fbb167;stroke-width:0.264583"
         d="m 71.165936,107.76488 c -1.187532,-0.72408 -1.756746,-1.9372 -1.59254,-3.39403 0.358172,-3.17769 4.606287,-4.05626 6.286759,-1.30019 1.844524,3.02512 -1.669097,6.53874 -4.694219,4.69422 z"
         id="path915" />
      <path
         style="fill:#47c0e4;stroke-width:0.264583"
         d="m 61.408074,108.02699 c -0.761631,-0.30811 -1.954037,-1.7808 -2.004717,-2.47593 -0.125669,-1.72373 0.368543,-2.92022 1.493344,-3.61538 1.916517,-1.18448 4.421423,-0.31361 5.155004,1.79222 0.3419,0.98146 0.3419,1.25024 0,2.23171 -0.652801,1.87393 -2.780378,2.82115 -4.643631,2.06738 z"
         id="path913" />
      <path
         style="fill:#aa938f;stroke-width:0.264583"
         d="m 141.33382,108.8125 c 0.26339,-0.29104 0.53842,-0.52916 0.61118,-0.52916 0.0728,0 -0.0832,0.23812 -0.3466,0.52916 -0.26339,0.29104 -0.53842,0.52917 -0.61118,0.52917 -0.0728,0 0.0832,-0.23813 0.3466,-0.52917 z m 16.27187,-0.0999 c 0,-0.0549 0.20836,-0.2633 0.46302,-0.46302 0.41965,-0.32911 0.429,-0.31975 0.0999,0.0999 -0.34565,0.44073 -0.56292,0.58089 -0.56292,0.36313 z m -63.764579,-2.7949 c 0,-0.13693 0.117699,-0.32171 0.261553,-0.41062 0.149982,-0.0927 0.194337,0.0135 0.103984,0.24897 -0.175892,0.45837 -0.365537,0.54224 -0.365537,0.16165 z m 6.614579,0 c 0,-0.13693 0.1177,-0.32171 0.26156,-0.41062 0.14998,-0.0927 0.19433,0.0135 0.10398,0.24897 -0.17589,0.45837 -0.36554,0.54224 -0.36554,0.16165 z m 2.81082,-0.15813 c -0.25532,-0.66535 -0.18,-0.83703 0.1319,-0.30066 0.15443,0.26557 0.22505,0.5386 0.15693,0.60672 -0.0681,0.0681 -0.1981,-0.0696 -0.28883,-0.30606 z m 3.93606,-0.12207 c 0.0899,-0.14552 0.21603,-0.26458 0.2802,-0.26458 0.0642,0 0.11667,0.11906 0.11667,0.26458 0,0.14552 -0.12609,0.26459 -0.2802,0.26459 -0.15411,0 -0.20661,-0.11907 -0.11667,-0.26459 z m 43.59068,-0.92604 c 0.003,-0.58208 0.0571,-0.78905 0.1204,-0.45994 0.0633,0.32912 0.0609,0.80537 -0.005,1.05834 -0.0662,0.25296 -0.118,-0.0163 -0.11506,-0.5984 z m -49.01464,-0.39687 c 0,-0.14553 0.11906,-0.26459 0.26458,-0.26459 0.14552,0 0.26459,0.11906 0.26459,0.26459 0,0.14552 -0.11907,0.26458 -0.26459,0.26458 -0.14552,0 -0.26458,-0.11906 -0.26458,-0.26458 z m 6.74687,0 c 0.0899,-0.14553 0.21603,-0.26459 0.2802,-0.26459 0.0642,0 0.11668,0.11906 0.11668,0.26459 0,0.14552 -0.12609,0.26458 -0.2802,0.26458 -0.15411,0 -0.20661,-0.11906 -0.11668,-0.26458 z M 42.247363,96.541774 c 0,-0.05494 0.208359,-0.263301 0.463021,-0.46302 0.419644,-0.329108 0.429002,-0.31975 0.0999,0.09989 -0.345644,0.44073 -0.562916,0.580888 -0.562916,0.363126 z M 167.09694,96.178648 c -0.32911,-0.419644 -0.31975,-0.429002 0.0999,-0.09989 0.44073,0.345643 0.58088,0.562915 0.36312,0.562915 -0.0549,0 -0.2633,-0.208359 -0.46302,-0.463021 z M 78.693715,92.209913 c 14.442942,-0.0378 38.076845,-0.0378 52.519785,0 14.44295,0.0378 2.62599,0.06873 -26.25989,0.06873 -28.885884,0 -40.702837,-0.03093 -26.259895,-0.06873 z"
         id="path911" />
      <path
         style="fill:#fa6d56;stroke-width:0.264583"
         d="m 49.655696,204.17889 c -5.259659,-1.13372 -9.767362,-5.24675 -11.581448,-10.56743 l -0.721676,-2.11667 -0.0732,-37.10781 -0.0732,-37.10781 h 67.747448 67.74745 l -0.0732,37.10781 -0.0732,37.10781 -0.72168,2.11667 c -1.83552,5.38355 -6.3415,9.45425 -11.71374,10.58216 -2.7103,0.56904 -107.820307,0.55502 -110.463537,-0.0147 z m 17.341212,-38.64872 c 1.189963,-3.512 2.433976,-7.47983 2.764477,-8.81738 l 0.600906,-2.43194 0.709972,2.73197 c 0.390486,1.50258 1.595329,5.50017 2.67743,8.88352 l 1.96746,6.15155 1.896316,1e-5 1.896314,2e-5 1.063773,-3.24115 c 0.585076,-1.78263 2.155132,-6.62719 3.489015,-10.76569 1.333884,-4.13851 2.485128,-7.68062 2.558323,-7.87136 0.102912,-0.26818 -0.346128,-0.3468 -1.980737,-0.3468 h -2.11382 l -1.913175,6.79731 c -1.052248,3.73852 -2.105441,7.72711 -2.340428,8.86354 -0.234987,1.13643 -0.498723,2.06623 -0.586078,2.06623 -0.08736,0 -0.300038,-0.62508 -0.472628,-1.38906 -0.17259,-0.76399 -1.344115,-4.75258 -2.603386,-8.86354 l -2.289585,-7.47448 H 70.52469 68.728322 l -1.858309,5.76991 c -1.022069,3.17345 -2.24755,7.16038 -2.723292,8.85985 -0.475741,1.69946 -0.939064,3.0916 -1.029606,3.09363 -0.09054,0.002 -0.243865,-0.50233 -0.340719,-1.12079 -0.09685,-0.61846 -1.082588,-4.60706 -2.19052,-8.86354 l -2.014421,-7.73906 h -2.07663 c -1.142146,0 -2.076629,0.10422 -2.076629,0.2316 0,0.20081 6.147061,20.75463 6.482172,21.67433 0.09007,0.2472 0.654209,0.32077 2.028864,0.26459 l 1.904106,-0.0778 z m 32.873382,4.33493 c 1.35282,-3.74949 3.95149,-11.90126 4.30547,-13.50582 0.33816,-1.53281 0.77785,-2.26196 0.77785,-1.28991 0,0.70328 0.99018,4.10047 3.23287,11.09157 l 1.88849,5.88698 h 1.89179 1.89179 l 3.56358,-11.04636 3.56357,-11.04635 -1.96301,-0.0779 c -1.07966,-0.0428 -2.02183,-0.019 -2.09371,0.0528 -0.19565,0.19565 -3.67751,12.61379 -4.34167,15.48467 l -0.57721,2.49506 -0.70934,-2.6588 c -0.39014,-1.46235 -1.5909,-5.5346 -2.66835,-9.04946 l -1.95901,-6.39066 -1.83983,0.0721 -1.83983,0.0721 -1.27004,3.96875 c -1.6015,5.00455 -3.523069,11.27851 -3.930228,12.83229 l -0.311997,1.19062 -0.849971,-3.57187 c -0.467484,-1.96453 -1.492409,-6.04242 -2.27761,-9.06198 l -1.427638,-5.4901 h -2.167922 -2.167922 l 0.632727,2.05052 c 0.347999,1.12778 1.85683,6.12751 3.352954,11.1105 l 2.720226,9.05998 1.893207,0.002 1.893205,0.002 0.787559,-2.18281 z m 35.79839,-4.36562 c 1.20125,-3.60164 2.44607,-7.56047 2.76626,-8.7974 0.32018,-1.23692 0.64211,-2.07036 0.71538,-1.85208 0.0733,0.21828 0.4523,1.5875 0.84228,3.04271 0.38998,1.45521 1.54099,5.23544 2.5578,8.40052 l 1.84875,5.75469 1.90692,-0.002 1.90691,-0.002 3.50573,-10.91337 c 1.92815,-6.00223 3.50573,-11.00717 3.50573,-11.12198 0,-0.1148 -0.91085,-0.17396 -2.02412,-0.13146 l -2.02412,0.0773 -1.81332,6.35 c -0.99733,3.4925 -2.08755,7.57555 -2.42272,9.07344 l -0.60939,2.72345 -0.45668,-1.93714 c -0.25118,-1.06543 -1.44505,-5.14848 -2.65306,-9.07345 l -2.19637,-7.1363 -1.85601,-0.0769 -1.856,-0.0769 -0.40619,1.39984 c -0.22341,0.76992 -1.30311,4.2218 -2.39934,7.67085 -1.09623,3.44905 -2.14279,6.9397 -2.3257,7.75701 l -0.33255,1.48601 -0.86721,-3.65597 c -0.47697,-2.01078 -1.50538,-6.09675 -2.28536,-9.07992 l -1.41814,-5.42396 -2.19906,-0.0774 c -1.71225,-0.0602 -2.17014,-0.002 -2.06845,0.26458 0.0718,0.18807 1.59467,5.19375 3.38408,11.12373 l 3.25346,10.78177 h 1.9182 1.91819 z M 50.825145,107.78442 c -0.857352,-0.52282 -1.698616,-1.97047 -1.698616,-2.92301 0,-1.82534 1.658591,-3.45442 3.518869,-3.45625 2.02933,-0.002 3.432457,1.41217 3.432457,3.45947 0,2.64561 -2.98309,4.3038 -5.25271,2.91979 z"
         id="path909" />
      <path
         style="fill:#5c5b5b;stroke-width:0.264583"
         d="m 103.45214,110.46621 c 6.37748,-0.0395 16.73591,-0.0395 23.01875,3e-5 6.28284,0.0395 1.06491,0.0718 -11.59541,0.0718 -12.66031,-10e-6 -17.800812,-0.0323 -11.42334,-0.0718 z m 53.09522,-0.43069 c 0,-0.0549 0.20836,-0.2633 0.46302,-0.46302 0.41964,-0.32911 0.429,-0.31975 0.0999,0.0999 -0.34564,0.44073 -0.56291,0.58089 -0.56291,0.36312 z m -96.465761,-2.87666 -0.504028,-0.59532 0.595312,0.50403 c 0.559447,0.47366 0.715762,0.6866 0.504028,0.6866 -0.05021,0 -0.318097,-0.26789 -0.595312,-0.59531 z m 10.177846,0.13229 c -0.329107,-0.41965 -0.319749,-0.429 0.0999,-0.0999 0.254661,0.19972 0.463021,0.40808 0.463021,0.46302 0,0.21777 -0.217273,0.0776 -0.562917,-0.36312 z m 41.573335,-0.31512 c 0,-0.13693 0.1177,-0.32171 0.26155,-0.41061 0.14998,-0.0927 0.19434,0.0135 0.10398,0.24897 -0.17589,0.45836 -0.36553,0.54223 -0.36553,0.16164 z M 37.241168,106.5415 c 0.0127,-0.30823 0.07539,-0.37092 0.159853,-0.15986 0.07643,0.191 0.06703,0.4192 -0.02089,0.50712 -0.08792,0.0879 -0.150452,-0.0684 -0.138964,-0.34726 z m 119.570772,0.31902 c 0,-0.0549 0.20836,-0.2633 0.46302,-0.46302 0.41965,-0.3291 0.429,-0.31975 0.0999,0.0999 -0.34565,0.44073 -0.56292,0.58089 -0.56292,0.36312 z m 15.63131,-0.31902 c 0.0127,-0.30823 0.0754,-0.37092 0.15985,-0.15986 0.0764,0.191 0.067,0.4192 -0.0209,0.50712 -0.0879,0.0879 -0.15045,-0.0684 -0.13896,-0.34726 z m -78.452838,-0.45239 c 0.09936,-0.26094 0.247304,-0.40778 0.328766,-0.32632 0.08146,0.0815 1.7e-4,0.29496 -0.180652,0.47443 -0.261308,0.25937 -0.291698,0.22898 -0.148114,-0.14811 z m 2.672922,0.16575 c -0.09702,-0.097 -0.17639,-0.29942 -0.17639,-0.44979 0,-0.16579 0.123235,-0.15017 0.313089,0.0397 0.172202,0.1722 0.251577,0.37461 0.17639,0.44979 -0.07519,0.0752 -0.216077,0.0573 -0.313089,-0.0397 z m 3.941666,-0.16575 c 0.0994,-0.26094 0.2473,-0.40778 0.32876,-0.32632 0.0815,0.0815 1.7e-4,0.29496 -0.18065,0.47443 -0.26131,0.25937 -0.2917,0.22898 -0.14811,-0.14811 z m 2.61794,0.06 c -0.0959,-0.15521 -0.11766,-0.33894 -0.0483,-0.40829 0.0694,-0.0694 0.1966,0.0576 0.28277,0.28219 0.17891,0.46622 0.0264,0.54823 -0.23447,0.1261 z m 3.84734,0.0176 c 0,-0.14552 0.12609,-0.26458 0.2802,-0.26458 0.1541,0 0.20661,0.11906 0.11667,0.26458 -0.0899,0.14552 -0.21603,0.26458 -0.2802,0.26458 -0.0642,0 -0.11667,-0.11906 -0.11667,-0.26458 z m 52.91666,-0.0999 c 0,-0.0549 0.20836,-0.2633 0.46302,-0.46302 0.41965,-0.3291 0.429,-0.31975 0.0999,0.0999 -0.34565,0.44073 -0.56292,0.58089 -0.56292,0.36312 z M 143.0745,105.4832 c 0.0127,-0.30822 0.0754,-0.37092 0.15985,-0.15985 0.0764,0.191 0.067,0.4192 -0.0209,0.50712 -0.0879,0.0879 -0.15045,-0.0684 -0.13896,-0.34727 z m -73.788058,-0.7717 c 0.0054,-0.43656 0.06469,-0.58312 0.131773,-0.32569 0.06708,0.25743 0.06267,0.61462 -0.0098,0.79375 -0.07249,0.17913 -0.127376,-0.0315 -0.121984,-0.46806 z m -13.259858,-0.55121 c 0.0127,-0.30823 0.07539,-0.37092 0.159852,-0.15986 0.07643,0.191 0.06703,0.4192 -0.02089,0.50712 -0.08792,0.0879 -0.150452,-0.0683 -0.138964,-0.34726 z m 87.047916,0 c 0.0127,-0.30823 0.0754,-0.37092 0.15985,-0.15986 0.0764,0.191 0.067,0.4192 -0.0209,0.50712 -0.0879,0.0879 -0.15045,-0.0683 -0.13896,-0.34726 z m 17.40786,-0.0441 c -0.32911,-0.41965 -0.31975,-0.429 0.0999,-0.0999 0.44073,0.34565 0.58089,0.56292 0.36313,0.56292 -0.0549,0 -0.2633,-0.20836 -0.46302,-0.46302 z M 95.296319,104.05 c -0.08994,-0.14552 -0.03743,-0.26458 0.116676,-0.26458 0.154109,0 0.280199,0.11906 0.280199,0.26458 0,0.14552 -0.0525,0.26459 -0.116676,0.26459 -0.06417,0 -0.190262,-0.11907 -0.280199,-0.26459 z m 13.096871,0.0312 c 0,-0.14552 0.11907,-0.33817 0.26459,-0.4281 0.14552,-0.0899 0.26458,-0.0445 0.26458,0.10106 0,0.14552 -0.11906,0.33817 -0.26458,0.4281 -0.14552,0.0899 -0.26459,0.0445 -0.26459,-0.10106 z m 48.91417,-0.75883 c -0.32911,-0.41965 -0.31975,-0.429 0.0999,-0.0999 0.25466,0.19972 0.46302,0.40808 0.46302,0.46302 0,0.21777 -0.21727,0.0776 -0.56291,-0.36312 z m -86.881873,-1.12448 c 0.26339,-0.29104 0.538421,-0.52917 0.611182,-0.52917 0.07276,0 -0.08321,0.23813 -0.346599,0.52917 -0.26339,0.29104 -0.538422,0.52917 -0.611182,0.52917 -0.07276,0 0.08321,-0.23813 0.346599,-0.52917 z m 4.861041,0.0661 c -0.329107,-0.41964 -0.319749,-0.429 0.0999,-0.0999 0.44073,0.34564 0.580887,0.56292 0.363125,0.56292 -0.05494,0 -0.2633,-0.20836 -0.463021,-0.46303 z m 83.343742,-0.26458 c -0.3291,-0.41964 -0.31975,-0.429 0.0999,-0.0999 0.44073,0.34564 0.58089,0.56291 0.36312,0.56291 -0.0549,0 -0.2633,-0.20836 -0.46302,-0.46302 z m -3.175,-0.79375 c -0.3291,-0.41964 -0.31975,-0.429 0.0999,-0.0999 0.44073,0.34564 0.58089,0.56291 0.36312,0.56291 -0.0549,0 -0.2633,-0.20836 -0.46302,-0.46302 z m -102.938767,0.0177 c 0.190996,-0.0764 0.419199,-0.067 0.507118,0.0209 0.08792,0.0879 -0.06835,0.15045 -0.347265,0.13896 -0.308225,-0.0127 -0.37092,-0.0754 -0.159853,-0.15985 z m 10.03763,0.006 c 0.181901,-0.0734 0.479557,-0.0734 0.661458,0 0.181901,0.0734 0.03307,0.13345 -0.330729,0.13345 -0.363802,0 -0.51263,-0.0601 -0.330729,-0.13345 z m 10.054166,0 c 0.181901,-0.0734 0.479557,-0.0734 0.661458,0 0.181901,0.0734 0.03307,0.13345 -0.330729,0.13345 -0.363802,0 -0.51263,-0.0601 -0.330729,-0.13345 z m 15.411978,-0.18925 c 0,-0.0549 0.20836,-0.2633 0.463021,-0.46302 0.419645,-0.32911 0.429004,-0.31975 0.0999,0.0999 -0.345643,0.44073 -0.562917,0.58089 -0.562917,0.36313 z m 67.204163,-0.52917 c 0,-0.0549 0.20836,-0.2633 0.46302,-0.46302 0.41965,-0.329104 0.42901,-0.319746 0.0999,0.0999 -0.34565,0.44073 -0.56292,0.58089 -0.56292,0.36312 z m -51.92448,-1.421384 c 6.4393,-0.03945 16.97633,-0.03945 23.41563,0 6.43929,0.03945 1.17078,0.07172 -11.70781,0.07172 -12.8786,0 -18.147112,-0.03227 -11.70782,-0.07172 z M 41.453613,97.335524 c 0,-0.05494 0.208359,-0.263301 0.463021,-0.46302 0.419644,-0.329108 0.429002,-0.31975 0.09989,0.09989 -0.345644,0.44073 -0.562916,0.580887 -0.562916,0.363126 z M 167.89069,96.972398 c -0.32911,-0.419644 -0.31975,-0.429002 0.0999,-0.09989 0.44073,0.345643 0.58088,0.562915 0.36312,0.562915 -0.0549,0 -0.2633,-0.208359 -0.46302,-0.463021 z"
         id="path907" />
      <path
         style="fill:#000000;stroke-width:0.264583"
         d="m 37.292524,111.39219 c 0.142022,-6.44817 0.328718,-7.5157 1.838958,-10.51519 1.126545,-2.237424 4.250652,-5.407864 6.472398,-6.568386 0.900199,-0.470216 2.556354,-1.09014 3.680344,-1.377608 2.002146,-0.512063 3.131876,-0.52267 55.669386,-0.52267 52.53751,0 53.66724,0.01061 55.66939,0.52267 1.12399,0.287468 2.78014,0.907392 3.68034,1.377608 2.22175,1.160522 5.34585,4.330962 6.4724,6.568386 1.51024,2.99949 1.69693,4.06702 1.83896,10.51519 l 0.12966,5.88698 H 104.95361 37.162863 Z m 102.758926,-1.44753 c 1.88324,-1.00707 3.26982,-3.18618 3.26527,-5.1316 -0.006,-2.46862 -2.07417,-4.984674 -4.53581,-5.517498 -1.02965,-0.222869 -7.76678,-0.283807 -24.69918,-0.223406 l -23.283328,0.08305 -1.209193,0.710876 c -0.665057,0.390978 -1.558025,1.214238 -1.984375,1.829458 -0.690748,0.99676 -0.775181,1.3372 -0.775181,3.12558 0,1.72305 0.09605,2.14593 0.678918,2.98897 0.93201,1.34802 1.959618,2.10289 3.39671,2.49518 0.939562,0.25649 6.539767,0.32003 24.631659,0.27949 l 23.41563,-0.0525 z m -46.708259,-3.43069 c -1.095293,-4.20656 -1.077314,-4.08786 -0.605446,-3.99765 0.318463,0.0609 0.556464,0.63636 0.852001,2.06008 0.225552,1.08658 0.477808,1.85913 0.560572,1.71679 0.08276,-0.14235 0.30702,-1.06248 0.498343,-2.04475 0.264523,-1.35806 0.454351,-1.78594 0.792337,-1.78594 0.334098,0 0.525328,0.41064 0.770081,1.65365 0.502615,2.55261 0.580649,2.58762 1.038706,0.46603 0.29523,-1.36742 0.557932,-2.00625 0.847807,-2.06164 0.362683,-0.0693 0.330015,0.26439 -0.239292,2.44438 -0.517125,1.98018 -0.759446,2.52467 -1.1236,2.52467 -0.366914,0 -0.533694,-0.38842 -0.795269,-1.85209 -0.182041,-1.01864 -0.413097,-1.85208 -0.513458,-1.85208 -0.10036,0 -0.349184,0.80233 -0.55294,1.78295 -0.448879,2.16035 -1.107546,2.56747 -1.529842,0.9456 z m 6.614583,0 c -1.096629,-4.2117 -1.073978,-4.05147 -0.572725,-4.05147 0.374399,0 0.534157,0.39481 0.808321,1.9976 0.18794,1.09868 0.42603,1.90236 0.52909,1.78594 0.10307,-0.11641 0.3419,-0.96667 0.53075,-1.88945 0.29864,-1.45921 0.80331,-2.23354 1.19828,-1.83857 0.0665,0.0665 0.25107,0.82534 0.41019,1.68633 0.4535,2.4539 0.54687,2.48842 1.01651,0.37585 0.3074,-1.38277 0.57074,-2.00835 0.86967,-2.06592 0.37508,-0.0722 0.34855,0.20898 -0.21191,2.24607 -0.35237,1.28075 -0.64067,2.41877 -0.64067,2.52894 0,0.11016 -0.22731,0.2003 -0.50514,0.2003 -0.4175,0 -0.56257,-0.32134 -0.83613,-1.85209 -0.18204,-1.01864 -0.40455,-1.85208 -0.49446,-1.85208 -0.0899,0 -0.33873,0.80237 -0.55294,1.78305 -0.47171,2.15961 -1.12834,2.56046 -1.548836,0.9455 z m 6.609946,0 c -0.87446,-3.30015 -0.95993,-4.05147 -0.46091,-4.05147 0.24084,0 0.47177,0.65665 0.69986,1.99007 0.18722,1.09454 0.41142,1.91906 0.49822,1.83227 0.0868,-0.0868 0.33879,-0.9512 0.56,-1.9209 0.5454,-2.39077 1.15907,-2.54458 1.57702,-0.39526 0.51567,2.65183 0.68218,2.78728 1.04734,0.85202 0.35374,-1.87475 0.61353,-2.47822 1.0006,-2.3243 0.13754,0.0547 -0.0434,1.18536 -0.40747,2.54579 -0.51493,1.92429 -0.75552,2.4474 -1.12563,2.4474 -0.37961,0 -0.53503,-0.38281 -0.80306,-1.97796 -0.1828,-1.08788 -0.39792,-1.9124 -0.47805,-1.83227 -0.0801,0.0801 -0.32669,0.93908 -0.5479,1.90879 -0.48763,2.13756 -1.13685,2.52285 -1.56002,0.92582 z m 5.57639,0.56476 c 0.11966,-0.5747 0.58923,-0.60987 0.69663,-0.0522 0.0558,0.28962 -0.074,0.46303 -0.34651,0.46303 -0.25419,0 -0.40004,-0.17115 -0.35012,-0.41086 z m 46.76415,0.45472 c 1.17536,-1.35832 2.13701,-2.5927 2.13701,-2.74307 0,-0.22712 -0.9985,-1.42185 -4.13565,-4.948393 -0.28262,-0.317707 -0.42869,-0.307237 -1.00785,0.07225 -0.37253,0.244083 -0.67733,0.572383 -0.67733,0.729553 0,0.15716 0.55125,0.89856 1.22499,1.64755 l 1.225,1.36179 -3.47396,0.0738 -3.47395,0.0738 v 0.91836 0.91836 h 3.59652 3.59651 l -1.14912,1.3439 c -1.77558,2.07654 -1.76548,2.05043 -1.01682,2.6297 0.3638,0.28148 0.7416,0.48484 0.83955,0.45191 0.0979,-0.0329 1.13974,-1.17124 2.3151,-2.52956 z m -104.1294,0.14377 c 1.43972,-1.00895 1.884424,-3.11172 0.973895,-4.60503 -0.724471,-1.18816 -1.712405,-1.75622 -3.054351,-1.75622 -2.611024,0 -4.376613,2.79162 -3.202087,5.0629 1.050083,2.03064 3.409957,2.61065 5.282543,1.29835 z m 10.596258,-0.43911 c 0.728823,-0.72882 0.817036,-0.98601 0.817036,-2.38207 0,-1.36829 -0.09696,-1.66625 -0.771248,-2.37005 -1.051009,-1.09702 -2.213406,-1.45368 -3.557841,-1.09166 -2.768838,0.74557 -3.536604,4.49229 -1.271824,6.20654 1.503349,1.1379 3.429255,0.99186 4.783877,-0.36276 z m 9.446278,0.57653 c 1.529569,-0.87736 2.068094,-3.06757 1.177634,-4.78953 -0.588399,-1.13784 -2.402152,-1.98328 -3.72314,-1.73546 -3.610716,0.67737 -3.993163,5.64662 -0.527487,6.8538 1.133025,0.39466 1.96736,0.30538 3.072993,-0.32881 z"
         id="path905" />
    </g>
  </g>
</svg>
