sprite $envoy_min50 [67x50/8z] {
dTPfUiGW38FXIkB-L-uAwPT2YGV_cVsDBUQ1l9KhhRa_FIgbVLME0RTUfqZQhNGu0Ikd4xH8uwcF9eX8HYzFu8dDIq1kVQiOg-uJh0DABKPlG_8Z4JzT8jeJ
gQnM7WZfEQxi2IVFWMd19o3Y3R8cdDo9HFj0F04abEzocL2IaFXzInM2Wd_Y3lfAYJ2kA2pNS4j41qYmlPdmYkZFGR2HGuADR8cu4p88bFybClQN3AAr9Q4T
yVrr4YtzhriatDf4jDU88LpJvemm0rETq4NypToT2B-U9DeGqtMmqHyHtDQE2Mxq6y9RWXizYVaB9FYb5ZGI43mnrqHynUcHI7zEmi6HZVNd9ZVUDXfnjBZh
kBxBVSjzXZdMzKq32JQY_ZQkAG1KkVZttJRp-Sa940oyvIPdZLXPMQpkV1ZewWhJO0BMv7eWGKlX1FiZsiQf1A9FauSRZlu4ZIH1RjjZNjEi0Afb2jygrgLQ
IEkunBJgzG4
}

