<?xml version="1.0" encoding="UTF-8" standalone="no"?>
<svg
   xmlns:dc="http://purl.org/dc/elements/1.1/"
   xmlns:cc="http://creativecommons.org/ns#"
   xmlns:rdf="http://www.w3.org/1999/02/22-rdf-syntax-ns#"
   xmlns:svg="http://www.w3.org/2000/svg"
   xmlns="http://www.w3.org/2000/svg"
   xmlns:sodipodi="http://sodipodi.sourceforge.net/DTD/sodipodi-0.dtd"
   xmlns:inkscape="http://www.inkscape.org/namespaces/inkscape"
   width="149.9993mm"
   height="98.907997mm"
   viewBox="0 0 149.99931 98.907996"
   version="1.1"
   id="svg27551"
   sodipodi:docname="ide.svg"
   inkscape:export-filename="/home/ostraaten/svn/doc/dxc-uwv/cd-platform/png/team.png"
   inkscape:export-xdpi="25.4"
   inkscape:export-ydpi="25.4"
   inkscape:version="1.0.1 (3bc2e813f5, 2020-09-07)">
  <defs
     id="defs27545" />
  <sodipodi:namedview
     id="base"
     pagecolor="#ffffff"
     bordercolor="#666666"
     borderopacity="1.0"
     inkscape:pageopacity="0.0"
     inkscape:pageshadow="2"
     inkscape:zoom="0.35"
     inkscape:cx="-401.84433"
     inkscape:cy="280.28965"
     inkscape:document-units="mm"
     inkscape:current-layer="layer1"
     inkscape:document-rotation="0"
     showgrid="false"
     fit-margin-top="0"
     fit-margin-left="0"
     fit-margin-right="0"
     fit-margin-bottom="0"
     inkscape:window-width="1465"
     inkscape:window-height="1080"
     inkscape:window-x="2012"
     inkscape:window-y="52"
     inkscape:window-maximized="0" />
  <metadata
     id="metadata27548">
    <rdf:RDF>
      <cc:Work
         rdf:about="">
        <dc:format>image/svg+xml</dc:format>
        <dc:type
           rdf:resource="http://purl.org/dc/dcmitype/StillImage" />
        <dc:title></dc:title>
      </cc:Work>
    </rdf:RDF>
  </metadata>
  <g
     inkscape:label="Layer 1"
     inkscape:groupmode="layer"
     id="layer1"
     transform="translate(-14.473601,-183.55463)">
    <g
       transform="matrix(0.48725265,0,0,0.48725265,53.639838,103.81703)"
       id="g22510-9-0-7"
       style="stroke-width:0.0424281">
      <g
         id="g22394-3-0-6"
         style="fill:#000000;stroke:none;stroke-width:0.0424281">
        <path
           inkscape:connector-curvature="0"
           id="path22364-6-4-5"
           d="m -80.30619,366.30446 c -0.06975,-0.18375 -0.09604,-45.85677 -0.05843,-101.49561 l 0.06838,-101.16151 H 73.517373 227.33099 l 0.0671,101.4956 0.0672,101.4956 H 73.642973 c -122.81207,0 -153.847918,-0.0674 -153.949163,-0.33408 z M 138.73113,271.49059 V 188.90431 H 35.431463 -67.868207 v 82.58628 82.58629 H 35.431463 138.73113 Z m 76.17182,0 v -82.58628 h -31.80508 -31.80506 v 82.58628 82.58629 h 31.80506 31.80508 z"
           style="opacity:1;fill:#000000;fill-opacity:1;stroke:none;stroke-width:0.00857174;stroke-miterlimit:4;stroke-dasharray:none;stroke-dashoffset:0;stroke-opacity:1" />
        <path
           inkscape:connector-curvature="0"
           id="path22366-8-6-6"
           d="m -54.771997,264.10843 c 0,-0.0913 2.22067,-7.63827 4.93483,-16.77117 2.71416,-9.1329 6.84459,-23.09992 9.17872,-31.03782 l 4.24388,-14.43256 4.18476,-0.0736 c 2.85047,-0.0501 4.18476,0.0179 4.18476,0.21354 0,0.15793 -3.78265,13.06008 -8.40588,28.67145 -4.62323,15.61136 -8.74253,29.55617 -9.15398,30.98847 l -0.7481,2.60418 -4.2095,0.002 c -2.31522,10e-4 -4.20949,-0.0729 -4.20949,-0.1641 z"
           style="opacity:1;fill:#000000;fill-opacity:1;stroke:none;stroke-width:0.00857174;stroke-miterlimit:4;stroke-dasharray:none;stroke-dashoffset:0;stroke-opacity:1" />
        <path
           inkscape:connector-curvature="0"
           id="path22368-0-2-9"
           d="m -16.285187,234.30396 c -1.39648,-0.87194 -2.93358,-1.81995 -3.41577,-2.10669 l -0.8767,-0.52134 4.48484,-5.22673 c 2.46667,-2.8747 4.52494,-5.34218 4.57393,-5.48327 0.137,-0.3945 -0.43935,-0.31927 -7.03809,0.91863 -3.38096,0.63426 -6.23741,1.1033 -6.34766,1.04232 -0.22266,-0.12317 -0.28178,-7.927 -0.0617,-8.14706 0.0763,-0.0763 3.09414,0.45387 6.70632,1.17814 3.61218,0.72427 6.6281,1.25635 6.70206,1.18239 0.074,-0.074 -1.7111,-2.33457 -3.9668,-5.02357 -2.2557,-2.68901 -4.31026,-5.15019 -4.56569,-5.4693 -0.46236,-0.57762 -0.44828,-0.58936 3.17082,-2.64698 2.66024,-1.51247 3.69093,-1.97666 3.84293,-1.73072 0.11423,0.18483 1.20974,3.08637 2.43445,6.44787 1.2247197,3.36149 2.3503597,6.11093 2.5014197,6.10987 0.15106,-0.001 1.3426,-2.88758 2.64787,-6.41447 1.30527,-3.52689 2.46717,-6.41253 2.582,-6.41253 0.44994,0 6.94807,3.89146 6.91763,4.14267 -0.0178,0.147 -1.95083,2.52822 -4.29556999,5.2916 -4.29918001,5.06676 -4.83391001,5.80009 -4.22925001,5.80009 0.36543,0 12.48674,-2.36988 13.02224,-2.54603 0.25783,-0.0848 0.33409,0.85585 0.33409,4.12097 v 4.23086 l -0.60136,-0.10137 c -0.33075,-0.0557 -3.36137,-0.5805 -6.73473,-1.16611 -3.37335,-0.58561 -6.22272,-0.97434 -6.33194,-0.86383 -0.1092,0.1105 1.83898,2.50959 4.32930001,5.33131 2.49032999,2.82172 4.52787999,5.23395 4.52787999,5.36051 0,0.23963 -6.63368,4.20892 -7.03418,4.20892 -0.12555,0 -1.28282,-2.88067 -2.57172,-6.40151 -1.28891,-3.52082 -2.46756,-6.44287 -2.61924,-6.49343 -0.15168,-0.0506 -0.41255,0.30443 -0.57971,0.78885 -1.04615,3.03167 -4.6656097,12.23505 -4.8028597,12.21251 -0.0911,-0.015 -1.3083,-0.74063 -2.70479,-1.61257 z"
           style="opacity:1;fill:#000000;fill-opacity:1;stroke:none;stroke-width:0.00857174;stroke-miterlimit:4;stroke-dasharray:none;stroke-dashoffset:0;stroke-opacity:1" />
        <path
           inkscape:connector-curvature="0"
           id="path22370-2-6-3"
           d="m 18.459853,313.27519 c -2.78395,-0.43302 -4.20823,-1.24767 -5.51997,-3.1573 -1.24712,-1.81556 -1.50043,-3.35655 -1.67059,-10.16309 l -0.16036,-6.41447 -0.76985,-1.28654 c -0.8796103,-1.46996 -1.5417203,-1.98122 -2.8512503,-2.20168 -2.36884,-0.39879 -2.12419,0.19553 -2.12419,-5.16023 v -4.76286 l 0.68075,-0.31017 c 0.37441,-0.17059 0.9457,-0.31062 1.26953,-0.31117 1.0477,-0.002 2.2815,-0.99942 3.0443103,-2.46161 0.72264,-1.38518 0.74053,-1.53297 0.91507,-7.56 0.18664,-6.44487 0.33838,-7.46454 1.42635,-9.58514 0.84645,-1.64985 1.12212,-1.97472 2.3142,-2.72725 1.47803,-0.93304 3.42818,-1.26008 8.19003,-1.37349 l 4.34313,-0.10343 v 4.55605 4.55604 h -1.0533 c -0.57932,0 -1.12192,0.11102 -1.20578,0.24671 -0.0839,0.13569 -0.50352,0.32381 -0.93257,0.41805 -0.4527,0.0994 -1.09031,0.57805 -1.51927,1.14044 -0.72942,0.95633 -0.74205,1.03961 -0.9576,6.31335 -0.15043,3.68047 -0.32559,5.47439 -0.56263,5.76231 -0.18931,0.22993 -0.49527,1.01942 -0.6799,1.75441 -0.38855,1.54673 -1.54778,2.89324 -2.79818,3.25025 -1.21453,0.34677 -1.29683,1.27828 -0.16753,1.89633 1.5094,0.82607 2.58602,2.02402 2.94419,3.27598 0.18868,0.65953 0.51376,1.40124 0.72241,1.64824 0.28658,0.33925 0.40922,1.64666 0.50142,5.34539 0.1547,6.2062 0.19605,6.44842 1.28675,7.53913 0.7727,0.7727 1.14307,0.92398 2.65985,1.08641 l 1.76214,0.18871 v 4.38867 4.38868 l -4.20949,-0.0364 c -2.31523,-0.02 -4.51018,-0.0832 -4.87767,-0.14032 z"
           style="opacity:1;fill:#000000;fill-opacity:1;stroke:none;stroke-width:0.00857174;stroke-miterlimit:4;stroke-dasharray:none;stroke-dashoffset:0;stroke-opacity:1" />
        <path
           inkscape:connector-curvature="0"
           id="path22372-1-7-7"
           d="m 28.414013,301.0961 c 0.0696,-0.18672 0.29323,-0.82058 0.49697,-1.40857 0.20374,-0.58799 0.43707,-1.12921 0.51851,-1.20272 0.0814,-0.0735 0.30294,-0.67485 0.49223,-1.33634 0.18929,-0.6615 0.50438,-1.45413 0.70019,-1.76142 0.19582,-0.30728 0.49546,-1.08905 0.66587,-1.73725 0.1704,-0.6482 0.60116,-1.80252 0.95723,-2.56516 0.35607,-0.76264 0.64739,-1.60632 0.64739,-1.87485 0,-0.26853 0.22285,-0.9074 0.49523,-1.41971 0.27237,-0.51232 0.6437,-1.41258 0.82516,-2.00057 0.18147,-0.58799 0.54361,-1.55016 0.80476,-2.13815 0.26114,-0.588 0.86327,-2.18959 1.33806,-3.5591 0.47479,-1.36952 1.03164,-2.81277 1.23744,-3.20724 0.2058,-0.39447 0.37492,-0.90225 0.37583,-1.12842 7.9e-4,-0.22617 0.24422,-0.887 0.54069,-1.46852 0.29648,-0.58153 0.73624,-1.7796 0.97724,-2.6624 0.241,-0.88279 0.55757,-1.75926 0.70348,-1.94771 0.14592,-0.18845 0.55124,-1.21076 0.9007,-2.27179 0.34947,-1.06103 0.77398,-2.20192 0.94336,-2.53532 l 0.30796,-0.60616 6.13954,0.0716 6.13954,0.0716 0.34292,0.99095 c 0.1886,0.54502 0.51843,1.38692 0.73295,1.87089 0.21452,0.48396 0.566,1.42116 0.78107,2.08265 0.85134,2.61845 2.4054,6.87212 2.88056,7.88445 0.27598,0.58799 0.64865,1.6103 0.82814,2.27179 0.1795,0.66149 0.46906,1.38312 0.64348,1.60362 0.17442,0.22049 0.46015,0.98835 0.63496,1.70635 0.1748,0.718 0.54002,1.74098 0.81158,2.27329 0.27157,0.53232 0.63552,1.4943 0.80878,2.13774 0.17326,0.64344 0.60676,1.8077 0.96333,2.58725 0.35657,0.77955 0.64832,1.59572 0.64832,1.81373 0,0.218 0.16928,0.73686 0.37618,1.15302 0.2069,0.41616 0.52161,1.11746 0.69935,1.55846 0.17775,0.44099 0.41412,0.98616 0.52528,1.21148 0.11116,0.22533 0.28919,0.82668 0.39562,1.33635 0.10644,0.50967 0.41631,1.31409 0.68861,1.7876 0.27229,0.47351 0.5747,1.28534 0.67202,1.80407 l 0.17693,0.94314 -5.57559,-0.001 -5.57558,-10e-4 -0.44982,-1.13489 c -0.2474,-0.62406 -0.59066,-1.85639 -0.76279,-2.73838 -0.51935,-2.66104 -0.14506,-2.53906 -7.79074,-2.53906 -5.08777,0 -6.67203,0.0784 -6.7481,0.33409 -0.0547,0.18375 -0.29998,0.93544 -0.54514,1.67044 -0.24517,0.73499 -0.59239,1.99783 -0.77162,2.80632 l -0.32586,1.46999 -5.69938,0.0722 c -4.51947,0.0573 -5.67317,0.002 -5.57284,-0.26727 z m 23.78489,-15.02968 c -0.0388,-0.72969 -0.18913,-1.4453 -0.33408,-1.59025 -0.14495,-0.14495 -0.26355,-0.53307 -0.26355,-0.86249 0,-0.32942 -0.10405,-0.66325 -0.23122,-0.74185 -0.12716,-0.0786 -0.37844,-0.89752 -0.55839,-1.81984 -0.17994,-0.92232 -0.47923,-1.85735 -0.66507,-2.07785 -0.18585,-0.2205 -0.49146,-1.18267 -0.67912,-2.13816 -0.33776,-1.71963 -0.87997,-2.93996 -1.30627,-2.93996 -0.23361,0 -0.80983,1.60255 -1.67962,4.67129 -0.29073,1.02573 -0.62954,1.9879 -0.75293,2.13816 -0.12338,0.15025 -0.37569,1.05495 -0.56069,2.01044 -0.18499,0.95549 -0.57163,2.19283 -0.85919,2.74964 -0.50396,0.97583 -0.50547,1.03157 -0.0419,1.54385 0.44331,0.48985 0.77537,0.52568 4.24175,0.4576 l 3.76079,-0.0739 z"
           style="opacity:1;fill:#000000;fill-opacity:1;stroke:none;stroke-width:0.00857174;stroke-miterlimit:4;stroke-dasharray:none;stroke-dashoffset:0;stroke-opacity:1" />
        <path
           inkscape:connector-curvature="0"
           id="path22374-0-5-4"
           d="m 71.111953,309.06323 v -4.38867 l 1.68389,-0.18033 c 1.77497,-0.19008 2.42535,-0.55571 3.32261,-1.86791 0.62728,-0.91736 0.79332,-2.17012 1.09799,-8.28418 0.1557,-3.12432 0.33052,-4.49232 0.64897,-5.07812 0.23973,-0.441 0.63064,-1.16263 0.86868,-1.60362 0.23805,-0.44099 1.02587,-1.19361 1.75073,-1.67249 0.72485,-0.47887 1.31791,-1.04197 1.31791,-1.25133 0,-0.3919 -1.34184,-1.48613 -1.82241,-1.48613 -0.31167,0 -1.93793,-2.48513 -2.2737,-3.4745 -0.12472,-0.3675 -0.32708,-2.59252 -0.44968,-4.94449 -0.26542,-5.09152 -0.51065,-6.67129 -1.22637,-7.90011 -0.63641,-1.09266 -2.47949,-2.0841 -3.91636,-2.10672 l -1.00226,-0.0158 v -4.55605 -4.55604 l 4.34312,0.10343 c 4.77709,0.11377 6.71158,0.44018 8.20827,1.385 1.55284,0.98026 2.27963,2.04759 3.03399,4.45552 0.64965,2.07373 0.70562,2.65136 0.78602,8.11263 0.0769,5.22562 0.14439,5.98402 0.60617,6.81537 0.89396,1.60943 2.02392,2.65503 3.05056,2.82279 0.52389,0.0856 1.22313,0.28759 1.55388,0.44884 0.59003,0.28768 0.60136,0.38254 0.60136,5.03765 v 4.74446 l -0.735,0.14573 c -0.40424,0.0802 -1.1696,0.22028 -1.70079,0.31141 -0.80154,0.1375 -1.16464,0.44587 -2.13499,1.81321 l -1.16921,1.64753 -0.093,6.1472 c -0.0858,5.66973 -0.14397,6.30053 -0.74847,8.12127 -0.77822,2.34396 -1.03423,2.74026 -2.61303,4.0449 -1.01822,0.84141 -1.51706,1.04153 -3.23196,1.2966 -1.11534,0.16588 -3.76691,0.30161 -5.89239,0.30161 h -3.86448 z"
           style="opacity:1;fill:#000000;fill-opacity:1;stroke:none;stroke-width:0.00857174;stroke-miterlimit:4;stroke-dasharray:none;stroke-dashoffset:0;stroke-opacity:1" />
        <path
           inkscape:connector-curvature="0"
           id="path22376-5-6-5"
           d="m 157.70726,220.70938 v -6.14719 h 6.28084 6.28084 v 6.14719 6.1472 h -6.28084 -6.28084 z"
           style="opacity:1;fill:#000000;fill-opacity:1;stroke:none;stroke-width:0.00857174;stroke-miterlimit:4;stroke-dasharray:none;stroke-dashoffset:0;stroke-opacity:1" />
        <path
           inkscape:connector-curvature="0"
           id="path22378-1-9-2"
           d="m 157.76917,201.66643 0.0717,-6.21402 h 6.1472 6.14719 l 0.0718,6.21402 0.0717,6.21402 h -6.29068 -6.29068 z"
           style="opacity:1;fill:#000000;fill-opacity:1;stroke:none;stroke-width:0.00857174;stroke-miterlimit:4;stroke-dasharray:none;stroke-dashoffset:0;stroke-opacity:1" />
        <path
           inkscape:connector-curvature="0"
           id="path22380-1-8-5"
           d="m 176.95067,201.59615 v -6.2843 l 9.28762,0.0703 9.28761,0.0703 0.0718,6.21402 0.0717,6.21402 h -9.35935 -9.35937 z"
           style="opacity:1;fill:#000000;fill-opacity:1;stroke:none;stroke-width:0.00857174;stroke-miterlimit:4;stroke-dasharray:none;stroke-dashoffset:0;stroke-opacity:1" />
        <path
           inkscape:connector-curvature="0"
           id="path22382-0-7-4"
           d="m 176.95067,220.70938 v -6.14719 h 15.63526 15.63529 v 6.14719 6.1472 h -15.63529 -15.63526 z"
           style="opacity:1;fill:#000000;fill-opacity:1;stroke:none;stroke-width:0.00857174;stroke-miterlimit:4;stroke-dasharray:none;stroke-dashoffset:0;stroke-opacity:1" />
      </g>
      <path
         style="opacity:1;fill:#24566d;fill-opacity:1;stroke:none;stroke-width:0.0320717;stroke-miterlimit:4;stroke-dasharray:none;stroke-dashoffset:0;stroke-opacity:1"
         d="M -256.25536,1026.2932 V 714.66114 h 389.91889 389.91888 v 311.63206 311.6321 H 133.66353 -256.25536 Z m 360.62446,142.0655 v -17.0335 l -5.64284,-0.6632 c -13.41822,-1.5771 -14.64702,-3.9245 -15.782179,-30.1495 -0.827012,-19.106 -0.98903,-20.2101 -3.92813,-26.7691 -3.426154,-7.6458 -5.722474,-10.509 -11.264878,-14.0456 -2.083439,-1.3295 -3.788072,-3.0842 -3.788072,-3.8993 0,-0.8151 1.704633,-2.3561 3.788072,-3.4245 5.399932,-2.7691 7.986115,-5.9198 10.843028,-13.2097 3.238256,-8.263 3.408851,-9.4001 4.548323,-30.3157 0.797516,-14.6388 1.282823,-18.0833 2.846418,-20.2031 2.754474,-3.7341 9.160367,-6.9262 14.087108,-7.0196 l 4.29315,-0.081 v -17.6777 -17.67767 l -8.333755,0.0165 c -15.362683,0.0303 -30.704102,1.75093 -35.830545,4.0186 -6.380498,2.8224 -8.98654,5.40786 -12.561732,12.46256 -3.532978,6.97138 -4.521362,14.06045 -5.727656,41.08111 -0.717198,16.0651 -1.13628,19.2725 -2.986112,22.8539 -2.668156,5.1657 -7.647724,9.4709 -10.954387,9.4709 -1.373919,0 -3.839166,0.6936 -5.47833,1.5412 l -2.980294,1.5411 0.119512,14.8739 c 0.159381,19.8349 0.377999,20.7108 5.443378,21.8097 7.452057,1.6166 9.673605,2.9241 12.916336,7.602 l 3.226831,4.655 1.190707,25.7588 c 1.383475,29.9293 2.207517,33.7337 8.925213,41.2054 7.631077,8.4875 8.298171,8.6277 48.232613,10.1317 l 4.798221,0.1807 z m 192.71162,16.0704 c 14.42695,-1.0485 19.43598,-2.9396 24.99791,-9.4375 6.44979,-7.5351 7.78364,-14.0316 8.46881,-41.247 l 0.60091,-23.8685 3.93077,-5.7071 c 4.68821,-6.8068 4.56506,-6.7208 11.66772,-8.1425 l 5.61471,-1.1238 0.27706,-16.9002 c 0.16089,-9.8144 -0.14288,-17.6849 -0.72451,-18.7717 -0.55087,-1.0293 -2.98411,-2.3706 -5.40719,-2.9808 -5.56448,-1.4011 -9.12122,-4.1905 -12.33421,-9.6731 -2.41868,-4.1271 -2.56907,-5.3581 -3.41572,-27.9578 -0.97854,-26.11985 -2.358,-33.10035 -8.11053,-41.04147 -4.89611,-6.75889 -11.23918,-9.17848 -27.37654,-10.44291 -7.49047,-0.58691 -16.57373,-0.92613 -20.18503,-0.75382 l -6.56599,0.3133 v 17.1726 17.1726 l 5.12237,0.6252 c 6.20024,0.7568 8.50318,1.9096 11.9147,5.9639 3.68765,4.3826 4.43177,8.0617 6.07639,30.0428 1.37039,18.3159 1.63049,19.7701 4.42685,24.7487 1.63399,2.9092 4.96997,6.819 7.41327,8.6884 2.4433,1.8694 4.5729,3.9432 4.73244,4.6085 0.15953,0.6652 -1.94564,3.0946 -4.67814,5.3987 -5.29827,4.4676 -9.62439,10.9346 -10.62856,15.8883 -0.33787,1.6667 -1.09268,10.9854 -1.67735,20.7081 -1.21451,20.1962 -2.02537,24.139 -5.8315,28.3553 -2.18546,2.4209 -4.13531,3.2789 -9.7994,4.3119 l -7.07107,1.2897 -0.27998,15.5565 c -0.15399,8.5562 -0.0546,16.1439 0.22084,16.8617 0.59946,1.5622 10.2469,1.6775 28.62097,0.342 z m -39.1783,-46.7666 c -0.005,-1.25 -1.14185,-4.7044 -2.52538,-7.6764 -1.38354,-2.972 -2.51551,-5.851 -2.51551,-6.3977 0,-0.5468 -1.41948,-4.4791 -3.15439,-8.7386 -3.7095,-9.1073 -10.54576,-27.5016 -16.58118,-44.615 -1.27361,-3.6113 -4.44385,-12.0208 -7.04499,-18.6878 -4.33706,-11.1163 -15.35264,-41.0678 -17.88508,-48.6297 -1.38109,-4.12387 -3.01794,-4.37807 -28.28235,-4.39217 -18.70801,-0.0104 -19.97877,0.1081 -20.96777,1.95607 -0.97868,1.8287 -4.80991,11.8767 -9.07157,23.7917 -3.88083,10.8503 -15.56123,42.1162 -20.7556,55.5584 -3.00568,7.7782 -7.11048,18.6878 -9.12178,24.2436 -2.0113,5.5559 -5.66849,15.1701 -8.12708,21.365 -2.4586,6.195 -4.47018,11.7634 -4.47018,12.3744 0,0.7733 6.52331,1.1071 21.46574,1.0984 l 21.46574,-0.012 2.16743,-8.8263 c 1.19208,-4.8545 2.65817,-10.0765 3.25799,-11.6043 l 1.09057,-2.778 h 24.58067 c 18.11078,0 25.01513,0.3324 26.23127,1.2627 0.90783,0.6945 2.5953,5.0126 3.74993,9.5957 1.15462,4.5832 2.61725,9.4698 3.25029,10.8592 l 1.15098,2.5261 h 21.05107 21.05105 l -0.0101,-2.2728 z M -164.58535,963.66375 c 51.80662,-175.2079 58.88534,-199.86625 57.61827,-200.70994 -1.48813,-0.99087 -29.58028,-0.65935 -30.59631,0.36108 -0.36773,0.36932 -5.12892,15.82465 -10.58042,34.34518 -5.45151,18.52053 -20.86983,70.77898 -34.26295,116.1299 -13.39312,45.35091 -24.35112,82.9427 -24.35112,83.53733 0,1.3013 6.94249,1.88304 21.16252,1.77326 l 10.55591,-0.0815 z m 120.231037,-88.13581 c 3.431569,-8.75045 7.668695,-19.69709 9.415834,-24.32588 1.74715,-4.62878 3.560839,-8.03175 4.030428,-7.56217 0.4696,0.4696 4.53806,10.39346 9.041027,22.05304 10.534325,27.27661 9.890656,25.74491 10.818764,25.74491 0.440103,0 5.5652538,-2.85692 11.38921759,-6.3487 C 13.609291,877.13406 15.476063,875.92464 15.474113,875.28494 15.473255,875.0019 8.399793,866.58809 -0.24468845,856.58758 -8.8891699,846.58707 -16.409483,837.60067 -16.956501,836.61779 c -1.161079,-2.08624 -3.19889,-2.29674 28.267937,2.92007 11.321477,1.87696 20.981061,3.41266 21.465742,3.41266 0.484681,0 0.881247,-6.8328 0.881247,-15.18399 0,-11.90027 -0.298298,-15.29847 -1.379353,-15.71331 -0.758645,-0.29112 -11.927437,1.54143 -24.819529,4.07232 -12.8921022,2.53089 -23.916846,4.60162 -24.499432,4.60162 -1.372029,0 1.69938,-4.02756 18.3296829,-24.03581 7.5244445,-9.05281 13.8128261,-16.83562 13.9741881,-17.29512 0.442699,-1.26067 -25.600943,-17.03581 -26.553052,-16.0837 -0.22485,0.22485 -3.394183,8.12123 -7.042945,17.54751 -11.869838,30.66467 -12.676495,32.28179 -13.965925,27.99783 -2.30242,-7.64948 -16.927672,-44.21135 -17.801686,-44.50269 -1.142634,-0.38088 -18.63689,8.60783 -23.570657,12.11082 -1.527856,1.08478 -2.764565,2.50958 -2.748241,3.16623 0.01636,0.65665 6.639924,9.14886 14.719125,18.87157 8.079189,9.72272 15.12764,18.47317 15.663223,19.44544 1.389313,2.52211 -0.02626,2.39065 -24.474754,-2.27284 -11.650665,-2.22234 -21.781616,-4.04061 -22.513229,-4.04061 -1.729109,0 -2.549262,9.87034 -1.845609,22.21135 l 0.5264,9.23237 4.149363,-0.67335 c 2.282147,-0.37035 12.747721,-2.21764 23.256843,-4.1051 10.509112,-1.88747 19.967191,-3.43176 21.017941,-3.43176 1.741867,0 1.778727,0.18808 0.417678,2.13124 -0.821021,1.17218 -8.233541,10.08573 -16.472254,19.8079 -8.238714,9.72217 -14.979482,18.10235 -14.979482,18.62265 0,1.03586 23.589638,15.93336 25.301705,15.97872 0.581919,0.0154 3.865692,-7.13143 7.297261,-15.88187 z"
         id="path22419-8-2-7"
         inkscape:connector-curvature="0"
         transform="scale(0.26458333)" />
      <path
         style="opacity:1;fill:#24566d;fill-opacity:1;stroke:none;stroke-width:0.0323973;stroke-miterlimit:4;stroke-dasharray:none;stroke-dashoffset:0;stroke-opacity:1"
         d="m 167.99527,1084.5692 c -2.12753,-1.7228 -2.16917,-1.9991 -0.72287,-4.7982 0.84408,-1.6336 2.06226,-5.0157 2.70708,-7.5159 2.86538,-11.1098 11.40763,-36.3654 12.29994,-36.3654 1.17064,0 3.40399,5.1537 4.37749,10.1015 0.38259,1.9445 1.54711,5.8084 2.58781,8.5863 3.26136,8.7055 8.05842,25.9331 8.05842,28.9402 v 2.8796 h -13.52515 c -11.54596,0 -13.85551,-0.2675 -15.78272,-1.8281 z"
         id="path22421-5-8-4"
         inkscape:connector-curvature="0"
         transform="scale(0.26458333)" />
      <path
         style="opacity:1;fill:#24566d;fill-opacity:1;stroke:none;stroke-width:0.0323973;stroke-miterlimit:4;stroke-dasharray:none;stroke-dashoffset:0;stroke-opacity:1"
         d="M 572.06973,1026.2932 V 714.66114 h 119.70308 119.70307 v 311.63206 311.6321 H 691.77281 572.06973 Z m 71.72083,-191.94726 v -23.75687 l -23.99112,0.27082 -23.99112,0.27082 -0.27288,22.19946 c -0.15008,12.2097 -0.0507,22.77842 0.22084,23.48604 0.3805,0.99159 5.94415,1.28659 24.26399,1.28659 h 23.77029 z m 143.44166,0.0102 v -23.74666 l -59.34646,0.26061 -59.34646,0.26062 -0.27288,22.19946 c -0.15008,12.2097 -0.0507,22.77842 0.22084,23.48604 0.39208,1.02174 12.66498,1.28659 59.61934,1.28659 h 59.12562 V 834.35615 Z M 643.79056,762.64339 V 738.9048 H 620.16158 596.5326 l -0.43109,22.98097 c -0.23709,12.63954 -0.25959,23.3219 -0.05,23.73859 0.20961,0.41669 11.03664,0.75761 24.06007,0.75761 h 23.67897 z m 95.96449,0.0862 V 739.0772 l -7.3236,-0.64681 c -4.02798,-0.35575 -20.05153,-0.50818 -35.60788,-0.33873 l -28.28427,0.30809 -0.27248,22.70557 c -0.14986,12.48807 -0.0505,23.28407 0.22084,23.99112 0.38633,1.00678 8.16698,1.28555 35.88036,1.28555 h 35.38703 z"
         id="path22423-0-2-43"
         inkscape:connector-curvature="0"
         transform="scale(0.26458333)" />
      <path
         style="opacity:1;fill:#24566d;fill-opacity:1;stroke:none;stroke-width:0.00202482;stroke-miterlimit:4;stroke-dasharray:none;stroke-dashoffset:0;stroke-opacity:1"
         d="m 668.53801,856.84033 c -0.0633,-0.0966 -0.11609,-0.43696 -0.15739,-1.01488 -0.12696,-1.77653 -0.20853,-8.61709 -0.17437,-14.62339 0.0408,-7.16704 0.29261,-29.40008 0.33739,-29.78371 0.0206,-0.17683 0.0623,-0.26833 0.12215,-0.26833 0.0788,0 0.0908,3.02231 0.0908,22.91784 0,14.87594 -0.0216,22.91784 -0.0617,22.91784 -0.0339,0 -0.10454,-0.0654 -0.15693,-0.14537 z"
         id="path22427-6-9-0"
         inkscape:connector-curvature="0"
         transform="scale(0.26458333)" />
      <path
         style="opacity:1;fill:#24566d;fill-opacity:1;stroke:none;stroke-width:0.00202482;stroke-miterlimit:4;stroke-dasharray:none;stroke-dashoffset:0;stroke-opacity:1"
         d="m 702.37576,858.05452 c -16.254,-0.0666 -24.38262,-0.20527 -29.57853,-0.50464 -0.64239,-0.037 -1.1964,-0.0774 -1.23112,-0.0898 -0.0347,-0.0124 19.91658,-0.0247 44.33623,-0.0275 l 44.39936,-0.005 v 0.34724 0.34724 l -23.37556,-0.0109 c -12.85656,-0.006 -28.40423,-0.0315 -34.55038,-0.0567 z"
         id="path22431-4-9-7"
         inkscape:connector-curvature="0"
         transform="scale(0.26458333)" />
      <path
         style="opacity:1;fill:#24566d;fill-opacity:1;stroke:none;stroke-width:0.00286353;stroke-miterlimit:4;stroke-dasharray:none;stroke-dashoffset:0;stroke-opacity:1"
         d="m 174.83858,1055.7877 c -0.003,-0.083 0.0374,-0.262 0.0892,-0.3983 0.0518,-0.1362 0.59193,-1.9569 1.20024,-4.0459 1.90227,-6.5326 2.79028,-9.349 3.85789,-12.2357 1.02882,-2.7818 1.72685,-4.0196 2.18894,-3.8814 0.74358,0.2224 1.39551,1 2.16871,2.5867 0.98605,2.0236 1.80954,4.7136 2.63376,8.6034 0.20142,0.9505 0.4863,2.1907 0.63305,2.7559 0.14675,0.5653 0.25293,1.0694 0.23595,1.1203 -0.0479,0.1438 -0.91384,-3.0243 -1.27563,-4.6671 -0.83027,-3.7697 -2.19021,-7.4013 -3.36028,-8.9732 -0.47919,-0.6437 -0.79518,-0.8478 -1.02333,-0.6608 -0.54177,0.4442 -2.45397,5.4928 -5.5765,14.7233 -0.97181,2.8728 -1.7692,5.1555 -1.77197,5.0728 z"
         id="path22433-6-6-8"
         inkscape:connector-curvature="0"
         transform="scale(0.26458333)" />
      <path
         style="opacity:1;fill:#24566d;fill-opacity:1;stroke:none;stroke-width:0.00286353;stroke-miterlimit:4;stroke-dasharray:none;stroke-dashoffset:0;stroke-opacity:1"
         d="m 183.49425,999.05771 c -8.86384,-0.11166 -17.10045,-0.21284 -18.30357,-0.22484 -4.11521,-0.041 -1.10569,-0.15551 6.4659,-0.24592 7.89037,-0.0942 23.43779,-4.8e-4 26.3466,0.15883 2.17655,0.11922 3.73262,0.25254 4.6875,0.40161 0.75615,0.11806 0.75191,0.11848 -1.16072,0.11591 -1.0558,-10e-4 -9.17187,-0.0939 -18.03571,-0.20559 z"
         id="path22437-2-0-6"
         inkscape:connector-curvature="0"
         transform="scale(0.26458333)" />
      <path
         style="opacity:1;fill:#24566d;fill-opacity:1;stroke:none;stroke-width:0.000715884;stroke-miterlimit:4;stroke-dasharray:none;stroke-dashoffset:0;stroke-opacity:1"
         d="m 218.07827,1031.4187 c -0.0133,-0.022 -0.0399,-0.096 -0.65285,-1.8222 -1.36424,-3.8427 -2.27176,-6.4833 -3.5901,-10.4465 -1.07796,-3.2405 -1.56721,-4.6182 -2.37004,-6.6741 -0.38403,-0.9834 -0.50109,-1.2676 -1.03631,-2.516 -0.8762,-2.0436 -1.73732,-4.2262 -2.43763,-6.1782 -0.34903,-0.9729 -1.09075,-3.1285 -1.08013,-3.1391 0.0149,-0.015 0.2907,0.2894 0.42525,0.4692 0.3815,0.5101 0.54305,0.8783 1.09316,2.4914 1.53632,4.5049 6.07996,17.0609 9.92114,27.4163 l 0.15525,0.4185 h -0.20791 c -0.11435,0 -0.21327,-0.01 -0.21983,-0.019 z"
         id="path22439-5-2-8"
         inkscape:connector-curvature="0"
         transform="scale(0.26458333)" />
      <path
         style="opacity:1;fill:#fafafa;fill-opacity:1;stroke:none;stroke-width:0.00101241;stroke-miterlimit:4;stroke-dasharray:none;stroke-dashoffset:0;stroke-opacity:1"
         d="m 213.83131,1135.113 c -0.7424,-2.3135 -1.54463,-5.1382 -2.35564,-8.2943 -0.40484,-1.5755 -0.5984,-2.2663 -0.96626,-3.4486 -0.67399,-2.1662 -1.47929,-4.2274 -2.08555,-5.3379 -0.41902,-0.7675 -0.65183,-1.0419 -1.0392,-1.2246 -1.1786,-0.5561 -4.99306,-0.8732 -12.08697,-1.0047 -0.95491,-0.018 -2.0132,-0.041 -2.35176,-0.053 -0.33856,-0.011 -8.45687,-0.029 -18.04069,-0.04 -14.19389,-0.016 -17.38708,-0.027 -17.21994,-0.059 1.1844,-0.2309 3.99289,-0.4102 8.01808,-0.5119 3.82748,-0.097 6.04584,-0.1102 18.1354,-0.1106 12.36791,-4e-4 13.40325,0.01 15.8152,0.1115 6.71367,0.2912 8.98902,1.1213 10.11724,3.6911 0.39811,0.9068 0.62334,1.8145 1.20089,4.8399 0.79993,4.1901 1.98467,8.5226 3.131,11.4497 0.13939,0.3559 0.26025,0.6649 0.26859,0.6866 0.0109,0.028 -0.0298,0.039 -0.14486,0.039 h -0.16001 z"
         id="path22441-8-7-8"
         inkscape:connector-curvature="0"
         transform="scale(0.26458333)" />
      <path
         style="opacity:1;fill:#91aab6;fill-opacity:1;stroke:none;stroke-width:0.0647944;stroke-miterlimit:4;stroke-dasharray:none;stroke-dashoffset:0;stroke-opacity:1"
         d="m -203.17421,997.54332 c -1.694,-0.69298 -1.28244,-4.6927 1.49146,-14.49476 11.24456,-39.73455 64.1158,-216.86574 64.99342,-217.74336 0.56541,-0.56541 7.40067,-0.7587 15.18945,-0.42953 l 14.16142,0.5985 -32.12676,109.09647 c -17.66973,60.00306 -33.0593,112.50574 -34.19905,116.67262 l -2.07228,7.57615 -12.54904,-0.15961 c -6.90197,-0.0877 -13.60185,-0.59017 -14.88862,-1.11658 z"
         id="path22461-6-6-4"
         inkscape:connector-curvature="0"
         transform="scale(0.26458333)" />
      <path
         style="opacity:1;fill:#91aab6;fill-opacity:1;stroke:none;stroke-width:0.0229083;stroke-miterlimit:4;stroke-dasharray:none;stroke-dashoffset:0;stroke-opacity:1"
         d="m -64.181774,883.6807 c -6.219396,-3.86406 -11.630844,-7.34842 -12.025438,-7.74302 -0.755668,-0.75566 -0.744072,-0.77035 17.616661,-22.30942 11.905058,-13.96589 15.359629,-18.19954 15.359629,-18.82356 0,-1.00213 -5.56692,-0.33193 -22.244129,2.67794 -24.444992,4.41179 -27.783875,4.92707 -28.338229,4.37332 -0.666361,-0.66564 -1.10944,-24.10063 -0.51552,-27.26649 l 0.476151,-2.53811 3.346578,0.49058 c 1.840617,0.26982 12.444263,2.23176 23.563657,4.35988 11.119394,2.12811 21.03113,3.8693 22.026079,3.8693 h 1.808999 l -2.189026,-2.97662 c -1.203965,-1.63713 -8.544272,-10.65584 -16.311794,-20.04157 -7.767521,-9.38573 -14.122766,-17.60875 -14.122766,-18.27339 0,-0.75077 2.164116,-2.49715 5.714286,-4.61128 6.78318,-4.03939 19.66447,-10.74873 19.982859,-10.40826 0.461427,0.49343 2.798908,6.43698 9.083531,23.09683 7.935669,21.0366 9.700759,25.09665 10.535393,24.23345 0.842836,-0.87169 4.89163,-10.72678 10.396067,-25.30488 2.447543,-6.48214 5.492485,-14.28703 6.766535,-17.3442 l 2.316458,-5.55849 5.4595781,2.99119 c 5.59005,3.06266 16.4983569,9.70345 18.9985719,11.566 1.6169,1.20451 1.770764,0.9946 -18.3963005,25.09727 -11.2211785,13.41099 -13.8854855,17.123 -12.7803495,17.80602 0.553421,0.34203 12.7267067,-1.86046 37.427721,-6.77172 6.563107,-1.30493 12.188107,-2.11814 12.5,-1.80713 0.311893,0.31101 0.665814,7.1287 0.7865,15.15041 0.208479,13.85783 0.152714,14.58494 -1.1186,14.58494 -0.735914,0 -10.798943,-1.57331 -22.3622786,-3.49624 -26.5389284,-4.41329 -27.8109284,-4.57131 -27.8064424,-3.45438 0.0036,0.92504 7.618307,10.18668 23.3944638,28.45468 5.2081862,6.03082 9.3626862,11.28534 9.2322212,11.67672 -0.458543,1.37563 -25.15645,15.98916 -25.821935,15.27862 -0.505622,-0.53986 -4.115793,-9.62224 -9.892758,-24.88797 -9.380378,-24.78781 -9.581497,-25.19239 -11.096168,-22.32143 -0.362715,0.6875 -3.410157,8.48336 -6.772094,17.32413 -8.519941,22.40461 -11.600468,29.61683 -12.722512,29.78631 -0.532182,0.0804 -6.056201,-3.01536 -12.275599,-6.87943 z"
         id="path22463-2-1-3"
         inkscape:connector-curvature="0"
         transform="scale(0.26458333)" />
      <path
         style="opacity:1;fill:#91aab6;fill-opacity:1;stroke:none;stroke-width:0.0229083;stroke-miterlimit:4;stroke-dasharray:none;stroke-dashoffset:0;stroke-opacity:1"
         d="m 70.31531,1183.5806 c -7.694566,-0.8176 -13.150963,-3.0605 -17.133121,-7.0426 -4.53294,-4.533 -6.978809,-8.9714 -8.217416,-14.9118 -1.119389,-5.3686 -2.447489,-28.4309 -2.468566,-42.8663 -0.01356,-9.2841 -0.0807,-9.5405 -4.09528,-15.6414 -2.981037,-4.5301 -5.660703,-6.266 -11.254157,-7.2905 -2.345841,-0.4296 -4.756555,-1.2719 -5.357143,-1.8717 -0.905365,-0.9043 -1.130405,-4.0074 -1.316838,-18.1583 l -0.22486,-17.0676 3.796289,-1.0968 c 2.087959,-0.6032 4.699216,-1.28 5.802793,-1.5038 3.156359,-0.6404 7.928928,-5.568 10.118749,-10.4476 1.915519,-4.2683 1.984181,-4.8931 2.923885,-26.6053 1.203206,-27.80051 1.654104,-30.28875 7.217464,-39.82877 2.587983,-4.43786 7.203545,-7.91994 12.684514,-9.56947 4.532081,-1.36396 15.270974,-2.37081 29.156026,-2.73361 l 11.964291,-0.31261 v 17.06934 17.06932 h -3.32369 c -3.799793,0 -11.092663,3.1234 -13.606509,5.8275 -3.113777,3.3493 -3.624549,6.0111 -4.502383,23.4634 -0.942199,18.7319 -1.134476,20.0203 -4.250443,28.4829 -2.696803,7.3241 -5.395551,10.8637 -9.849061,12.9177 -6.145325,2.8342 -6.35626,5.0907 -0.808663,8.6506 4.812433,3.0881 8.581584,7.5777 10.212214,12.1641 0.753044,2.118 1.772122,4.4938 2.264618,5.2795 1.304711,2.0815 1.672278,5.9068 2.403668,25.0148 0.361204,9.4366 1.017953,18.1152 1.459443,19.2857 1.065005,2.8235 4.807309,6.705 7.634515,7.9184 1.252115,0.5374 4.546758,1.1881 7.321429,1.446 l 5.044862,0.4688 v 16.326 16.326 l -14.107148,-0.095 c -7.758928,-0.052 -16.529195,-0.3523 -19.489482,-0.6669 z"
         id="path22465-8-3-1"
         inkscape:connector-curvature="0"
         transform="scale(0.26458333)" />
      <path
         style="opacity:1;fill:#91aab6;fill-opacity:1;stroke:none;stroke-width:0.0229083;stroke-miterlimit:4;stroke-dasharray:none;stroke-dashoffset:0;stroke-opacity:1"
         d="m 108.4438,1138.1777 c -0.57084,-0.2336 -0.26878,-1.7027 0.9797,-4.765 0.99275,-2.435 2.68591,-6.8568 3.76259,-9.8261 1.07669,-2.9693 2.35014,-6.1323 2.8299,-7.0287 0.47977,-0.8964 1.78573,-4.2527 2.90214,-7.4583 4.11399,-11.8129 7.91026,-22.0515 16.06539,-43.3285 4.59255,-11.9821 8.60539,-22.75 8.91742,-23.9286 0.31203,-1.1785 1.13145,-3.4285 1.82095,-5 0.68949,-1.5714 2.45304,-6.2321 3.91899,-10.3571 1.46596,-4.125 4.34863,-11.9196 6.40594,-17.3214 l 3.74056,-9.82145 21.88371,0.01 c 12.03604,0.005 22.53209,0.184 23.32456,0.39697 1.59418,0.42838 2.00701,1.40848 9.60711,22.80748 2.65101,7.4643 6.4457,17.75 8.43264,22.8572 1.98694,5.1071 3.8425,10.0894 4.12347,11.0714 0.28097,0.9821 1.13656,3.1293 1.9013,4.7712 0.76474,1.642 2.45028,5.9813 3.74562,9.6429 1.29535,3.6615 3.65538,10.193 5.24451,14.5145 1.58914,4.3214 3.9884,10.9107 5.33171,14.6428 1.34331,3.7322 3.59264,9.4329 4.99851,12.6682 1.40588,3.2352 2.77502,6.9317 3.04254,8.2143 0.26753,1.2825 1.54823,4.7426 2.84602,7.6891 1.29778,2.9464 2.57745,6.4017 2.8437,7.6785 l 0.48409,2.3215 h -20.99791 -20.99791 l -1.55352,-4.8215 c -0.85444,-2.6518 -2.0591,-7.0515 -2.67702,-9.7771 -1.46259,-6.4515 -1.95421,-7.2671 -4.983,-8.2666 -2.69719,-0.8902 -46.84834,-1.1762 -49.08475,-0.318 -1.10446,0.4238 -3.73033,7.3211 -5.49481,14.4332 -0.41424,1.6696 -1.08698,4.3214 -1.49497,5.8928 l -0.74182,2.8572 -20.15104,-0.056 c -11.08307,-0.031 -20.52242,-0.2084 -20.97632,-0.3942 z m 80.02636,-51.6844 9.20107,-0.01 -0.34624,-5.3952 c -0.19043,-2.9673 -0.71485,-5.7637 -1.16536,-6.2142 -0.45052,-0.4506 -0.81912,-1.5796 -0.81912,-2.509 0,-0.9294 -0.3565,-2.3559 -0.7922,-3.17 -0.43572,-0.8142 -1.57028,-4.3877 -2.52127,-7.9412 -0.95098,-3.5536 -2.0197,-6.8112 -2.37492,-7.2392 -0.35521,-0.428 -1.35804,-3.6637 -2.2285,-7.1904 -1.79712,-7.2812 -3.79517,-11.7694 -5.23945,-11.7694 -0.5807,0 -1.72115,2.1239 -2.78075,5.1786 -3.44371,9.9278 -8.23707,25.2142 -9.4631,30.1786 -0.67917,2.75 -1.83125,6.3927 -2.56019,8.0949 -1.62228,3.7884 -1.66844,5.374 -0.19209,6.5992 1.4442,1.1986 6.34625,2.0601 9.58104,1.6838 1.375,-0.1599 6.64048,-0.2943 11.70108,-0.2986 z"
         id="path22467-4-2-4"
         inkscape:connector-curvature="0"
         transform="scale(0.26458333)" />
      <path
         style="opacity:1;fill:#91aab6;fill-opacity:1;stroke:none;stroke-width:0.0229083;stroke-miterlimit:4;stroke-dasharray:none;stroke-dashoffset:0;stroke-opacity:1"
         d="m 268.91194,1168.0165 v -16.326 l 5.04485,-0.4688 c 6.46518,-0.6009 8.97815,-1.6881 12.22904,-5.2908 3.96507,-4.3942 4.18133,-5.6869 6.30006,-37.6598 0.70721,-10.6721 0.91488,-11.7627 3.13748,-16.4769 1.79948,-3.8167 3.38633,-5.9078 6.50453,-8.5714 7.57201,-6.4681 7.64505,-6.5572 6.7504,-8.2288 -0.44181,-0.8255 -2.34674,-2.4604 -4.23318,-3.6331 -4.87921,-3.0331 -10.07027,-10.7157 -11.03899,-16.3373 -0.23379,-1.3567 -0.90824,-9.5852 -1.49877,-18.2856 -1.19446,-17.598 -1.97638,-22.8915 -3.954,-26.768 -2.68031,-5.2538 -9.60832,-9.1989 -16.15438,-9.1989 h -3.08704 v -17.06932 -17.06934 l 11.96428,0.31261 c 21.8639,0.57127 29.91495,1.92119 36.1705,6.06469 9.44977,6.25927 13.27315,19.77804 13.30588,47.04706 0.02,16.6916 0.84446,22.9121 3.6072,27.2175 3.31044,5.1589 7.2866,8.2774 11.85817,9.3005 6.66639,1.4918 6.27547,0.2877 6.55136,20.1798 l 0.2431,17.5283 -1.67167,0.3589 c -0.91942,0.1973 -3.50037,0.7116 -5.73542,1.1428 -5.07227,0.9786 -6.58534,2.1662 -11.08014,8.6963 l -3.59215,5.2188 -0.3967,22.5 c -0.43103,24.4469 -1.01512,28.6879 -5.15695,37.443 -2.30189,4.8657 -8.55976,10.6575 -13.15637,12.1763 -4.90582,1.621 -15.33164,2.4974 -29.87538,2.5112 l -13.03571,0.012 z"
         id="path22469-7-1-9"
         inkscape:connector-curvature="0"
         transform="scale(0.26458333)" />
      <path
         style="opacity:1;fill:#91aab6;fill-opacity:1;stroke:none;stroke-width:0.0916331;stroke-miterlimit:4;stroke-dasharray:none;stroke-dashoffset:0;stroke-opacity:1"
         d="m 597.00405,762.04655 0.83447,-22.14286 22.14286,-0.83447 22.14286,-0.83447 v 22.97733 22.97733 h -22.97733 -22.97733 z"
         id="path22471-2-5-2"
         inkscape:connector-curvature="0"
         transform="scale(0.26458333)" />
      <path
         style="opacity:1;fill:#ff642f;fill-opacity:1;stroke:none;stroke-width:0.0323973;stroke-miterlimit:4;stroke-dasharray:none;stroke-dashoffset:0;stroke-opacity:1"
         d="m 668.81221,834.16223 v -23.23351 h 59.09392 59.09392 v 23.23351 23.2335 h -59.09392 -59.09392 z"
         id="path22473-4-9-0"
         inkscape:connector-curvature="0"
         transform="scale(0.26458333)" />
      <path
         style="opacity:1;fill:#ffffff;fill-opacity:1;stroke:none;stroke-width:0.0323973;stroke-miterlimit:4;stroke-dasharray:none;stroke-dashoffset:0;stroke-opacity:1"
         d="m 596.08122,834.16223 v -23.23351 h 23.73859 23.73858 v 23.23351 23.2335 h -23.73858 -23.73859 z"
         id="path22477-0-9-6"
         inkscape:connector-curvature="0"
         transform="scale(0.26458333)" />
      <path
         style="opacity:1;fill:#ffce35;fill-opacity:1;stroke:none;stroke-width:0.0323973;stroke-miterlimit:4;stroke-dasharray:none;stroke-dashoffset:0;stroke-opacity:1"
         d="m 668.81221,762.06804 v -23.60685 l 34.59772,0.50169 c 19.02875,0.27593 34.65142,0.55758 34.71704,0.62589 0.0656,0.0683 0.36082,10.46563 0.65601,23.10516 l 0.5367,22.98097 h -35.25374 -35.25373 z"
         id="path22479-6-1-8"
         inkscape:connector-curvature="0"
         transform="scale(0.26458333)" />
    </g>
  </g>
</svg>
