<?xml version="1.0" encoding="UTF-8" standalone="no"?>
<svg
   width="15.35412mm"
   height="15.875mm"
   viewBox="0 0 15.35412 15.875"
   version="1.1"
   id="svg31"
   inkscape:version="1.1.2 (0a00cf5339, 2022-02-04)"
   sodipodi:docname="vagrant_ansible.svg"
   xmlns:inkscape="http://www.inkscape.org/namespaces/inkscape"
   xmlns:sodipodi="http://sodipodi.sourceforge.net/DTD/sodipodi-0.dtd"
   xmlns="http://www.w3.org/2000/svg"
   xmlns:svg="http://www.w3.org/2000/svg"
   xmlns:rdf="http://www.w3.org/1999/02/22-rdf-syntax-ns#"
   xmlns:cc="http://creativecommons.org/ns#"
   xmlns:dc="http://purl.org/dc/elements/1.1/">
  <defs
     id="defs25" />
  <sodipodi:namedview
     id="base"
     pagecolor="#ffffff"
     bordercolor="#666666"
     borderopacity="1.0"
     inkscape:pageopacity="0.79215686"
     inkscape:pageshadow="2"
     inkscape:zoom="5.6"
     inkscape:cx="-46.339286"
     inkscape:cy="23.660714"
     inkscape:document-units="mm"
     inkscape:current-layer="layer1"
     inkscape:document-rotation="0"
     showgrid="false"
     fit-margin-top="0"
     fit-margin-left="0"
     fit-margin-right="0"
     fit-margin-bottom="0"
     inkscape:window-width="3840"
     inkscape:window-height="1531"
     inkscape:window-x="2560"
     inkscape:window-y="32"
     inkscape:window-maximized="1"
     inkscape:showpageshadow="2"
     inkscape:pagecheckerboard="true"
     inkscape:deskcolor="#d1d1d1" />
  <metadata
     id="metadata28">
    <rdf:RDF>
      <cc:Work
         rdf:about="">
        <dc:format>image/svg+xml</dc:format>
        <dc:type
           rdf:resource="http://purl.org/dc/dcmitype/StillImage" />
      </cc:Work>
    </rdf:RDF>
  </metadata>
  <g
     inkscape:label="Layer 1"
     inkscape:groupmode="layer"
     id="layer1"
     transform="translate(-109.11955,-133.84898)">
    <g
       id="g447">
      <path
         class="front"
         fill="#1563ff"
         d="m 124.47367,136.52392 v -1.45256 l -3.48985,2.02935 v 1.22767 l -2.79136,6.02192 -1.397,0.96308 v 4.4106 l 2.99244,-1.72508 z m -7.67821,5.64886 -2.09285,-4.88686 v -1.38112 l -0.0132,-0.005 -2.07963,1.20121 v 1.22766 l 2.79136,6.2865 1.39435,-0.69056 z"
         id="path4"
         style="display:inline;stroke-width:0.264583" />
      <path
         class="shadow"
         fill="#104eb2"
         d="m 122.38082,133.84898 -3.48721,2.04259 h -0.003 v 1.39435 l -2.0955,4.88686 v 1.63248 l -1.39435,0.80962 -2.79136,-6.2865 v -1.23031 l 2.0955,-1.20386 -3.4925,-2.04523 -2.09285,1.22238 v 1.49754 l 4.71223,11.44323 2.96333,1.71185 v -4.29947 l 1.397,-0.80963 -0.0185,-0.0106 2.80988,-6.27592 v -1.23031 l 3.48985,-2.02671 z"
         id="path6"
         style="stroke-width:0.264583" />
    </g>
    <g
       id="g455"
       transform="matrix(0.3975752,0,0,0.3975752,68.041773,97.449067)">
      <ellipse
         style="fill:#ffffff;fill-rule:evenodd;stroke-width:0.264583"
         id="path442"
         cx="132.81367"
         cy="122.8814"
         rx="6.8689051"
         ry="5.9178023" />
      <g
         inkscape:export-ydpi="1147.42"
         inkscape:export-xdpi="1147.42"
         inkscape:export-filename="/home/ostraaten/svn/doc/dxc-uwv/cd-platform/export/cd-platform-overview.png"
         style="fill:#000000;fill-opacity:1;fill-rule:evenodd;stroke:none;stroke-width:0.0111712"
         transform="matrix(0.06769798,0,0,0.06769798,124.18022,113.80836)"
         id="Page-1-3-9-8-9-2">
        <g
           style="fill:#000000;fill-opacity:1;fill-rule:nonzero;stroke-width:0.0111712"
           id="ansible-icon-1-1-9-1-8">
          <polygon
             style="fill:#000000;fill-opacity:1;stroke-width:0.0111712"
             id="Shape-7-9-1-2-7"
             points="130.5,78.2 113.6,120.4 163.5,159.7 " />
          <path
             style="fill:#000000;fill-opacity:1;stroke-width:0.0111712"
             inkscape:connector-curvature="0"
             d="M 128.3,0.3 C 57.9,0.3 0.7,57.4 0.7,127.9 c 0,70.5 57.1,127.6 127.6,127.6 70.5,0 127.6,-57.1 127.6,-127.6 C 255.9,57.4 198.8,0.3 128.3,0.3 Z m 52.4,191 c -2.5,0 -4.4,-1 -7,-3.1 L 107.8,135 85.7,190.3 H 66.6 l 55.7,-134 c 1.4,-3.5 4.6,-5.4 8.1,-5.4 3.5,0 6.4,1.9 7.9,5.4 l 50.8,122.2 c 0.6,1.5 0.9,2.9 0.9,3.8 0,5.3 -4.4,9 -9.3,9 z"
             id="path15711-5-6-5-6-6" />
        </g>
      </g>
    </g>
  </g>
  <g
     inkscape:groupmode="layer"
     id="layer2"
     inkscape:label="Layer 2" />
</svg>
