<svg xmlns="http://www.w3.org/2000/svg" xmlns:xlink="http://www.w3.org/1999/xlink" class="main-svg" width="100%" height="100%" style="" viewBox="36 16 659 471">
  <rect x="0" y="0" width="700" height="500" style="fill: rgb(0, 0, 0); fill-opacity: 0;"/>
  <defs id="defs-f1358d">
    <g class="clips">
      <clipPath id="clipf1358dxyplot" class="plotclip">
        <rect width="425" height="435"/>
      </clipPath>
      <clipPath class="axesclip" id="clipf1358dx">
        <rect x="60" y="0" width="425" height="500"/>
      </clipPath>
      <clipPath class="axesclip" id="clipf1358dy">
        <rect x="0" y="25" width="700" height="435"/>
      </clipPath>
      <clipPath class="axesclip" id="clipf1358dxy">
        <rect x="60" y="25" width="425" height="435"/>
      </clipPath>
    </g>
    <g class="gradients"/>
    <g class="patterns"/>
  </defs>
  <g class="bglayer">
    <rect class="bg" x="60" y="25" width="425" height="435" style="fill: rgb(0, 0, 0); fill-opacity: 0; stroke-width: 0;"/>
  </g>
  <g class="layer-below">
    <g class="imagelayer"/>
    <g class="shapelayer"/>
  </g>
  <g class="cartesianlayer">
    <g class="subplot xy">
      <g class="layer-subplot">
        <g class="shapelayer"/>
        <g class="imagelayer"/>
      </g>
      <g class="gridlayer">
        <g class="x">
          <path class="xgrid crisp" transform="translate(79.32,0)" d="M0,25v435" style="stroke: rgb(217, 217, 217); stroke-opacity: 1; stroke-width: 1px;"/>
          <path class="xgrid crisp" transform="translate(175.91,0)" d="M0,25v435" style="stroke: rgb(217, 217, 217); stroke-opacity: 1; stroke-width: 1px;"/>
          <path class="xgrid crisp" transform="translate(272.5,0)" d="M0,25v435" style="stroke: rgb(217, 217, 217); stroke-opacity: 1; stroke-width: 1px;"/>
          <path class="xgrid crisp" transform="translate(369.09,0)" d="M0,25v435" style="stroke: rgb(217, 217, 217); stroke-opacity: 1; stroke-width: 1px;"/>
          <path class="xgrid crisp" transform="translate(465.68,0)" d="M0,25v435" style="stroke: rgb(217, 217, 217); stroke-opacity: 1; stroke-width: 1px;"/>
        </g>
        <g class="y">
          <path class="ygrid crisp" transform="translate(0,391.08)" d="M60,0h425" style="stroke: rgb(217, 217, 217); stroke-opacity: 1; stroke-width: 1px;"/>
          <path class="ygrid crisp" transform="translate(0,343.91)" d="M60,0h425" style="stroke: rgb(217, 217, 217); stroke-opacity: 1; stroke-width: 1px;"/>
          <path class="ygrid crisp" transform="translate(0,296.74)" d="M60,0h425" style="stroke: rgb(217, 217, 217); stroke-opacity: 1; stroke-width: 1px;"/>
          <path class="ygrid crisp" transform="translate(0,249.58)" d="M60,0h425" style="stroke: rgb(217, 217, 217); stroke-opacity: 1; stroke-width: 1px;"/>
          <path class="ygrid crisp" transform="translate(0,202.41)" d="M60,0h425" style="stroke: rgb(217, 217, 217); stroke-opacity: 1; stroke-width: 1px;"/>
          <path class="ygrid crisp" transform="translate(0,155.24)" d="M60,0h425" style="stroke: rgb(217, 217, 217); stroke-opacity: 1; stroke-width: 1px;"/>
          <path class="ygrid crisp" transform="translate(0,108.07)" d="M60,0h425" style="stroke: rgb(217, 217, 217); stroke-opacity: 1; stroke-width: 1px;"/>
          <path class="ygrid crisp" transform="translate(0,60.9)" d="M60,0h425" style="stroke: rgb(217, 217, 217); stroke-opacity: 1; stroke-width: 1px;"/>
        </g>
      </g>
      <g class="zerolinelayer">
        <path class="yzl zl crisp" transform="translate(0,438.25)" d="M60,0h425" style="stroke: rgb(68, 68, 68); stroke-opacity: 1; stroke-width: 1px;"/>
      </g>
      <path class="xlines-below"/>
      <path class="ylines-below"/>
      <g class="overlines-below"/>
      <g class="xaxislayer-below"/>
      <g class="yaxislayer-below"/>
      <g class="overaxes-below"/>
      <g class="plot" transform="translate(60,25)" clip-path="url(#clipf1358dxyplot)">
        <g class="scatterlayer mlayer">
          <g class="trace scatter trace3d1c39" style="stroke-miterlimit: 2; opacity: 1;">
            <g class="fills"/>
            <g class="errorbars"/>
            <g class="lines">
              <path class="js-line" d="M0,413.25Q12.88,413.25 19.32,413.25C25.76,413.25 32.2,413.25 38.64,413.25C45.08,413.25 51.51,413.25 57.95,413.25C64.39,413.25 71.14,415.25 77.27,413.25C84.09,411.02 89.82,400.45 96.59,399.1C102.76,397.87 109.42,403.04 115.91,403.82C122.3,404.59 128.84,403.05 135.23,403.82C141.72,404.6 148.11,406.96 154.55,408.53C160.99,410.1 167.38,412.47 173.86,413.25C180.25,414.02 186.79,414.02 193.18,413.25C199.67,412.47 206.06,408.53 212.5,408.53C218.94,408.53 225.65,414.48 231.82,413.25C238.59,411.9 244.37,400.45 251.14,399.1C257.31,397.87 264.28,405.05 270.45,403.82C277.22,402.47 284.38,397.87 289.77,389.67C300.04,374.03 302.22,331.19 309.09,304.76C315.19,281.27 321.58,259.3 328.41,238.73C334.54,220.28 341.87,186.45 347.73,186.84C355.08,187.33 360.04,271.46 367.05,271.74C373.07,271.98 380.12,210.3 386.36,210.42C393.02,210.55 397.47,263.41 405.68,281.18Q411.29,293.33 425,309.48" style="vector-effect: non-scaling-stroke; fill: none; stroke: rgb(31, 119, 180); stroke-opacity: 1; stroke-width: 2px; opacity: 1;"/>
            </g>
            <g class="points"/>
            <g class="text"/>
          </g>
          <g class="trace scatter trace7b8aa1" style="stroke-miterlimit: 2; opacity: 1;">
            <g class="fills"/>
            <g class="errorbars"/>
            <g class="lines">
              <path class="js-line" d="M0,413.25Q13.19,415.25 19.32,413.25C26.14,411.02 32.2,399.1 38.64,399.1C45.08,399.1 51.13,411.02 57.95,413.25C64.08,415.26 70.83,413.25 77.27,413.25C83.71,413.25 90.2,414.02 96.59,413.25C103.08,412.47 109.89,411.87 115.91,408.53C122.92,404.64 128.22,393.56 135.23,389.67C141.25,386.33 148.77,382.73 154.55,384.95C162.13,387.86 166.48,411.29 173.86,413.25C179.71,414.8 186.61,404.53 193.18,403.82C199.5,403.14 206.33,409.76 212.5,408.53C219.27,407.18 225.2,394.97 231.82,394.38C238.1,393.82 245.47,405.71 251.14,403.82C259.1,401.17 262.8,367.9 270.45,366.08C276.2,364.72 283.51,380.67 289.77,380.23C296.42,379.76 302.08,365.25 309.09,361.36C315.11,358.02 322.39,359.99 328.41,356.65C335.42,352.76 340.65,340.66 347.73,337.78C353.71,335.34 361.71,342.14 367.05,337.78C378.97,328.05 374.61,255.64 386.36,243.44C391.7,237.9 399.36,238.05 405.68,238.73Q412.25,239.44 425,248.16" style="vector-effect: non-scaling-stroke; fill: none; stroke: rgb(255, 127, 14); stroke-opacity: 1; stroke-width: 2px; opacity: 1;"/>
            </g>
            <g class="points"/>
            <g class="text"/>
          </g>
          <g class="trace scatter trace3923b1" style="stroke-miterlimit: 2; opacity: 1;">
            <g class="fills"/>
            <g class="errorbars"/>
            <g class="lines">
              <path class="js-line" d="M0,413.25Q12.88,413.25 19.32,413.25C25.76,413.25 32.2,413.25 38.64,413.25C45.08,413.25 51.51,413.25 57.95,413.25C64.39,413.25 70.83,413.25 77.27,413.25C83.71,413.25 90.15,413.25 96.59,413.25C103.03,413.25 109.47,413.25 115.91,413.25C122.35,413.25 128.79,413.25 135.23,413.25C141.67,413.25 148.11,413.25 154.55,413.25C160.99,413.25 167.47,414.02 173.86,413.25C180.35,412.47 186.74,408.53 193.18,408.53C199.62,408.53 206.06,413.25 212.5,413.25C218.94,413.25 225.38,408.53 231.82,408.53C238.26,408.53 244.97,414.48 251.14,413.25C257.91,411.9 263.83,403.1 270.45,399.1C276.72,395.31 283.92,394.73 289.77,389.67C297.15,383.28 301.43,365.41 309.09,361.36C314.84,358.32 322.81,364.78 328.41,361.36C336.7,356.29 339.44,328.7 347.73,323.63C353.33,320.21 361.51,327.2 367.05,323.63C375.66,318.09 377.85,285.32 386.36,281.18C391.92,278.48 400.21,281.02 405.68,285.89Q414.81,294.01 425,337.78" style="vector-effect: non-scaling-stroke; fill: none; stroke: rgb(44, 160, 44); stroke-opacity: 1; stroke-width: 2px; opacity: 1;"/>
            </g>
            <g class="points"/>
            <g class="text"/>
          </g>
          <g class="trace scatter tracea09bff" style="stroke-miterlimit: 2; opacity: 1;">
            <g class="fills"/>
            <g class="errorbars"/>
            <g class="lines">
              <path class="js-line" d="M0,403.82Q12.88,406.96 19.32,408.53C25.76,410.1 32.15,412.47 38.64,413.25C45.03,414.02 51.51,413.25 57.95,413.25C64.39,413.25 70.88,414.02 77.27,413.25C83.76,412.47 90.15,408.53 96.59,408.53C103.03,408.53 109.47,413.25 115.91,413.25C122.35,413.25 129.54,412.77 135.23,408.53C143.12,402.65 146.58,380.09 154.55,375.52C160.21,372.27 168.32,379.09 173.86,375.52C182.47,369.98 186.39,333.41 193.18,333.06C199.33,332.74 204.53,361.51 212.5,366.08C218.17,369.33 226.36,369.87 231.82,366.08C241.06,359.66 243.06,316.01 251.14,314.2C256.78,312.94 263.6,328.23 270.45,333.06C276.56,337.37 284.4,345.03 289.77,342.5C300.3,337.55 301.87,262.74 309.09,262.31C315.01,261.95 321.97,314.2 328.41,314.2C334.85,314.2 340.31,263.21 347.73,262.31C353.57,261.6 359.92,289.39 367.05,290.61C373.01,291.63 379.92,281.18 386.36,276.46C392.8,271.74 398.91,263.66 405.68,262.31Q411.85,261.08 425,267.03" style="vector-effect: non-scaling-stroke; fill: none; stroke: rgb(214, 39, 40); stroke-opacity: 1; stroke-width: 2px; opacity: 1;"/>
            </g>
            <g class="points"/>
            <g class="text"/>
          </g>
          <g class="trace scatter trace3adbcc" style="stroke-miterlimit: 2; opacity: 1;">
            <g class="fills"/>
            <g class="errorbars"/>
            <g class="lines">
              <path class="js-line" d="M0,366.08Q13.57,370.19 19.32,375.52C26.99,382.63 30.75,402.65 38.64,408.53C44.33,412.77 51.47,412.47 57.95,413.25C64.34,414.02 70.88,414.02 77.27,413.25C83.76,412.47 90.15,410.1 96.59,408.53C103.03,406.96 109.47,405.39 115.91,403.82C122.35,402.25 128.74,399.88 135.23,399.1C141.62,398.33 148.42,397.09 154.55,399.1C161.37,401.33 167.04,411.02 173.86,413.25C179.99,415.26 187.32,416.02 193.18,413.25C200.54,409.77 206.24,398.03 212.5,389.67C219.14,380.8 225.98,372.63 231.82,361.36C239.24,347.03 243.42,322.93 251.14,309.48C256.87,299.5 264.72,284.94 270.45,285.89C278.17,287.17 280.93,328.03 289.77,337.78C295.28,343.85 303.42,349.1 309.09,347.21C317.05,344.56 322.12,322.5 328.41,309.48C335.01,295.82 339.48,269.99 347.73,267.03C353.33,265.02 361.64,279.56 367.05,276.46C385.7,265.77 370.85,26.64 386.36,21.75C391.72,20.06 399.03,38.08 405.68,45.33Q411.94,52.16 425,64.2" style="vector-effect: non-scaling-stroke; fill: none; stroke: rgb(148, 103, 189); stroke-opacity: 1; stroke-width: 2px; opacity: 1;"/>
            </g>
            <g class="points"/>
            <g class="text"/>
          </g>
          <g class="trace scatter trace4de368" style="stroke-miterlimit: 2; opacity: 1;">
            <g class="fills"/>
            <g class="errorbars"/>
            <g class="lines">
              <path class="js-line" d="M0,413.25Q12.88,413.25 19.32,413.25C25.76,413.25 32.2,413.25 38.64,413.25C45.08,413.25 51.51,413.25 57.95,413.25C64.39,413.25 70.83,413.25 77.27,413.25C83.71,413.25 90.15,413.25 96.59,413.25C103.03,413.25 109.47,413.25 115.91,413.25C122.35,413.25 128.79,413.25 135.23,413.25C141.67,413.25 148.11,413.25 154.55,413.25C160.99,413.25 167.88,415.69 173.86,413.25C180.94,410.37 186.17,398.27 193.18,394.38C199.2,391.04 206.61,393.38 212.5,389.67C219.79,385.08 225.38,366.08 231.82,366.08C238.26,366.08 243.85,385.08 251.14,389.67C257.02,393.37 264.57,396.35 270.45,394.38C277.74,391.94 282.89,371.67 289.77,370.8C295.87,370.03 303.24,386.16 309.09,384.95C316.48,383.42 322.84,366.03 328.41,351.93C336.82,330.66 338.5,285.9 347.73,267.03C353.19,255.86 360.17,249.96 367.05,243.44C373.14,237.67 380.93,227.39 386.36,229.29C395.87,232.61 395.34,293.96 405.68,300.05Q411.06,303.22 425,295.33" style="vector-effect: non-scaling-stroke; fill: none; stroke: rgb(140, 86, 75); stroke-opacity: 1; stroke-width: 2px; opacity: 1;"/>
            </g>
            <g class="points"/>
            <g class="text"/>
          </g>
        </g>
      </g>
      <g class="overplot"/>
      <path class="xlines-above crisp" d="M0,0" style="fill: none;"/>
      <path class="ylines-above crisp" d="M0,0" style="fill: none;"/>
      <g class="overlines-above"/>
      <g class="xaxislayer-above">
        <g class="xtick">
          <text text-anchor="middle" x="0" y="475" transform="translate(79.32,0)" style="font-family: 'Alegreya Sans', sans-serif; font-size: 14px; fill: rgb(68, 68, 68); fill-opacity: 1; white-space: pre; opacity: 1;">1800</text>
        </g>
        <g class="xtick">
          <text text-anchor="middle" x="0" y="475" style="font-family: 'Alegreya Sans', sans-serif; font-size: 14px; fill: rgb(68, 68, 68); fill-opacity: 1; white-space: pre; opacity: 1;" transform="translate(175.91,0)">1850</text>
        </g>
        <g class="xtick">
          <text text-anchor="middle" x="0" y="475" style="font-family: 'Alegreya Sans', sans-serif; font-size: 14px; fill: rgb(68, 68, 68); fill-opacity: 1; white-space: pre; opacity: 1;" transform="translate(272.5,0)">1900</text>
        </g>
        <g class="xtick">
          <text text-anchor="middle" x="0" y="475" style="font-family: 'Alegreya Sans', sans-serif; font-size: 14px; fill: rgb(68, 68, 68); fill-opacity: 1; white-space: pre; opacity: 1;" transform="translate(369.09,0)">1950</text>
        </g>
        <g class="xtick">
          <text text-anchor="middle" x="0" y="475" style="font-family: 'Alegreya Sans', sans-serif; font-size: 14px; fill: rgb(68, 68, 68); fill-opacity: 1; white-space: pre; opacity: 1;" transform="translate(465.68,0)">2000</text>
        </g>
      </g>
      <g class="yaxislayer-above">
        <g class="ytick">
          <text text-anchor="end" x="59" y="4.8999999999999995" transform="translate(0,438.25)" style="font-family: 'Alegreya Sans', sans-serif; font-size: 14px; fill: rgb(68, 68, 68); fill-opacity: 1; white-space: pre; opacity: 1;">0</text>
        </g>
        <g class="ytick">
          <text text-anchor="end" x="59" y="4.8999999999999995" style="font-family: 'Alegreya Sans', sans-serif; font-size: 14px; fill: rgb(68, 68, 68); fill-opacity: 1; white-space: pre; opacity: 1;" transform="translate(0,391.08)">10</text>
        </g>
        <g class="ytick">
          <text text-anchor="end" x="59" y="4.8999999999999995" style="font-family: 'Alegreya Sans', sans-serif; font-size: 14px; fill: rgb(68, 68, 68); fill-opacity: 1; white-space: pre; opacity: 1;" transform="translate(0,343.91)">20</text>
        </g>
        <g class="ytick">
          <text text-anchor="end" x="59" y="4.8999999999999995" style="font-family: 'Alegreya Sans', sans-serif; font-size: 14px; fill: rgb(68, 68, 68); fill-opacity: 1; white-space: pre; opacity: 1;" transform="translate(0,296.74)">30</text>
        </g>
        <g class="ytick">
          <text text-anchor="end" x="59" y="4.8999999999999995" style="font-family: 'Alegreya Sans', sans-serif; font-size: 14px; fill: rgb(68, 68, 68); fill-opacity: 1; white-space: pre; opacity: 1;" transform="translate(0,249.58)">40</text>
        </g>
        <g class="ytick">
          <text text-anchor="end" x="59" y="4.8999999999999995" style="font-family: 'Alegreya Sans', sans-serif; font-size: 14px; fill: rgb(68, 68, 68); fill-opacity: 1; white-space: pre; opacity: 1;" transform="translate(0,202.41)">50</text>
        </g>
        <g class="ytick">
          <text text-anchor="end" x="59" y="4.8999999999999995" style="font-family: 'Alegreya Sans', sans-serif; font-size: 14px; fill: rgb(68, 68, 68); fill-opacity: 1; white-space: pre; opacity: 1;" transform="translate(0,155.24)">60</text>
        </g>
        <g class="ytick">
          <text text-anchor="end" x="59" y="4.8999999999999995" style="font-family: 'Alegreya Sans', sans-serif; font-size: 14px; fill: rgb(68, 68, 68); fill-opacity: 1; white-space: pre; opacity: 1;" transform="translate(0,108.07)">70</text>
        </g>
        <g class="ytick">
          <text text-anchor="end" x="59" y="4.8999999999999995" style="font-family: 'Alegreya Sans', sans-serif; font-size: 14px; fill: rgb(68, 68, 68); fill-opacity: 1; white-space: pre; opacity: 1;" transform="translate(0,60.9)">80</text>
        </g>
      </g>
      <g class="overaxes-above"/>
    </g>
  </g>
  <g class="polarlayer"/>
  <g class="smithlayer"/>
  <g class="ternarylayer"/>
  <g class="geolayer"/>
  <g class="funnelarealayer"/>
  <g class="pielayer"/>
  <g class="iciclelayer"/>
  <g class="treemaplayer"/>
  <g class="sunburstlayer"/>
  <g class="glimages"/>
  <defs id="topdefs-f1358d">
    <g class="clips"/>
    <clipPath id="legendf1358d">
      <rect width="197" height="138" x="0" y="0"/>
    </clipPath>
  </defs>
  <g class="layer-above">
    <g class="imagelayer"/>
    <g class="shapelayer"/>
  </g>
  <g class="infolayer">
    <g class="legend" pointer-events="all" transform="translate(493.5,25)">
      <rect class="bg" shape-rendering="crispEdges" width="197" height="138" x="0" y="0" style="stroke: rgb(68, 68, 68); stroke-opacity: 1; fill: rgb(0, 0, 0); fill-opacity: 0; stroke-width: 0px;"/>
      <g class="scrollbox" transform="" clip-path="url(#legendf1358d)">
        <g class="groups">
          <g class="traces" transform="translate(0,15.6)" style="opacity: 1;">
            <text class="legendtext" text-anchor="start" x="40" y="5.46" style="font-family: 'Alegreya Sans', sans-serif; font-size: 14px; fill: rgb(68, 68, 68); fill-opacity: 1; white-space: pre;">Africa</text>
            <g class="layers" style="opacity: 1;">
              <g class="legendfill"/>
              <g class="legendlines">
                <path class="js-line" d="M5,0h30" style="fill: none; stroke: rgb(31, 119, 180); stroke-opacity: 1; stroke-width: 2px;"/>
              </g>
              <g class="legendsymbols">
                <g class="legendpoints"/>
              </g>
            </g>
            <rect class="legendtoggle" x="0" y="-10.6" width="191.578125" height="21.2" style="fill: rgb(0, 0, 0); fill-opacity: 0;"/>
          </g>
          <g class="traces" transform="translate(0,36.8)" style="opacity: 1;">
            <text class="legendtext" text-anchor="start" x="40" y="5.46" style="font-family: 'Alegreya Sans', sans-serif; font-size: 14px; fill: rgb(68, 68, 68); fill-opacity: 1; white-space: pre;">Americas</text>
            <g class="layers" style="opacity: 1;">
              <g class="legendfill"/>
              <g class="legendlines">
                <path class="js-line" d="M5,0h30" style="fill: none; stroke: rgb(255, 127, 14); stroke-opacity: 1; stroke-width: 2px;"/>
              </g>
              <g class="legendsymbols">
                <g class="legendpoints"/>
              </g>
            </g>
            <rect class="legendtoggle" x="0" y="-10.6" width="191.578125" height="21.2" style="fill: rgb(0, 0, 0); fill-opacity: 0;"/>
          </g>
          <g class="traces" transform="translate(0,58)" style="opacity: 1;">
            <text class="legendtext" text-anchor="start" x="40" y="5.46" style="font-family: 'Alegreya Sans', sans-serif; font-size: 14px; fill: rgb(68, 68, 68); fill-opacity: 1; white-space: pre;">Asia</text>
            <g class="layers" style="opacity: 1;">
              <g class="legendfill"/>
              <g class="legendlines">
                <path class="js-line" d="M5,0h30" style="fill: none; stroke: rgb(44, 160, 44); stroke-opacity: 1; stroke-width: 2px;"/>
              </g>
              <g class="legendsymbols">
                <g class="legendpoints"/>
              </g>
            </g>
            <rect class="legendtoggle" x="0" y="-10.6" width="191.578125" height="21.2" style="fill: rgb(0, 0, 0); fill-opacity: 0;"/>
          </g>
          <g class="traces" transform="translate(0,79.19999999999999)" style="opacity: 1;">
            <text class="legendtext" text-anchor="start" x="40" y="5.46" style="font-family: 'Alegreya Sans', sans-serif; font-size: 14px; fill: rgb(68, 68, 68); fill-opacity: 1; white-space: pre;">Switzerland &amp; Liechtenstein</text>
            <g class="layers" style="opacity: 1;">
              <g class="legendfill"/>
              <g class="legendlines">
                <path class="js-line" d="M5,0h30" style="fill: none; stroke: rgb(214, 39, 40); stroke-opacity: 1; stroke-width: 2px;"/>
              </g>
              <g class="legendsymbols">
                <g class="legendpoints"/>
              </g>
            </g>
            <rect class="legendtoggle" x="0" y="-10.6" width="191.578125" height="21.2" style="fill: rgb(0, 0, 0); fill-opacity: 0;"/>
          </g>
          <g class="traces" transform="translate(0,100.39999999999999)" style="opacity: 1;">
            <text class="legendtext" text-anchor="start" x="40" y="5.46" style="font-family: 'Alegreya Sans', sans-serif; font-size: 14px; fill: rgb(68, 68, 68); fill-opacity: 1; white-space: pre;">rest of Europe</text>
            <g class="layers" style="opacity: 1;">
              <g class="legendfill"/>
              <g class="legendlines">
                <path class="js-line" d="M5,0h30" style="fill: none; stroke: rgb(148, 103, 189); stroke-opacity: 1; stroke-width: 2px;"/>
              </g>
              <g class="legendsymbols">
                <g class="legendpoints"/>
              </g>
            </g>
            <rect class="legendtoggle" x="0" y="-10.6" width="191.578125" height="21.2" style="fill: rgb(0, 0, 0); fill-opacity: 0;"/>
          </g>
          <g class="traces" transform="translate(0,121.6)" style="opacity: 1;">
            <text class="legendtext" text-anchor="start" x="40" y="5.46" style="font-family: 'Alegreya Sans', sans-serif; font-size: 14px; fill: rgb(68, 68, 68); fill-opacity: 1; white-space: pre;">Oceania</text>
            <g class="layers" style="opacity: 1;">
              <g class="legendfill"/>
              <g class="legendlines">
                <path class="js-line" d="M5,0h30" style="fill: none; stroke: rgb(140, 86, 75); stroke-opacity: 1; stroke-width: 2px;"/>
              </g>
              <g class="legendsymbols">
                <g class="legendpoints"/>
              </g>
            </g>
            <rect class="legendtoggle" x="0" y="-10.6" width="191.578125" height="21.2" style="fill: rgb(0, 0, 0); fill-opacity: 0;"/>
          </g>
        </g>
      </g>
      <rect class="scrollbar" rx="20" ry="3" width="0" height="0" x="0" y="0" style="fill: rgb(128, 139, 164); fill-opacity: 1;"/>
    </g>
    <g class="g-gtitle"/>
    <g class="g-xtitle"/>
    <g class="g-ytitle"/>
  </g>
</svg>
