semester, code, name
semester-6,CS4457,Project Management and Practice
semester-6,CS4187,Professional Issues in Computing
semester-6,CS4084,Mobile Application Development
semester-6,CS4116,Software Development Project
semester-6,CS4106,Machine Learning: Methods and Applications
