<?xml version="1.0" encoding="UTF-8" standalone="no"?>
<!-- Created with Inkscape (http://www.inkscape.org/) -->

<svg
   width="8.0615253"
   height="8.4051752"
   viewBox="0 0 9.6738304 10.08621"
   version="1.1"
   id="skull"
   xml:space="preserve"
   style="clip-rule:evenodd;fill-rule:evenodd;stroke-linejoin:round;stroke-miterlimit:1.41421"
   xmlns="http://www.w3.org/2000/svg"
   xmlns:svg="http://www.w3.org/2000/svg"><defs
   id="defs1" />
   <g
   id="layer1"
   transform="translate(-129.11822,-148.13256)">
      <path
   d="m 130.48092,148.13256 c -0.3765,-1.4e-4 -0.68175,0.3051 -0.68161,0.68161 -0.3761,1.5e-4 -0.68094,0.305 -0.68109,0.6811 -1.7e-4,0.37633 0.30479,0.68146 0.68109,0.68161 0.13714,-4.2e-4 0.27096,-0.0422 0.38396,-0.11989 l 0.81907,0.83819 0.74104,-0.89193 -0.7183,-0.78238 c 0.0882,-0.11728 0.1363,-0.25994 0.13694,-0.4067 1.6e-4,-0.37632 -0.3048,-0.68146 -0.6811,-0.68161 z m 6.94842,0 c -0.3763,1.5e-4 -0.68126,0.30529 -0.6811,0.68161 6.4e-4,0.14676 0.0487,0.28942 0.13694,0.4067 l -0.73845,0.8046 0.76119,0.86971 0.81907,-0.83819 c 0.113,0.0777 0.24682,0.11947 0.38396,0.11989 0.3763,-1.5e-4 0.68127,-0.30528 0.6811,-0.68161 -1.5e-4,-0.3761 -0.30501,-0.68095 -0.6811,-0.6811 1.3e-4,-0.37651 -0.30511,-0.68175 -0.68161,-0.68161 z m -3.43804,1.42575 c -2.70046,0 -3.21634,2.50683 -3.21634,2.50683 v 2.95589 l 1.63763,0.71623 0.3545,0.8723 h 2.53938 l 0.32711,-0.8723 1.57407,-0.71623 v -2.95589 c 0,0 -0.66563,-2.50683 -3.21635,-2.50683 z m -1.6247,3.13108 a 0.74049503,0.45364228 0 0 1 0.74052,0.45372 0.74049503,0.45364228 0 0 1 -0.74052,0.45372 0.74049503,0.45364228 0 0 1 -0.74053,-0.45372 0.74049503,0.45364228 0 0 1 0.74053,-0.45372 z m 3.17655,0 a 0.74049503,0.45364228 0 0 1 0.74052,0.45372 0.74049503,0.45364228 0 0 1 -0.74052,0.45372 0.74049503,0.45364228 0 0 1 -0.74053,-0.45372 0.74049503,0.45364228 0 0 1 0.74053,-0.45372 z m -1.49655,1.07228 0.20877,0.55966 0.20826,0.55966 h -0.41703 -0.41755 l 0.20878,-0.55966 z m -3.04426,1.69447 -0.81907,0.8382 c -0.113,-0.0777 -0.24682,-0.11947 -0.38396,-0.11989 -0.3763,1.5e-4 -0.68126,0.30528 -0.68109,0.68161 1.5e-4,0.3761 0.30499,0.68094 0.68109,0.68109 -1.4e-4,0.37651 0.30511,0.68176 0.68161,0.68162 0.3763,-1.5e-4 0.68126,-0.3053 0.6811,-0.68162 -6.4e-4,-0.14676 -0.0487,-0.28941 -0.13694,-0.40669 l 1.02681,-1.11879 z m 5.90558,0 -1.04955,0.55553 1.02681,1.11879 c -0.0882,0.11728 -0.1363,0.25993 -0.13694,0.40669 -1.6e-4,0.37632 0.3048,0.68147 0.6811,0.68162 0.3765,1.4e-4 0.68174,-0.30511 0.68161,-0.68162 0.37609,-1.5e-4 0.68095,-0.30499 0.6811,-0.68109 1.7e-4,-0.37633 -0.3048,-0.68146 -0.6811,-0.68161 -0.13714,4.2e-4 -0.27096,0.0422 -0.38396,0.11989 z"
   id="path1"
   style="fill-opacity:1;stroke:none;stroke-width:0.9996;stroke-dasharray:none" />
    </g>
</svg>
