module tuimonster

go 1.23

require github.com/gizak/termui/v3 v3.1.0

require (
	github.com/mattn/go-runewidth v0.0.15 // indirect
	github.com/mitchellh/go-wordwrap v1.0.1 // indirect
	github.com/nsf/termbox-go v1.1.1 // indirect
	github.com/rivo/uniseg v0.4.7 // indirect
)
