https://cloud-images.ubuntu.com/bionic/current/bionic-server-cloudimg-amd64.img::8dd2e6b5e5aad20c3f836123b300cba9861249408cbb07c359145a65d6bab6b6
https://cloud-images.ubuntu.com/focal/current/focal-server-cloudimg-amd64.img::5c054e515addacae2a9ce1a4ad796715406debf2cb9e467286e8e4744ad03dff
https://cloud-images.ubuntu.com/jammy/current/jammy-server-cloudimg-amd64.img::dcc6b52c52e309edbeca2d542c8800a8f9a14f355d71b172cbb83d79ca050d55
https://cloud.centos.org/centos/7/images/CentOS-7-x86_64-GenericCloud.qcow2::284aab2b23d91318f169ff464bce4d53404a15a0618ceb34562838c59af4adea
https://dl.rockylinux.org/pub/rocky/8/images/x86_64/Rocky-8-GenericCloud-Base.latest.x86_64.qcow2::e56066c58606191e96184de9a9183a3af33c59bcbd8740d8b10ca054a7a89c14
https://dl.rockylinux.org/pub/rocky/9/images/x86_64/Rocky-9-GenericCloud-Base.latest.x86_64.qcow2::069493fdc807300a22176540e9171fcff2227a92b40a7985a0c1c9e21aeebf57