module gitlab.com/c2-games/red-team/saprus/sapcom/overlord

replace saprus/logo => ../../logo

replace saprus/nats_helper => ../../nats_helper

replace saprus/log_helper => ../../log_helper

go 1.23.5

require (
	github.com/go-kivik/kivik/v4 v4.3.3
	github.com/nats-io/nats.go v1.39.0
	github.com/spf13/cobra v1.9.1
	github.com/spf13/viper v1.19.0
	golang.org/x/crypto v0.33.0
	saprus/log_helper v0.0.0-00010101000000-000000000000
	saprus/logo v0.0.0-00010101000000-000000000000
	saprus/nats_helper v0.0.0-00010101000000-000000000000
)

require (
	github.com/bytedance/sonic v1.12.8 // indirect
	github.com/bytedance/sonic/loader v0.2.3 // indirect
	github.com/cloudwego/base64x v0.1.5 // indirect
	github.com/gabriel-vasile/mimetype v1.4.8 // indirect
	github.com/gin-contrib/sse v1.0.0 // indirect
	github.com/go-playground/locales v0.14.1 // indirect
	github.com/go-playground/universal-translator v0.18.1 // indirect
	github.com/go-playground/validator/v10 v10.25.0 // indirect
	github.com/goccy/go-json v0.10.5 // indirect
	github.com/json-iterator/go v1.1.12 // indirect
	github.com/klauspost/cpuid/v2 v2.2.9 // indirect
	github.com/leodido/go-urn v1.4.0 // indirect
	github.com/mattn/go-isatty v0.0.20 // indirect
	github.com/modern-go/concurrent v0.0.0-20180306012644-bacd9c7ef1dd // indirect
	github.com/modern-go/reflect2 v1.0.2 // indirect
	github.com/twitchyliquid64/golang-asm v0.15.1 // indirect
	github.com/ugorji/go/codec v1.2.12 // indirect
	golang.org/x/arch v0.14.0 // indirect
	google.golang.org/protobuf v1.36.5 // indirect
)

require (
	github.com/fsnotify/fsnotify v1.8.0 // indirect
	github.com/gin-gonic/gin v1.10.0
	github.com/google/uuid v1.6.0 // indirect
	github.com/hashicorp/hcl v1.0.0 // indirect
	github.com/inconshreveable/mousetrap v1.1.0 // indirect
	github.com/klauspost/compress v1.17.11 // indirect
	github.com/magiconair/properties v1.8.9 // indirect
	github.com/mitchellh/mapstructure v1.5.0 // indirect
	github.com/nats-io/nkeys v0.4.10 // indirect
	github.com/nats-io/nuid v1.0.1 // indirect
	github.com/pelletier/go-toml/v2 v2.2.3 // indirect
	github.com/sagikazarmark/locafero v0.7.0 // indirect
	github.com/sagikazarmark/slog-shim v0.1.0 // indirect
	github.com/sourcegraph/conc v0.3.0 // indirect
	github.com/spf13/afero v1.12.0 // indirect
	github.com/spf13/cast v1.7.1 // indirect
	github.com/spf13/pflag v1.0.6
	github.com/subosito/gotenv v1.6.0 // indirect
	go.uber.org/multierr v1.11.0 // indirect
	golang.org/x/exp v0.0.0-20250215185904-eff6e970281f // indirect
	golang.org/x/net v0.35.0 // indirect
	golang.org/x/sync v0.11.0 // indirect
	golang.org/x/sys v0.30.0 // indirect
	golang.org/x/text v0.22.0 // indirect
	gopkg.in/ini.v1 v1.67.0 // indirect
	gopkg.in/yaml.v3 v3.0.1 // indirect
)
