module soxprox

go 1.21.0

require github.com/gobwas/ws v1.3.0

require (
	github.com/gobwas/httphead v0.1.0 // indirect
	github.com/gobwas/pool v0.2.1 // indirect
	golang.org/x/sys v0.6.0 // indirect
)
