{
  "title" : "Direkt beim Imker kaufen",
  "description" : "Ich verkaufe Honig und spreche gern mit Ihnen über die Bienenhaltung und die guten Wirkungen des Honigs.",
  "content" : [
    {
      "icon" : "home",
      "title" : "Honig aus der Nachbarschaft",
      "description" : "Von Februar bis November sammeln meine Bienen von den Blüten und Blättern aus ihrer Nachbarschaft Nektar und Honigtau und machen daraus wohlschmeckenden Honig für Sie."
    },
    {
      "icon" : "tint",
      "title" : "natürliche Qualität",
      "description" : "Honig ist ein reines und unverfälschtes Naturprodukt, das Sie nur vom Imker (oder von seinen Vertriebspartnern) in dieser garantierten Qualität erhalten können."
    },
    {
      "icon" : "archive",
      "title" : "Bienenvolk kaufen",
      "description" : "Natürlich können Sie bei mir auch ein Bienenvolk für Ihre eigene (neue) Imkerei oder etwas Wachs für Ihre Kosmetikprodukte kaufen."
    }
  ]  
}