C:\Users\User\Documents\JavaPractice\java_practice\JavaPractice\src\main\java\exercise\java\ArrList.java
C:\Users\User\Documents\JavaPractice\java_practice\JavaPractice\src\main\java\polymorphism\java\Dog.java
C:\Users\User\Documents\JavaPractice\java_practice\JavaPractice\src\main\java\encapsulation\java\Child1.java
C:\Users\User\Documents\JavaPractice\java_practice\JavaPractice\src\main\java\polymorphism\java\Animal.java
C:\Users\User\Documents\JavaPractice\java_practice\JavaPractice\src\main\java\encapsulation\java\Main.java
C:\Users\User\Documents\JavaPractice\java_practice\JavaPractice\src\main\java\inheritance\java\Vehicle.java
C:\Users\User\Documents\JavaPractice\java_practice\JavaPractice\src\main\java\polymorphism\java\Main.java
C:\Users\User\Documents\JavaPractice\java_practice\JavaPractice\src\main\java\exercise\java\ex2.java
C:\Users\User\Documents\JavaPractice\java_practice\JavaPractice\src\main\java\polymorphism\java\Cat.java
C:\Users\User\Documents\JavaPractice\java_practice\JavaPractice\src\main\java\inheritance\java\Main.java
C:\Users\User\Documents\JavaPractice\java_practice\JavaPractice\src\main\java\exercise\java\Main.java
C:\Users\User\Documents\JavaPractice\java_practice\JavaPractice\src\main\java\inheritance\java\Car.java
C:\Users\User\Documents\JavaPractice\java_practice\JavaPractice\src\main\java\encapsulation\java\Parent.java
