<?xml version="1.0" encoding="UTF-8" standalone="no"?>
<!-- Created for Onboard -->

<svg
   xmlns:dc="http://purl.org/dc/elements/1.1/"
   xmlns:cc="http://creativecommons.org/ns#"
   xmlns:rdf="http://www.w3.org/1999/02/22-rdf-syntax-ns#"
   xmlns:svg="http://www.w3.org/2000/svg"
   xmlns="http://www.w3.org/2000/svg"
   xmlns:sodipodi="http://sodipodi.sourceforge.net/DTD/sodipodi-0.dtd"
   xmlns:inkscape="http://www.inkscape.org/namespaces/inkscape"
   id="svg2"
   height="115"
   width="330"
   version="1.0"
   inkscape:version="0.91 r13725"
   sodipodi:docname="tmx-Alpha.svg">
  <defs
     id="defs90" />
  <sodipodi:namedview
     pagecolor="#ffffff"
     bordercolor="#666666"
     borderopacity="1"
     objecttolerance="10"
     gridtolerance="10"
     guidetolerance="10"
     inkscape:pageopacity="0"
     inkscape:pageshadow="2"
     inkscape:window-width="1920"
     inkscape:window-height="994"
     id="namedview88"
     showgrid="false"
     inkscape:zoom="3.0827254"
     inkscape:cx="127.24578"
     inkscape:cy="65.663466"
     inkscape:window-x="0"
     inkscape:window-y="24"
     inkscape:window-maximized="1"
     inkscape:current-layer="svg2"
     inkscape:snap-bbox="true"
     inkscape:bbox-nodes="true"
     inkscape:bbox-paths="true"
     fit-margin-top="0"
     fit-margin-left="0"
     fit-margin-right="0"
     fit-margin-bottom="0"
     showguides="false"
     inkscape:guide-bbox="true"
     inkscape:snap-global="true"
     inkscape:object-paths="false"
     inkscape:object-nodes="true" />
  <metadata
     id="metadata3346">
    <rdf:RDF>
      <cc:Work
         rdf:about="">
        <dc:format>image/svg+xml</dc:format>
        <dc:type
           rdf:resource="http://purl.org/dc/dcmitype/StillImage" />
        <dc:title>Compact-Alpha.svg</dc:title>
        <cc:license
           rdf:resource="https://www.gnu.org/licenses/gpl.txt" />
        <dc:creator>
          <cc:Agent>
            <dc:title>Onboard Devel Team at https://launchpad.net/~onboard</dc:title>
          </cc:Agent>
        </dc:creator>
        <dc:rights>
          <cc:Agent>
            <dc:title>GPL-3+ license</dc:title>
          </cc:Agent>
        </dc:rights>
        <dc:publisher>
          <cc:Agent>
            <dc:title>Onboard Devel Team</dc:title>
          </cc:Agent>
        </dc:publisher>
        <dc:source>https://launchpad.net/onboard</dc:source>
        <dc:relation>This file is part of Onboard</dc:relation>
        <dc:contributor>
          <cc:Agent>
            <dc:title>Copyright © 2013, 2016, Francesco Fumanti &lt;francesco.fumanti@gmx.net&gt;
Copyright © 2011-2014, marmuta &lt;marmvta@gmail.com&gt;</dc:title>
          </cc:Agent>
        </dc:contributor>
      </cc:Work>
    </rdf:RDF>
  </metadata>
  <rect
     id="wordlist"
     height="15.028312"
     width="306.52832"
     y="-11.570558"
     x="0.71522117"
     style="fill:#151530;stroke:#7f7f7f;stroke-width:0.97168803;stroke-miterlimit:4;stroke-dasharray:none" />
  <rect
     id="prediction"
     height="15"
     width="49"
     y="-11.556401"
     x="71.729378"
     style="color:#000000;display:inline;overflow:visible;visibility:visible;fill:#2b2b63;fill-opacity:1;fill-rule:nonzero;stroke:#7f7f7f;stroke-width:1;stroke-linecap:butt;stroke-linejoin:miter;stroke-miterlimit:4;stroke-dasharray:none;stroke-dashoffset:0;stroke-opacity:1;marker:none;enable-background:accumulate" />
  <rect
     id="correction"
     height="15"
     width="49"
     y="-11.556401"
     x="1.7293772"
     style="color:#000000;display:inline;overflow:visible;visibility:visible;fill:#2b2b63;fill-opacity:1;fill-rule:nonzero;stroke:#7f7f7f;stroke-width:1;stroke-linecap:butt;stroke-linejoin:miter;stroke-miterlimit:4;stroke-dasharray:none;stroke-dashoffset:0;stroke-opacity:1;marker:none;enable-background:accumulate"
     inkscape:label="#correction" />
  <rect
     id="expand-corrections"
     height="14.685742"
     width="16.685743"
     y="-11.399272"
     x="52.886505"
     style="fill:#2b2b63;stroke:#7f7f7f;stroke-width:1.3142575;stroke-miterlimit:4;stroke-dasharray:none" />
  <rect
     id="AB01"
     style="fill:#e5d8b2;stroke:#000000"
     height="18"
     width="18"
     y="77.5"
     x="19" />
  <rect
     id="AE02"
     style="fill:#e5d8b2;stroke:#000000"
     height="18"
     width="18"
     y="20.5"
     x="38" />
  <rect
     id="AE03"
     style="fill:#e5d8b2;stroke:#000000"
     height="18"
     width="18"
     y="20.5"
     x="57" />
  <rect
     id="AD09"
     style="fill:#e5d8b2;stroke:#000000"
     height="18"
     width="18"
     y="39.5"
     x="190" />
  <rect
     id="AE01"
     style="fill:#e5d8b2;stroke:#000000"
     height="18"
     width="18"
     y="20.5"
     x="19" />
  <rect
     id="AE06"
     style="fill:#e5d8b2;stroke:#000000"
     height="18"
     width="18"
     y="20.5"
     x="133" />
  <rect
     id="AE07"
     style="fill:#e5d8b2;stroke:#000000"
     height="18"
     width="18"
     y="20.5"
     x="152" />
  <rect
     id="AE04"
     style="fill:#e5d8b2;stroke:#000000"
     height="18"
     width="18"
     y="20.5"
     x="76" />
  <rect
     id="AE05"
     style="fill:#e5d8b2;stroke:#000000"
     height="18"
     width="18"
     y="20.5"
     x="95" />
  <rect
     id="AD03"
     style="fill:#e5d8b2;stroke:#000000"
     height="18"
     width="18"
     y="39.5"
     x="57" />
  <rect
     id="AD02"
     style="fill:#e5d8b2;stroke:#000000"
     height="18"
     width="18"
     y="39.5"
     x="38" />
  <rect
     id="AD01"
     style="fill:#e5d8b2;stroke:#000000"
     height="18"
     width="18"
     y="39.500004"
     x="18.96723" />
  <rect
     id="AE09"
     style="fill:#e5d8b2;stroke:#000000"
     height="18"
     width="18"
     y="20.5"
     x="190" />
  <rect
     id="AD07"
     style="fill:#e5d8b2;stroke:#000000"
     height="18"
     width="18"
     y="39.5"
     x="152" />
  <rect
     id="AD06"
     style="fill:#e5d8b2;stroke:#000000"
     height="18"
     width="18"
     y="39.5"
     x="133" />
  <rect
     id="AD05"
     style="fill:#e5d8b2;stroke:#000000"
     height="18"
     width="18"
     y="39.5"
     x="95" />
  <rect
     id="AD04"
     style="fill:#e5d8b2;stroke:#000000"
     height="18"
     width="18"
     y="39.5"
     x="76" />
  <rect
     id="AB10"
     style="fill:#e5d8b2;stroke:#000000"
     height="18"
     width="18"
     y="77.5"
     x="209" />
  <rect
     id="AC11"
     style="fill:#e5d8b2;stroke:#000000"
     height="18"
     width="18"
     y="58.5"
     x="228" />
  <rect
     id="AC10"
     style="fill:#e5d8b2;stroke:#000000"
     height="18"
     width="18"
     y="58.5"
     x="209" />
  <rect
     id="TLDE"
     style="fill:#e5d8b2;stroke:#000000;stroke-width:0.99999994"
     height="18"
     width="17.5"
     y="20.5"
     x="0.5" />
  <rect
     id="LSGT"
     style="fill:#e5d8b2;stroke:#000000"
     height="18"
     width="18"
     y="96.500008"
     x="19.058372" />
  <rect
     id="BKSL"
     style="fill:#e5d8b2;stroke:#000000;stroke-width:0.99999994"
     height="18"
     width="18"
     y="77.5"
     x="228" />
  <rect
     id="AD10"
     style="fill:#e5d8b2;stroke:#000000"
     height="18"
     width="18"
     y="39.5"
     x="209" />
  <rect
     id="AD11"
     style="fill:#e5d8b2;stroke:#000000"
     height="18"
     width="18"
     y="39.5"
     x="228" />
  <rect
     id="AD12"
     style="fill:#e5d8b2;stroke:#000000"
     height="18"
     width="18"
     y="39.5"
     x="247" />
  <rect
     id="AB08"
     style="fill:#e5d8b2;stroke:#000000"
     height="18"
     width="18"
     y="77.5"
     x="171" />
  <rect
     id="AE11"
     style="fill:#e5d8b2;stroke:#000000"
     height="18"
     width="18"
     y="20.5"
     x="228" />
  <rect
     id="AE10"
     style="fill:#e5d8b2;stroke:#000000"
     height="18"
     width="18"
     y="20.5"
     x="209" />
  <rect
     id="AE12"
     style="fill:#e5d8b2;stroke:#000000"
     height="18"
     width="18"
     y="20.5"
     x="247" />
  <rect
     id="AC04"
     style="fill:#e5d8b2;stroke:#000000"
     height="18"
     width="18"
     y="58.5"
     x="75.967232" />
  <rect
     id="AC05"
     style="fill:#e5d8b2;stroke:#000000"
     height="18"
     width="18"
     y="58.5"
     x="95" />
  <rect
     id="AC06"
     style="fill:#e5d8b2;stroke:#000000"
     height="18"
     width="18"
     y="58.5"
     x="133" />
  <rect
     id="AC07"
     style="fill:#e5d8b2;stroke:#000000"
     height="18"
     width="18"
     y="58.5"
     x="152" />
  <rect
     id="AB09"
     style="fill:#e5d8b2;stroke:#000000"
     height="18"
     width="18"
     y="77.5"
     x="190" />
  <rect
     id="AC01"
     style="fill:#e5d8b2;stroke:#000000"
     height="18"
     width="18"
     y="58.5"
     x="19" />
  <rect
     id="AC02"
     style="fill:#e5d8b2;stroke:#000000"
     height="18"
     width="18"
     y="58.5"
     x="38" />
  <rect
     id="AC03"
     style="fill:#e5d8b2;stroke:#000000"
     height="18"
     width="18"
     y="58.5"
     x="56.967232" />
  <rect
     id="AB05"
     style="fill:#e5d8b2;stroke:#000000"
     height="18"
     width="18"
     y="77.5"
     x="95" />
  <rect
     id="AB04"
     style="fill:#e5d8b2;stroke:#000000"
     height="18"
     width="18"
     y="77.5"
     x="75.967232" />
  <rect
     id="AE08"
     style="fill:#e5d8b2;stroke:#000000"
     height="18"
     width="18"
     y="20.5"
     x="171" />
  <rect
     id="AB06"
     style="fill:#e5d8b2;stroke:#000000"
     height="18"
     width="18"
     y="77.5"
     x="133" />
  <rect
     id="AC08"
     style="fill:#e5d8b2;stroke:#000000"
     height="18"
     width="18"
     y="58.5"
     x="171" />
  <rect
     id="AC09"
     style="fill:#e5d8b2;stroke:#000000"
     height="18"
     width="18"
     y="58.5"
     x="190" />
  <rect
     id="AB03"
     style="fill:#e5d8b2;stroke:#000000"
     height="18"
     width="18"
     y="77.5"
     x="56.967232" />
  <rect
     id="AB02"
     style="fill:#e5d8b2;stroke:#000000"
     height="18"
     width="18"
     y="77.5"
     x="38" />
  <rect
     id="AD08"
     style="fill:#e5d8b2;stroke:#000000"
     height="18"
     width="18"
     y="39.5"
     x="171" />
  <rect
     id="AB07"
     style="fill:#e5d8b2;stroke:#000000"
     height="18"
     width="18"
     y="77.5"
     x="152" />
  <rect
     id="RCTL"
     style="fill:#f2e5d8;stroke:#000000"
     height="18"
     width="23"
     y="96.5"
     x="242" />
  <rect
     id="LCTL"
     style="fill:#f2e5d8;stroke:#000000;stroke-width:0.81281418"
     height="18.187185"
     width="17.654415"
     y="96.40641"
     x="0.4064078" />
  <rect
     id="LALT"
     style="fill:#f2e5d8;stroke:#000000;stroke-width:0.8891899"
     height="18.110809"
     width="18.073885"
     y="96.444595"
     x="56.944595" />
  <rect
     id="MENU"
     style="fill:#d8cca5;stroke:#000000"
     height="18"
     width="23"
     y="96.5"
     x="218" />
  <rect
     id="RWIN"
     style="fill:#d8cca5;stroke:#000000"
     height="18"
     width="23"
     y="96.5"
     x="194" />
  <rect
     id="LWIN"
     style="fill:#f2e5d8;stroke:#000000;stroke-width:0.8886869"
     height="18.111313"
     width="18.05294"
     y="96.444351"
     x="38.002716" />
  <rect
     id="BKSP"
     style="fill:#d8cca5;stroke:#000000;stroke-width:1.3013556"
     height="31.002523"
     width="17.698645"
     y="26.346802"
     x="114.15068" />
  <rect
     id="DELE"
     style="fill:#d8cca5;stroke:#000000;stroke-width:0.99999988"
     height="18"
     width="18"
     y="7.1961231"
     x="113.99999" />
  <rect
     id="LFSH"
     style="fill:#f2e5d8;stroke:#000000;stroke-width:1.1469847"
     height="36.853016"
     width="17.349169"
     y="58.573498"
     x="0.57733899" />
  <rect
     id="SPCE"
     style="fill:#e5d8b2;stroke:#000000;stroke-width:1.0156008"
     height="21.425055"
     width="94.021324"
     y="96.507797"
     x="75.970871" />
  <rect
     id="RALT"
     style="fill:#f2e5d8;stroke:#000000;stroke-width:1.00000012"
     height="18"
     width="22.000008"
     y="96.5"
     x="171" />
  <rect
     id="hide"
     style="fill:#e5d8b2;stroke:#000000"
     height="18"
     width="25"
     y="12.714681"
     x="271.70007" />
  <rect
     id="showclick"
     style="fill:#e5d8b2;stroke:#000000"
     height="18"
     width="12"
     y="31.714682"
     x="271.70007" />
  <rect
     id="move"
     style="fill:#e5d8b2;stroke:#000000"
     height="18"
     width="12"
     y="31.714682"
     x="284.70007" />
  <rect
     id="layer0"
     style="fill:#e5d8b2;stroke:#000000"
     height="18"
     width="25"
     y="50.71468"
     x="271.70007" />
  <rect
     id="layer1"
     style="fill:#e5d8b2;stroke:#000000"
     height="18"
     width="25"
     y="69.714684"
     x="271.70007" />
  <rect
     id="layer2"
     style="fill:#e5d8b2;stroke:#000000"
     height="18"
     width="25"
     y="88.714684"
     x="271.70007" />
  <rect
     id="inputline"
     style="fill:#151530;fill-opacity:0.59360729;stroke:#000000;stroke-width:1"
     height="18"
     width="246"
     y="-24.997866"
     x="34.180809" />
  <rect
     style="fill:#2b2b63;stroke:#7f7f7f;stroke-width:0.99999994;stroke-miterlimit:4;stroke-dasharray:none"
     x="285.72937"
     y="-11.556401"
     width="17"
     height="15"
     id="hide.wordlist"
     inkscape:label="" />
  <rect
     inkscape:label=""
     id="language.wordlist"
     height="15"
     width="17"
     y="-11.556401"
     x="265.72937"
     style="fill:#2b2b63;stroke:#7f7f7f;stroke-width:0.99999994;stroke-miterlimit:4;stroke-dasharray:none" />
  <rect
     style="fill:#2b2b63;stroke:#7f7f7f;stroke-width:0.99999994;stroke-miterlimit:4;stroke-dasharray:none"
     x="225.72937"
     y="-11.556401"
     width="17"
     height="15"
     id="next-predictions.wordlist"
     inkscape:label="" />
  <rect
     style="fill:#2b2b63;stroke:#7f7f7f;stroke-width:0.99999994;stroke-miterlimit:4;stroke-dasharray:none"
     x="205.72937"
     y="-11.556401"
     width="17"
     height="15"
     id="previous-predictions.wordlist"
     inkscape:label="" />
  <rect
     inkscape:label=""
     id="pause-learning.wordlist"
     height="15"
     width="17"
     y="-11.556401"
     x="245.72937"
     style="fill:#2b2b63;stroke:#7f7f7f;stroke-width:0.99999994;stroke-miterlimit:4;stroke-dasharray:none" />
  <rect
     id="TAB"
     style="fill:#e5d8b2;stroke:#000000;stroke-width:0.99999994"
     height="18"
     width="17.5"
     y="39.5"
     x="0.5" />
  <rect
     id="RTRN"
     style="fill:#d8cca5;stroke:#000000;stroke-width:1.40945601"
     height="36.590546"
     width="17.590544"
     y="58.704727"
     x="114.20473" />
  <rect
     id="RTSH"
     style="fill:#f2e5d8;stroke:#000000;stroke-width:1.16275775"
     height="36.837242"
     width="17.837248"
     y="58.581379"
     x="247.08138" />
  <rect
     id="F10"
     style="fill:#e5d8b2;stroke:#000000;stroke-width:0.83973867;enable-background:new"
     height="12.564564"
     width="18.183851"
     y="7.0155673"
     x="209.01424" />
  <rect
     id="F3"
     style="fill:#e5d8b2;stroke:#000000;stroke-width:0.83851641;enable-background:new"
     height="12.465361"
     width="18.275249"
     y="7.1153812"
     x="56.919258" />
  <rect
     id="F2"
     style="fill:#e5d8b2;stroke:#000000;stroke-width:0.83728045;enable-background:new"
     height="12.466597"
     width="18.219608"
     y="7.1147633"
     x="37.91864" />
  <rect
     id="ESC"
     height="12.477892"
     width="17.715261"
     y="7.1091156"
     x="0.37174666"
     style="fill:#e5d8b2;stroke:#000000;stroke-width:0.82598448;enable-background:new" />
  <rect
     id="F12"
     style="fill:#e5d8b2;stroke:#000000;stroke-width:0.8379001;enable-background:new"
     height="12.566402"
     width="18.101665"
     y="7.0146475"
     x="246.91895" />
  <rect
     id="F11"
     style="fill:#e5d8b2;stroke:#000000;stroke-width:0.83663911;enable-background:new"
     height="12.567663"
     width="18.04541"
     y="7.0140176"
     x="228.03627" />
  <rect
     id="F9"
     style="fill:#e5d8b2;stroke:#000000;stroke-width:0.83973867;enable-background:new"
     height="12.564564"
     width="18.183851"
     y="7.0155673"
     x="189.99065" />
  <rect
     id="F6"
     style="fill:#e5d8b2;stroke:#000000;stroke-width:0.83922297;enable-background:new"
     height="12.56508"
     width="18.160778"
     y="7.0153089"
     x="132.9196" />
  <rect
     id="F7"
     style="fill:#e5d8b2;stroke:#000000;stroke-width:0.84025425;enable-background:new"
     height="12.564048"
     width="18.206934"
     y="7.0158248"
     x="151.92012" />
  <rect
     id="F1"
     style="fill:#e5d8b2;stroke:#000000;stroke-width:0.83604228;enable-background:new"
     height="12.467834"
     width="18.163958"
     y="7.1141443"
     x="18.91802" />
  <rect
     id="F4"
     style="fill:#e5d8b2;stroke:#000000;stroke-width:0.83356035;enable-background:new"
     height="12.470317"
     width="18.052675"
     y="7.1129031"
     x="76.03054" />
  <rect
     id="F8"
     style="fill:#e5d8b2;stroke:#000000;stroke-width:0.83973867;enable-background:new"
     height="12.564564"
     width="18.183849"
     y="7.0155668"
     x="170.96706" />
  <rect
     id="F5"
     style="fill:#e5d8b2;stroke:#000000;stroke-width:0.83604228;enable-background:new"
     height="12.467835"
     width="18.163958"
     y="7.1141443"
     x="94.918015" />
</svg>
