\relax 
\providecommand\hyper@newdestlabel[2]{}
\providecommand\babel@aux[2]{}
\@nameuse{bbl@beforestart}
\catcode `:\active 
\catcode `;\active 
\catcode `!\active 
\catcode `?\active 
\providecommand\HyperFirstAtBeginDocument{\AtBeginDocument}
\HyperFirstAtBeginDocument{\ifx\hyper@anchor\@undefined
\global\let\oldcontentsline\contentsline
\gdef\contentsline#1#2#3#4{\oldcontentsline{#1}{#2}{#3}}
\global\let\oldnewlabel\newlabel
\gdef\newlabel#1#2{\newlabelxx{#1}#2}
\gdef\newlabelxx#1#2#3#4#5#6{\oldnewlabel{#1}{{#2}{#3}}}
\AtEndDocument{\ifx\hyper@anchor\@undefined
\let\contentsline\oldcontentsline
\let\newlabel\oldnewlabel
\fi}
\fi}
\global\let\hyper@last\relax 
\gdef\HyperFirstAtBeginDocument#1{#1}
\providecommand\HyField@AuxAddToFields[1]{}
\providecommand\HyField@AuxAddToCoFields[2]{}
\babel@aux{french}{}
\@writefile{toc}{\contentsline {section}{\numberline {1}Installation, lancement et désinstallation}{5}{section.1}\protected@file@percent }
\@writefile{toc}{\contentsline {section}{\numberline {2}Compatibilité}{6}{section.2}\protected@file@percent }
\@writefile{toc}{\contentsline {section}{\numberline {3}Mise à jour}{6}{section.3}\protected@file@percent }
\@writefile{toc}{\contentsline {section}{\numberline {4}Principe d'utilisation}{7}{section.4}\protected@file@percent }
\@writefile{toc}{\contentsline {subsection}{\numberline {4.1}Idée principale}{7}{subsection.4.1}\protected@file@percent }
\@writefile{toc}{\contentsline {subsection}{\numberline {4.2}Mise en place}{7}{subsection.4.2}\protected@file@percent }
\@writefile{toc}{\contentsline {subsection}{\numberline {4.3}Restriction d'utilisation}{7}{subsection.4.3}\protected@file@percent }
\@writefile{toc}{\contentsline {section}{\numberline {5}Les cinq parties du logiciel}{8}{section.5}\protected@file@percent }
\@writefile{toc}{\contentsline {subsection}{\numberline {5.1}Recherche}{8}{subsection.5.1}\protected@file@percent }
\newlabel{subsection:recherche}{{5.1}{8}{Recherche}{subsection.5.1}{}}
\@writefile{toc}{\contentsline {subsubsection}{\numberline {5.1.1}Cliquer sur les résultats de la recherche}{8}{subsubsection.5.1.1}\protected@file@percent }
\@writefile{toc}{\contentsline {subsubsection}{\numberline {5.1.2}Utilisation du champ «~âge~» dans la recherche}{9}{subsubsection.5.1.2}\protected@file@percent }
\newlabel{age}{{5.1.2}{9}{Utilisation du champ «~âge~» dans la recherche}{subsubsection.5.1.2}{}}
\@writefile{toc}{\contentsline {subsection}{\numberline {5.2}Prêt}{10}{subsection.5.2}\protected@file@percent }
\newlabel{subsection:pret}{{5.2}{10}{Prêt}{subsection.5.2}{}}
\@writefile{toc}{\contentsline {subsection}{\numberline {5.3}Retour}{11}{subsection.5.3}\protected@file@percent }
\newlabel{subsection:retour}{{5.3}{11}{Retour}{subsection.5.3}{}}
\@writefile{toc}{\contentsline {subsection}{\numberline {5.4}Ajout de livre}{11}{subsection.5.4}\protected@file@percent }
\newlabel{subsection:ajout de livre}{{5.4}{11}{Ajout de livre}{subsection.5.4}{}}
\@writefile{toc}{\contentsline {subsubsection}{\numberline {5.4.1}Remplissage automatique}{11}{subsubsection.5.4.1}\protected@file@percent }
\@writefile{toc}{\contentsline {subsubsection}{\numberline {5.4.2}Le résumé}{12}{subsubsection.5.4.2}\protected@file@percent }
\@writefile{toc}{\contentsline {subsubsection}{\numberline {5.4.3}Les champs à entrer manuellement}{12}{subsubsection.5.4.3}\protected@file@percent }
\@writefile{toc}{\contentsline {subsection}{\numberline {5.5}Édition de codes-barres}{13}{subsection.5.5}\protected@file@percent }
\newlabel{subsection:gcb}{{5.5}{13}{Édition de codes-barres}{subsection.5.5}{}}
\@writefile{toc}{\contentsline {subsection}{\numberline {5.6}Le journal client}{13}{subsection.5.6}\protected@file@percent }
\newlabel{subsection:terminal}{{5.6}{13}{Le journal client}{subsection.5.6}{}}
\@writefile{toc}{\contentsline {section}{\numberline {6}Les menus}{15}{section.6}\protected@file@percent }
\newlabel{section:menus}{{6}{15}{Les menus}{section.6}{}}
\@writefile{toc}{\contentsline {subsection}{\numberline {6.1}Base de données}{15}{subsection.6.1}\protected@file@percent }
\newlabel{subsection:menu BDD}{{6.1}{15}{Base de données}{subsection.6.1}{}}
\@writefile{toc}{\contentsline {subsection}{\numberline {6.2}Élèves}{15}{subsection.6.2}\protected@file@percent }
\newlabel{subsection:eleves}{{6.2}{15}{Élèves}{subsection.6.2}{}}
\@writefile{toc}{\contentsline {subsection}{\numberline {6.3}Paramètres}{16}{subsection.6.3}\protected@file@percent }
\newlabel{subsection:paramètres}{{6.3}{16}{Paramètres}{subsection.6.3}{}}
\@writefile{toc}{\contentsline {subsection}{\numberline {6.4}Aide}{16}{subsection.6.4}\protected@file@percent }
\newlabel{subsubsection:aide}{{6.4}{16}{Aide}{subsection.6.4}{}}
\@writefile{toc}{\contentsline {section}{\numberline {7}La fenêtre de paramètres}{17}{section.7}\protected@file@percent }
\newlabel{section:paramètres}{{7}{17}{La fenêtre de paramètres}{section.7}{}}
\@writefile{toc}{\contentsline {subsection}{\numberline {7.1}Écoles}{17}{subsection.7.1}\protected@file@percent }
\newlabel{subsection:paramecoles}{{7.1}{17}{Écoles}{subsection.7.1}{}}
\@writefile{toc}{\contentsline {subsection}{\numberline {7.2}Recherche}{17}{subsection.7.2}\protected@file@percent }
\@writefile{toc}{\contentsline {subsection}{\numberline {7.3}Livres}{17}{subsection.7.3}\protected@file@percent }
\newlabel{subsection:paramlivres}{{7.3}{17}{Livres}{subsection.7.3}{}}
\@writefile{toc}{\contentsline {subsection}{\numberline {7.4}Élèves}{18}{subsection.7.4}\protected@file@percent }
\newlabel{subsection:parameleves}{{7.4}{18}{Élèves}{subsection.7.4}{}}
\@writefile{toc}{\contentsline {subsection}{\numberline {7.5}Impression}{18}{subsection.7.5}\protected@file@percent }
\newlabel{subsection:paramimpression}{{7.5}{18}{Impression}{subsection.7.5}{}}
\@writefile{toc}{\contentsline {subsection}{\numberline {7.6}Paramètres avancés}{19}{subsection.7.6}\protected@file@percent }
\newlabel{subsection:paramavancés}{{7.6}{19}{Paramètres avancés}{subsection.7.6}{}}
\@writefile{toc}{\contentsline {subsection}{\numberline {7.7}Mise à jour}{19}{subsection.7.7}\protected@file@percent }
\@writefile{toc}{\contentsline {section}{\numberline {8}Les fenêtres supplémentaires}{20}{section.8}\protected@file@percent }
\@writefile{toc}{\contentsline {subsection}{\numberline {8.1}Détails d'un livre}{20}{subsection.8.1}\protected@file@percent }
\newlabel{subsection:détails livre}{{8.1}{20}{Détails d'un livre}{subsection.8.1}{}}
\newlabel{dewey}{{8.1}{20}{Détails d'un livre}{subsection.8.1}{}}
\@writefile{toc}{\contentsline {subsection}{\numberline {8.2}Détails d'un élève}{20}{subsection.8.2}\protected@file@percent }
\newlabel{subsection:détails élève}{{8.2}{20}{Détails d'un élève}{subsection.8.2}{}}
\@writefile{toc}{\contentsline {section}{\numberline {9}Client sABCDI}{22}{section.9}\protected@file@percent }
\newlabel{sABCDIc}{{9}{22}{Client sABCDI}{section.9}{}}
\@writefile{toc}{\contentsline {subsection}{\numberline {9.1}Recherche}{22}{subsection.9.1}\protected@file@percent }
\@writefile{toc}{\contentsline {subsection}{\numberline {9.2}Scan}{22}{subsection.9.2}\protected@file@percent }
\@writefile{toc}{\contentsline {subsection}{\numberline {9.3}Paramètres réseaux}{23}{subsection.9.3}\protected@file@percent }
\@writefile{toc}{\contentsline {section}{\numberline {10}FAQ}{24}{section.10}\protected@file@percent }
\@writefile{toc}{\contentsline {section}{Index}{25}{section*.3}\protected@file@percent }
\gdef \@abspage@last{26}
