[gd_scene load_steps=7 format=3 uid="uid://dfedt1rjvc63i"]

[ext_resource type="Script" path="res://ball/ball.gd" id="1_1f6la"]
[ext_resource type="Texture2D" uid="uid://lg7ngm00kqw2" path="res://assets/ball_normal_map.png" id="2_ag18r"]

[sub_resource type="PhysicsMaterial" id="PhysicsMaterial_foaco"]
bounce = 0.25

[sub_resource type="StandardMaterial3D" id="StandardMaterial3D_b70ey"]
metallic = 0.6
roughness = 0.22
normal_enabled = true
normal_scale = -0.25
normal_texture = ExtResource("2_ag18r")
subsurf_scatter_enabled = true
subsurf_scatter_strength = 0.23

[sub_resource type="SphereMesh" id="SphereMesh_8ouyu"]
material = SubResource("StandardMaterial3D_b70ey")
radius = 0.05
height = 0.1

[sub_resource type="SphereShape3D" id="SphereShape3D_2j02j"]
radius = 0.05

[node name="Ball" type="RigidBody3D"]
physics_material_override = SubResource("PhysicsMaterial_foaco")
continuous_cd = true
linear_damp = 0.5
angular_damp = 1.0
script = ExtResource("1_1f6la")

[node name="MeshInstance3D" type="MeshInstance3D" parent="."]
mesh = SubResource("SphereMesh_8ouyu")

[node name="CollisionShape3D" type="CollisionShape3D" parent="."]
shape = SubResource("SphereShape3D_2j02j")
