{
    "output_widget": {
        "use_prefix": false,
        "use_suffix": true,
        "show_count": false,
        "keep_origin_folder": true,
        "vid_from_img": false,
        "overwrite": true,
        "enum_out_ext": ".mp3",
        "out_prefix": "",
        "out_suffix": "_converted",
        "dest": "",
        "still_vid_duration": "10",
        "frame_length": "3"
    },
    "video_widget": {
        "video_group": false,
        "use_og_video": false,
        "use_crf": false,
        "use_hwaccel": false,
        "use_preset": false,
        "use_tune": false,
        "use_profiles": false,
        "keep_fps": true,
        "compat_mode": false,
        "use_scaler": false,
        "hflip": false,
        "vflip": false,
        "reverse": false,
        "enum_video_codecs": "libx264",
        "enum_preset": "ultrafast",
        "enum_tunes": "film",
        "enum_profile": "baseline",
        "gop": "15",
        "crf": "15",
        "fps": "25",
        "scaler": "1920:1080"
    },
    "audio_widget": {
        "audio_group": true,
        "use_og_audio": false,
        "replace_audio": false,
        "reverse_audio": false,
        "enum_audio_codecs": "libmp3lame",
        "audio_file_substitute": "",
        "sample_rate": "48000",
        "a_mp3_bit_rate": "320"
    }
}