<svg width="12" height="13" viewBox="0 0 12 13" fill="none" xmlns="http://www.w3.org/2000/svg">
<path d="M7.01992 2.15148L7.01966 2.15168C6.85494 2.27916 6.54021 2.62215 6.14172 3.09092C5.7468 3.55549 5.27849 4.13278 4.80997 4.7188C4.46878 5.14556 4.12699 5.57758 3.81365 5.97365C3.26863 6.66255 2.80969 7.24266 2.58966 7.49705C2.50594 7.59383 2.44953 7.67015 2.41353 7.72941C2.38489 7.77657 2.37203 7.80833 2.36679 7.82764C2.36886 7.8279 2.37115 7.82815 2.37366 7.82836C2.42548 7.83276 2.50356 7.81893 2.57848 7.79909C2.61389 7.78971 2.64521 7.77993 2.66764 7.7725C2.67882 7.76879 2.68769 7.76571 2.69364 7.7636L2.70027 7.76121L2.70179 7.76065L2.70202 7.76057L2.70206 7.76055L2.70207 7.76055L2.70208 7.76054L2.70741 7.75855L2.74276 7.86924L2.7075 7.75867L2.70762 7.75863L2.70805 7.75849L2.70967 7.75798L2.71595 7.75598L2.74023 7.74834C2.76145 7.74169 2.79254 7.73202 2.83217 7.71987C2.91143 7.69557 3.02493 7.66136 3.16212 7.6216C3.43635 7.54213 3.80603 7.4403 4.18671 7.35125C4.56643 7.26243 4.9612 7.18534 5.28427 7.15675C5.44536 7.14249 5.59388 7.13977 5.71599 7.15564C5.83176 7.17068 5.95253 7.20578 6.02407 7.29362C6.09561 7.38144 6.10557 7.50622 6.09652 7.62271C6.087 7.74534 6.05358 7.89023 6.00578 8.04599C5.9099 8.35835 5.74958 8.73501 5.57604 9.10441C5.40206 9.4747 5.21292 9.84162 5.05781 10.1354C4.98826 10.2672 4.92621 10.383 4.87537 10.4779C4.81177 10.5966 4.76571 10.6826 4.7444 10.7261C4.7129 10.7917 4.70664 10.8447 4.71139 10.8769C4.71557 10.9053 4.72512 10.9083 4.72729 10.909C4.72739 10.909 4.72747 10.909 4.72754 10.9091C4.73626 10.9121 4.77355 10.9178 4.85109 10.8761C4.92642 10.8356 5.02571 10.7574 5.14616 10.6232L5.14621 10.6231C6.427 9.19858 9.24765 5.77978 9.58343 5.31492C9.64844 5.22476 9.68341 5.15999 9.69946 5.11572C9.70494 5.10061 9.70756 5.08978 9.70879 5.08243C9.68784 5.07833 9.65389 5.07797 9.60663 5.08434C9.51229 5.09704 9.3979 5.13167 9.30309 5.16525C9.25656 5.18173 9.21639 5.19737 9.18792 5.20886C9.1737 5.21459 9.16246 5.21927 9.15487 5.22247L9.14633 5.22611L9.14427 5.22699L9.14383 5.22719L9.14379 5.22721L7.01992 2.15148ZM7.01992 2.15148C7.10491 2.08532 7.17152 2.04106 7.22286 2.01304C7.25261 1.9968 7.27503 1.98725 7.29121 1.98176C7.28976 2.01716 7.27936 2.06571 7.26431 2.1155C7.25595 2.14313 7.24727 2.16763 7.24069 2.18519L7.23321 2.20449L7.23121 2.20779L7.21135 2.24061C7.19403 2.26931 7.16878 2.31132 7.13697 2.36474C7.07335 2.47158 6.98344 2.62409 6.87817 2.807C6.66775 3.17262 6.39546 3.66057 6.14897 4.14834C5.9034 4.63428 5.68001 5.12669 5.57091 5.4991C5.51729 5.68211 5.4861 5.85252 5.50435 5.98268C5.51373 6.04955 5.53788 6.11845 5.5916 6.17C5.6476 6.22373 5.72012 6.24383 5.79519 6.24154C6.01772 6.23476 6.33977 6.1653 6.6889 6.06984C7.04103 5.97355 7.43087 5.84789 7.79336 5.72349C8.15607 5.59902 8.49258 5.4754 8.73835 5.38292C8.86127 5.33667 8.96156 5.29818 9.03117 5.27124L9.11158 5.23995L9.13266 5.23168L9.13808 5.22954L9.13947 5.22899L9.13983 5.22885L9.13993 5.22881L9.09727 5.12087M7.01992 2.15148L9.09727 5.12087M9.09727 5.12087L9.13999 5.22886L9.14376 5.22722L9.09727 5.12087Z" fill="#444444" stroke="#555555" stroke-width="0.232123"/>
<path d="M6.19044 11.9566C3.2139 11.9566 0.791039 9.53268 0.791039 6.55388C0.791039 3.57509 3.2139 1.15115 6.19044 1.15115C9.16697 1.15115 11.5898 3.57509 11.5898 6.55388C11.5898 9.53268 9.16697 11.9566 6.19044 11.9566Z" stroke="#555555" stroke-width="0.766649"/>
</svg>
