{
    "name": "Checkout",
    "contentSlots": [
        {
            "slotId": "FooterSlot",
            "position": "Footer",
            "components": [
                {
                    "typeCode": "CMSFooterComponent",
                    "fullFooter": false
                }
            ]
        },
        {
            "slotId": "TopHeaderSlot",
            "position": "TopHeader",
            "components": []
        },
        {
            "slotId": "HeaderSlot",
            "position": "Header",
            "components": [
                {
                    "typeCode": "CMSHeaderComponent",
                    "fullHeader": false
                }
            ]
        },
        {
            "slotId": "NavigationSlot",
            "position": "Navigation",
            "components": []
        },
        {
            "slotId": "LeftContentSlot",
            "position": "LeftContent",
            "components": [
                {
                    "name": "Checkout Component",
                    "typeCode": "CMSCheckoutComponent"
                }
            ]
        },
        {
            "slotId": "BottomContentSlot",
            "position": "BottomContent",
            "components": []
        }
    ],
    "template": "CheckoutPageTemplate"
}
