{
    "test.front.page.button": "Zurück zur Startseite",
    "header.navigation.products": "Produkte",
    "header.navigation.sale": "Angebote",
    "header.search.placeholder": "Wonach suchst du?",
    "plp.headline": "Gesuchte Produkte",
    "plp.found.products": "Es wurden {0} Produkte gefunden.",
    "cart.popup.headline": "Warenkorb",
    "cart.popup.empty": "Noch befinden sich keine Produkte in Ihrem Warenkorb. Vielleicht ist hier etwas für Sie dabei",
    "cart.popup.recommendations": "Zu den Produkten",
    "cart.popup.total": "Zwischensumme",
    "cart.popup.gotocart": "Zum Warenkorb",
    "cart.summary.total": "Gesamtsumme",
    "cart.summary.continue": "Weiter zur Kasse",
    "cart.summary.giftwrap": "Geschenk",
    "cart.summary.coupon": "Gutschein",
    "cart.product.quantity": "Anzahl",
    "cart.entry.delete": "Löschen",
    "cart.empty": "Keine Produkte in Ihrem Warenkorb",
    "checkout.form.personaldata": "Persönliche Angaben",
    "checkout.form.firstname": "Vorname",
    "checkout.form.lastname": "Nachname",
    "checkout.form.email": "E-Mail",
    "checkout.form.deliveryandbillingaddress": "Liefer- und Rechnungsadresse",
    "checkout.form.deliveryaddress": "Lieferadresse",
    "checkout.form.billingaddress": "Rechnungsadresse",
    "checkout.form.street": "Straße, Hausnr./Stiege/Tür",
    "checkout.form.streetadditional": "Addresszusatz (optional)",
    "checkout.form.postalcode": "Postleitzahl",
    "checkout.form.city": "Ort",
    "checkout.form.country": "Land",
    "checkout.form.selectcountry": "Land wählen",
    "checkout.form.payment": "Zahlungsart",
    "checkout.form.selectpayment": "Zahlungsart wählen",
    "checkout.form.creditcard": "Kreditkarte",
    "checkout.form.paypal": "PayPal",
    "checkout.form.invoice": "Rechnung",
    "checkout.placeorder": "Jetzt kaufen",
    "checkout.form.firstname.error": "Bitte geben Sie einen Vornamen ein",
    "checkout.form.lastname.error": "Bitte geben Sie einen Nachnamen ein",
    "checkout.form.email.error": "Bitte geben Sie eine gültige E-Mail-Adresse ein",
    "checkout.form.street.error": "Bitte geben Sie eine Adresse ein",
    "checkout.form.postalcode.error": "Bitte geben Sie eine Postleitzahl ein",
    "checkout.form.city.error": "Bitte geben Sie eine Stadt ein",
    "checkout.form.country.error": "Bitte wählen Sie ein Land aus",
    "checkout.form.payment.error": "Bitte wählen Sie eine Zahlungsart aus",
    "checkout.terms": "Mit Klick stimme ich den AGB zu. Ich habe die Widerrufsbelehrung und die Datenschutzerklärung zur Kenntniss genommen.",
    "checkout.cartheader": "Ihre Bestellung",
    "checkout.thankyou": "Danke für Ihre Bestellung.",
    "product.availability.instock": "Auf Lager",
    "product.availability.notinstock": "Nicht Verfügbar",
    "product.button.addtocart": "In den Einkaufswagen",
    "product.detail.details": "Produkt Info",
    "product.detail.technicalfacts": "Technische Daten",
    "product.detail.usage": "Benutzung",
    "link.homepage": "Startseite",
    "category.empty": "Keine Produkte in der Kategorie \"{0}\"",
    "category.recommended": "Empfohlene Produkte",
    "category.sortby": "Sortieren nach",
    "category.sortby.relevance": "Bestes Ergebnis",
    "category.sortby.nameasc": "Name (aufsteigend)",
    "category.sortby.namedesc": "Name (absteigend)",
    "category.sortby.priceasc": "Preis (aufsteigend)",
    "category.sortby.pricedesc": "Preis (absteigend)",
    "search.result": "{0} Ergebnisse für \"{1}\"",
    "api.error.general": "Es ist ein unerwarteter Fehler aufgetreten!",
    "api.error.general.retry": "Nochmal versuchen",
    "error.404": "Die gesuchte Seite konnte nicht gefunden werden!"
}
