{
    "name": "Thankyou",
    "contentSlots": [
        {
            "slotId": "FooterSlot",
            "position": "Footer",
            "components": [
                {
                    "typeCode": "CMSFooterComponent"
                }
            ]
        },
        {
            "slotId": "TopHeaderSlot",
            "position": "TopHeader",
            "components": [
                {
                    "typeCode": "CMSPromoBarComponent",
                    "text": "SALE! SALE! SALE!",
                    "link": {
                        "typeCode": "CMSLinkComponent",
                        "url": "/c/3699718344",
                        "external": false,
                        "target": false,
                        "targetName": "sameWindow"
                    }
                }
            ]
        },
        {
            "slotId": "HeaderSlot",
            "position": "Header",
            "components": [
                {
                    "typeCode": "CMSHeaderComponent",
                    "fullHeader": true
                }
            ]
        },
        {
            "slotId": "NavigationSlot",
            "position": "Navigation",
            "components": [
                {
                    "typeCode": "CMSNavigationComponent"
                }
            ]
        },
        {
            "slotId": "LeftContentSlot",
            "position": "LeftContent",
            "components": []
        },
        {
            "slotId": "BottomContentSlot",
            "position": "BottomContent",
            "components": []
        }
    ],
    "template": "ThankYouPageTemplate"
}
