{
    "paymentModes": [
        {
            "code": "creditcard",
            "description": "Depending on your credit or debit card you may be asked by your bank for additional verification. Your order confirmation will appear after your successful payment.",
            "name": "Credit card",
            "pspLogoUrl": "/medias/creditcard.png"
        },
        {
            "code": "paypal",
            "description": "You will be redirected to PayPal to complete your payment. Your order confirmation will appear after your successful payment.",
            "name": "PayPal",
            "pspLogoUrl": "/medias/paypal.png"
        },
        {
            "code": "invoice",
            "description": "Your order confirmation will appear after you have placed your order. Please transfer the full amount according to the payment details provided to you via email.",
            "name": "Bank transfer",
            "pspLogoUrl": "/medias/invoice.png"
        }
    ]
}
