{
    "breadcrumbs": [],
    "categoryCode": "3699718344",
    "categoryName": "Actioncams",
    "currentQuery": {
        "url": "/en/c/actioncams/3699718344",
        "query": {
            "value": ":relevance"
        }
    },
    "freeTextSearch": "",
    "pagination": {
        "pageSize": 24,
        "currentPage": 0,
        "sort": "relevance",
        "totalPages": 1,
        "totalResults": 24
    },
    "products": [
        {
            "code": "785300148434",
            "name": "Osmo Pocket Charging Case Kit 4",
            "url": "/p/785300148434",
            "brand": {
                "name": "Dji"
            },
            "categories": [
                {
                    "code": "MEL_SHOP_CAT_Camorder_VideoActioncams_FotoVideo",
                    "name": "Camcorder",
                    "slug": "melectronics/foto-video/video-actioncams/camcorder",
                    "urlHash": 1169570400
                }
            ],
            "price": {
                "value": 269,
                "currencyIso": "EUR",
                "formattedValue": "EUR 269,00"
            },
            "images": [
                {
                    "url": "https://image.migros.ch/fm-xl/36bd0ea8a4b7163a8ad99bf94ecc14c82df36779/dji-osmo-pocket-charging-case-kit-actioncam-kit.jpg"
                }
            ]
        },
        {
            "code": "793447800000",
            "name": "Hero 9 black + 128GB microSD Card Bundle",
            "url": "/p/793447800000",
            "brand": {
                "name": "GoPro"
            },
            "categories": [
                {
                    "code": "MEL_SHOP_CAT_Camorder_VideoActioncams_FotoVideo",
                    "name": "Camcorder",
                    "slug": "melectronics/foto-video/video-actioncams/camcorder",
                    "urlHash": 1169570400
                }
            ],
            "price": {
                "value": 429,
                "currencyIso": "EUR",
                "formattedValue": "EUR 429,00"
            },
            "images": [
                {
                    "url": "https://image.migros.ch/fm-lg/e532620a94cca1d6bd8839a571863607db4f211a/gopro-hero-9-black-128gb-microsd-card-bundle-actioncam-kit.jpg"
                }
            ]
        },
        {
            "code": "785300158070",
            "name": "360° Pro II inkl. Farsight",
            "url": "/p/785300158070",
            "brand": {
                "name": "Insta360"
            },
            "price": {
                "value": 429,
                "currencyIso": "EUR",
                "formattedValue": "EUR 4.229,00"
            },
            "images": [
                {
                    "url": "https://image.migros.ch/fm-lg/1a9eac8090f6f29adf4c826733b4676e4007643d.jpg"
                }
            ]
        },
        {
            "code": "785300125390",
            "name": "Gear 360 (2017) weiss",
            "url": "/p/785300125390",
            "brand": {
                "name": "Samsung"
            },
            "categories": [
                {
                    "code": "MEL_SHOP_CAT_Camorder_VideoActioncams_FotoVideo",
                    "name": "Camcorder",
                    "slug": "melectronics/foto-video/video-actioncams/camcorder",
                    "urlHash": 1169570400
                }
            ],
            "price": {
                "value": 148,
                "currencyIso": "EUR",
                "formattedValue": "EUR 148,00"
            },
            "images": [
                {
                    "url": "https://image.migros.ch/fm-lg/927c77ab18653648e8d4c1d2001014f9526f463d.jpg"
                }
            ]
        },
        {
            "code": "785300145236",
            "name": "RX0 II",
            "url": "/p/785300145236",
            "brand": {
                "name": "Sony"
            },
            "categories": [
                {
                    "code": "MEL_SHOP_CAT_Camorder_VideoActioncams_FotoVideo",
                    "name": "Camcorder",
                    "slug": "melectronics/foto-video/video-actioncams/camcorder",
                    "urlHash": 1169570400
                }
            ],
            "price": {
                "value": 900,
                "currencyIso": "EUR",
                "formattedValue": "EUR 900,00"
            },
            "images": [
                {
                    "url": "https://image.migros.ch/fm-lg/33f8d6ce871550aa16b3cba49cb3a8a5ebb117b8.jpg"
                }
            ]
        },
        {
            "code": "785300148434",
            "name": "Osmo Pocket Charging Case Kit 4",
            "url": "/p/785300148434",
            "brand": {
                "name": "Dji"
            },
            "categories": [
                {
                    "code": "MEL_SHOP_CAT_Camorder_VideoActioncams_FotoVideo",
                    "name": "Camcorder",
                    "slug": "melectronics/foto-video/video-actioncams/camcorder",
                    "urlHash": 1169570400
                }
            ],
            "price": {
                "value": 269,
                "currencyIso": "EUR",
                "formattedValue": "EUR 269,00"
            },
            "images": [
                {
                    "url": "https://image.migros.ch/fm-xl/36bd0ea8a4b7163a8ad99bf94ecc14c82df36779/dji-osmo-pocket-charging-case-kit-actioncam-kit.jpg"
                }
            ]
        },
        {
            "code": "793447800000",
            "name": "Hero 9 black + 128GB microSD Card Bundle",
            "url": "/p/793447800000",
            "brand": {
                "name": "GoPro"
            },
            "categories": [
                {
                    "code": "MEL_SHOP_CAT_Camorder_VideoActioncams_FotoVideo",
                    "name": "Camcorder",
                    "slug": "melectronics/foto-video/video-actioncams/camcorder",
                    "urlHash": 1169570400
                }
            ],
            "price": {
                "value": 429,
                "currencyIso": "EUR",
                "formattedValue": "EUR 429,00"
            },
            "images": [
                {
                    "url": "https://image.migros.ch/fm-lg/e532620a94cca1d6bd8839a571863607db4f211a/gopro-hero-9-black-128gb-microsd-card-bundle-actioncam-kit.jpg"
                }
            ]
        },
        {
            "code": "785300158070",
            "name": "360° Pro II inkl. Farsight",
            "url": "/p/785300158070",
            "brand": {
                "name": "Insta360"
            },
            "price": {
                "value": 429,
                "currencyIso": "EUR",
                "formattedValue": "EUR 4.229,00"
            },
            "images": [
                {
                    "url": "https://image.migros.ch/fm-lg/1a9eac8090f6f29adf4c826733b4676e4007643d.jpg"
                }
            ]
        },
        {
            "code": "785300125390",
            "name": "Gear 360 (2017) weiss",
            "url": "/p/785300125390",
            "brand": {
                "name": "Samsung"
            },
            "categories": [
                {
                    "code": "MEL_SHOP_CAT_Camorder_VideoActioncams_FotoVideo",
                    "name": "Camcorder",
                    "slug": "melectronics/foto-video/video-actioncams/camcorder",
                    "urlHash": 1169570400
                }
            ],
            "price": {
                "value": 148,
                "currencyIso": "EUR",
                "formattedValue": "EUR 148,00"
            },
            "images": [
                {
                    "url": "https://image.migros.ch/fm-lg/927c77ab18653648e8d4c1d2001014f9526f463d.jpg"
                }
            ]
        },
        {
            "code": "785300148434",
            "name": "Osmo Pocket Charging Case Kit 4",
            "url": "/p/785300148434",
            "brand": {
                "name": "Dji"
            },
            "categories": [
                {
                    "code": "MEL_SHOP_CAT_Camorder_VideoActioncams_FotoVideo",
                    "name": "Camcorder",
                    "slug": "melectronics/foto-video/video-actioncams/camcorder",
                    "urlHash": 1169570400
                }
            ],
            "price": {
                "value": 269,
                "currencyIso": "EUR",
                "formattedValue": "EUR 269,00"
            },
            "images": [
                {
                    "url": "https://image.migros.ch/fm-xl/36bd0ea8a4b7163a8ad99bf94ecc14c82df36779/dji-osmo-pocket-charging-case-kit-actioncam-kit.jpg"
                }
            ]
        },
        {
            "code": "793447800000",
            "name": "Hero 9 black + 128GB microSD Card Bundle",
            "url": "/p/793447800000",
            "brand": {
                "name": "GoPro"
            },
            "categories": [
                {
                    "code": "MEL_SHOP_CAT_Camorder_VideoActioncams_FotoVideo",
                    "name": "Camcorder",
                    "slug": "melectronics/foto-video/video-actioncams/camcorder",
                    "urlHash": 1169570400
                }
            ],
            "price": {
                "value": 429,
                "currencyIso": "EUR",
                "formattedValue": "EUR 429,00"
            },
            "images": [
                {
                    "url": "https://image.migros.ch/fm-lg/e532620a94cca1d6bd8839a571863607db4f211a/gopro-hero-9-black-128gb-microsd-card-bundle-actioncam-kit.jpg"
                }
            ]
        },
        {
            "code": "785300145236",
            "name": "RX0 II",
            "url": "/p/785300145236",
            "brand": {
                "name": "Sony"
            },
            "categories": [
                {
                    "code": "MEL_SHOP_CAT_Camorder_VideoActioncams_FotoVideo",
                    "name": "Camcorder",
                    "slug": "melectronics/foto-video/video-actioncams/camcorder",
                    "urlHash": 1169570400
                }
            ],
            "price": {
                "value": 900,
                "currencyIso": "EUR",
                "formattedValue": "EUR 900,00"
            },
            "images": [
                {
                    "url": "https://image.migros.ch/fm-lg/33f8d6ce871550aa16b3cba49cb3a8a5ebb117b8.jpg"
                }
            ]
        },
        {
            "code": "785300148434",
            "name": "Osmo Pocket Charging Case Kit 4",
            "url": "/p/785300148434",
            "brand": {
                "name": "Dji"
            },
            "categories": [
                {
                    "code": "MEL_SHOP_CAT_Camorder_VideoActioncams_FotoVideo",
                    "name": "Camcorder",
                    "slug": "melectronics/foto-video/video-actioncams/camcorder",
                    "urlHash": 1169570400
                }
            ],
            "price": {
                "value": 269,
                "currencyIso": "EUR",
                "formattedValue": "EUR 269,00"
            },
            "images": [
                {
                    "url": "https://image.migros.ch/fm-xl/36bd0ea8a4b7163a8ad99bf94ecc14c82df36779/dji-osmo-pocket-charging-case-kit-actioncam-kit.jpg"
                }
            ]
        },
        {
            "code": "793447800000",
            "name": "Hero 9 black + 128GB microSD Card Bundle",
            "url": "/p/793447800000",
            "brand": {
                "name": "GoPro"
            },
            "categories": [
                {
                    "code": "MEL_SHOP_CAT_Camorder_VideoActioncams_FotoVideo",
                    "name": "Camcorder",
                    "slug": "melectronics/foto-video/video-actioncams/camcorder",
                    "urlHash": 1169570400
                }
            ],
            "price": {
                "value": 429,
                "currencyIso": "EUR",
                "formattedValue": "EUR 429,00"
            },
            "images": [
                {
                    "url": "https://image.migros.ch/fm-lg/e532620a94cca1d6bd8839a571863607db4f211a/gopro-hero-9-black-128gb-microsd-card-bundle-actioncam-kit.jpg"
                }
            ]
        },
        {
            "code": "785300158070",
            "name": "360° Pro II inkl. Farsight",
            "url": "/p/785300158070",
            "brand": {
                "name": "Insta360"
            },
            "price": {
                "value": 429,
                "currencyIso": "EUR",
                "formattedValue": "EUR 4.229,00"
            },
            "images": [
                {
                    "url": "https://image.migros.ch/fm-lg/1a9eac8090f6f29adf4c826733b4676e4007643d.jpg"
                }
            ]
        },
        {
            "code": "785300125390",
            "name": "Gear 360 (2017) weiss",
            "url": "/p/785300125390",
            "brand": {
                "name": "Samsung"
            },
            "categories": [
                {
                    "code": "MEL_SHOP_CAT_Camorder_VideoActioncams_FotoVideo",
                    "name": "Camcorder",
                    "slug": "melectronics/foto-video/video-actioncams/camcorder",
                    "urlHash": 1169570400
                }
            ],
            "price": {
                "value": 148,
                "currencyIso": "EUR",
                "formattedValue": "EUR 148,00"
            },
            "images": [
                {
                    "url": "https://image.migros.ch/fm-lg/927c77ab18653648e8d4c1d2001014f9526f463d.jpg"
                }
            ]
        },
        {
            "code": "785300145236",
            "name": "RX0 II",
            "url": "/p/785300145236",
            "brand": {
                "name": "Sony"
            },
            "categories": [
                {
                    "code": "MEL_SHOP_CAT_Camorder_VideoActioncams_FotoVideo",
                    "name": "Camcorder",
                    "slug": "melectronics/foto-video/video-actioncams/camcorder",
                    "urlHash": 1169570400
                }
            ],
            "price": {
                "value": 900,
                "currencyIso": "EUR",
                "formattedValue": "EUR 900,00"
            },
            "images": [
                {
                    "url": "https://image.migros.ch/fm-lg/33f8d6ce871550aa16b3cba49cb3a8a5ebb117b8.jpg"
                }
            ]
        },
        {
            "code": "785300148434",
            "name": "Osmo Pocket Charging Case Kit 4",
            "url": "/p/785300148434",
            "brand": {
                "name": "Dji"
            },
            "categories": [
                {
                    "code": "MEL_SHOP_CAT_Camorder_VideoActioncams_FotoVideo",
                    "name": "Camcorder",
                    "slug": "melectronics/foto-video/video-actioncams/camcorder",
                    "urlHash": 1169570400
                }
            ],
            "price": {
                "value": 269,
                "currencyIso": "EUR",
                "formattedValue": "EUR 269,00"
            },
            "images": [
                {
                    "url": "https://image.migros.ch/fm-xl/36bd0ea8a4b7163a8ad99bf94ecc14c82df36779/dji-osmo-pocket-charging-case-kit-actioncam-kit.jpg"
                }
            ]
        },
        {
            "code": "793447800000",
            "name": "Hero 9 black + 128GB microSD Card Bundle",
            "url": "/p/793447800000",
            "brand": {
                "name": "GoPro"
            },
            "categories": [
                {
                    "code": "MEL_SHOP_CAT_Camorder_VideoActioncams_FotoVideo",
                    "name": "Camcorder",
                    "slug": "melectronics/foto-video/video-actioncams/camcorder",
                    "urlHash": 1169570400
                }
            ],
            "price": {
                "value": 429,
                "currencyIso": "EUR",
                "formattedValue": "EUR 429,00"
            },
            "images": [
                {
                    "url": "https://image.migros.ch/fm-lg/e532620a94cca1d6bd8839a571863607db4f211a/gopro-hero-9-black-128gb-microsd-card-bundle-actioncam-kit.jpg"
                }
            ]
        },
        {
            "code": "785300158070",
            "name": "360° Pro II inkl. Farsight",
            "url": "/p/785300158070",
            "brand": {
                "name": "Insta360"
            },
            "price": {
                "value": 429,
                "currencyIso": "EUR",
                "formattedValue": "EUR 4.229,00"
            },
            "images": [
                {
                    "url": "https://image.migros.ch/fm-lg/1a9eac8090f6f29adf4c826733b4676e4007643d.jpg"
                }
            ]
        },
        {
            "code": "785300125390",
            "name": "Gear 360 (2017) weiss",
            "url": "/p/785300125390",
            "brand": {
                "name": "Samsung"
            },
            "categories": [
                {
                    "code": "MEL_SHOP_CAT_Camorder_VideoActioncams_FotoVideo",
                    "name": "Camcorder",
                    "slug": "melectronics/foto-video/video-actioncams/camcorder",
                    "urlHash": 1169570400
                }
            ],
            "price": {
                "value": 148,
                "currencyIso": "EUR",
                "formattedValue": "EUR 148,00"
            },
            "images": [
                {
                    "url": "https://image.migros.ch/fm-lg/927c77ab18653648e8d4c1d2001014f9526f463d.jpg"
                }
            ]
        },
        {
            "code": "785300148434",
            "name": "Osmo Pocket Charging Case Kit 4",
            "url": "/p/785300148434",
            "brand": {
                "name": "Dji"
            },
            "categories": [
                {
                    "code": "MEL_SHOP_CAT_Camorder_VideoActioncams_FotoVideo",
                    "name": "Camcorder",
                    "slug": "melectronics/foto-video/video-actioncams/camcorder",
                    "urlHash": 1169570400
                }
            ],
            "price": {
                "value": 269,
                "currencyIso": "EUR",
                "formattedValue": "EUR 269,00"
            },
            "images": [
                {
                    "url": "https://image.migros.ch/fm-xl/36bd0ea8a4b7163a8ad99bf94ecc14c82df36779/dji-osmo-pocket-charging-case-kit-actioncam-kit.jpg"
                }
            ]
        },
        {
            "code": "793447800000",
            "name": "Hero 9 black + 128GB microSD Card Bundle",
            "url": "/p/793447800000",
            "brand": {
                "name": "GoPro"
            },
            "categories": [
                {
                    "code": "MEL_SHOP_CAT_Camorder_VideoActioncams_FotoVideo",
                    "name": "Camcorder",
                    "slug": "melectronics/foto-video/video-actioncams/camcorder",
                    "urlHash": 1169570400
                }
            ],
            "price": {
                "value": 429,
                "currencyIso": "EUR",
                "formattedValue": "EUR 429,00"
            },
            "images": [
                {
                    "url": "https://image.migros.ch/fm-lg/e532620a94cca1d6bd8839a571863607db4f211a/gopro-hero-9-black-128gb-microsd-card-bundle-actioncam-kit.jpg"
                }
            ]
        },
        {
            "code": "785300145236",
            "name": "RX0 II",
            "url": "/p/785300145236",
            "brand": {
                "name": "Sony"
            },
            "categories": [
                {
                    "code": "MEL_SHOP_CAT_Camorder_VideoActioncams_FotoVideo",
                    "name": "Camcorder",
                    "slug": "melectronics/foto-video/video-actioncams/camcorder",
                    "urlHash": 1169570400
                }
            ],
            "price": {
                "value": 900,
                "currencyIso": "EUR",
                "formattedValue": "EUR 900,00"
            },
            "images": [
                {
                    "url": "https://image.migros.ch/fm-lg/33f8d6ce871550aa16b3cba49cb3a8a5ebb117b8.jpg"
                }
            ]
        }
    ],
    "spotlight": null,
    "subCategories": []
}
