{
  "name": "OrderLine",
  "fields": [
    {
      "fieldName": "quantity",
      "fieldType": "Integer",
      "fieldValidateRules": ["required"]
    },
    {
      "fieldName": "price",
      "fieldType": "Float",
      "fieldValidateRules": ["required"]
    }
  ],
  "relationships": [
    {
      "relationshipType": "many-to-one",
      "otherEntityName": "book",
      "otherEntityRelationshipName": "orderLine",
      "relationshipName": "book",
      "otherEntityField": "id"
    },
    {
      "relationshipType": "many-to-one",
      "otherEntityName": "order",
      "otherEntityRelationshipName": "orderLine",
      "relationshipName": "order",
      "otherEntityField": "id"
    }
  ],
  "changelogDate": "20201127104315",
  "entityTableName": "order_line",
  "dto": "mapstruct",
  "pagination": "no",
  "service": "serviceImpl",
  "jpaMetamodelFiltering": false,
  "fluentMethods": true,
  "readOnly": false,
  "embedded": false,
  "clientRootFolder": "",
  "applications": "*"
}
