{
  "name": "Address",
  "fields": [
    {
      "fieldName": "address",
      "fieldType": "String",
      "fieldValidateRules": ["required"]
    },
    {
      "fieldName": "city",
      "fieldType": "String",
      "fieldValidateRules": ["required"]
    },
    {
      "fieldName": "zipCode",
      "fieldType": "String",
      "fieldValidateRules": ["required"]
    },
    {
      "fieldName": "country",
      "fieldType": "Country",
      "fieldValues": "FRANCE,ENGLAND,CHINA,ITALY,SPAIN,CANADA,USA"
    }
  ],
  "relationships": [
    {
      "relationshipType": "many-to-one",
      "otherEntityName": "customUser",
      "otherEntityRelationshipName": "address",
      "relationshipName": "customer",
      "otherEntityField": "id"
    }
  ],
  "changelogDate": "20201127104515",
  "entityTableName": "address",
  "dto": "mapstruct",
  "pagination": "no",
  "service": "serviceImpl",
  "jpaMetamodelFiltering": false,
  "fluentMethods": true,
  "readOnly": false,
  "embedded": false,
  "clientRootFolder": "",
  "applications": "*"
}
