<?xml version="1.0" encoding="utf-8"?>
<!-- Generator: Adobe Illustrator 19.0.0, SVG Export Plug-In . SVG Version: 6.00 Build 0)  -->
<!DOCTYPE svg PUBLIC "-//W3C//DTD SVG 1.1//EN" "http://www.w3.org/Graphics/SVG/1.1/DTD/svg11.dtd">
<svg version="1.1" id="logo_1_" xmlns="http://www.w3.org/2000/svg" xmlns:xlink="http://www.w3.org/1999/xlink" x="0px" y="0px"
	 viewBox="150 44.6 455 70" style="enable-background:new 150 44.6 455 70;" xml:space="preserve">
<style type="text/css">
	.st0{fill:#CCE538;}
	.st1{display:none;opacity:0.4588;}
	.st2{display:inline;}
	.st3{fill:#9FD324;}
</style>
<g id="Color_Fill_2_copy_2Opacity_Mask_1_">
</g>
<g id="Vector_Smart_Object_xA0_Image_1_">
	<g>
		<g>
			<path class="st0" d="M221.9,90l14.2-16h-13.7v-6.6h24.5v5.7l-14.2,16h14.2v6.6h-25V90z"/>
			<path class="st0" d="M260.7,67.2h7.5l12,28.5h-8.4l-2.1-5.1h-10.9l-2,5.1h-8.3L260.7,67.2z M267.6,84.6l-3.1-8l-3.2,8H267.6z"/>
			<path class="st0" d="M292.9,67.2h7.5l12.1,28.5h-8.4l-2.1-5.1h-10.9l-2,5.1h-8.3L292.9,67.2z M299.7,84.6l-3.1-8l-3.2,8H299.7z"
				/>
			<path class="st0" d="M315.2,67.5h7.9V79l9.7-11.5h9.3l-10.7,12.2l11.1,16.1h-9.4L326,85.3l-2.9,3.2v7.3h-7.9V67.5z"/>
			<path class="st0" d="M355.8,96.2c-2.5,0-4.9-0.4-7.2-1.2c-2.3-0.8-4.3-2-6.1-3.5l4.4-5.2c2.8,2.2,5.9,3.4,9.2,3.4
				c1,0,1.8-0.2,2.4-0.5c0.5-0.3,0.8-0.8,0.8-1.4v-0.1c0-0.3,0-0.5-0.2-0.8c-0.1-0.2-0.4-0.4-0.8-0.7c-0.4-0.2-0.9-0.4-1.4-0.6
				c-0.6-0.2-1.4-0.4-2.4-0.6c-1.5-0.4-2.9-0.7-4.2-1.2c-1.3-0.4-2.4-0.9-3.4-1.6c-0.9-0.7-1.7-1.5-2.2-2.5s-0.8-2.2-0.8-3.6l0,0
				c0-1.3,0.3-2.5,0.8-3.6s1.2-2.1,2.2-2.9c0.9-0.8,2.1-1.4,3.5-1.9c1.3-0.4,2.9-0.7,4.6-0.7c2.4,0,4.6,0.3,6.5,0.9s3.6,1.6,5.2,2.8
				l-3.9,5.6c-1.3-0.9-2.6-1.6-4-2.1c-1.3-0.4-2.7-0.7-3.9-0.7c-0.9,0-1.7,0.2-2.1,0.5c-0.5,0.4-0.7,0.8-0.7,1.3v0.1
				c0,0.3,0.1,0.6,0.2,0.9c0.1,0.2,0.4,0.4,0.8,0.7c0.4,0.2,0.9,0.4,1.5,0.6s1.4,0.4,2.4,0.6c1.6,0.4,3.1,0.8,4.4,1.2
				c1.3,0.4,2.4,1,3.3,1.7s1.6,1.5,2.1,2.4s0.7,2.1,0.7,3.4V87c0,1.4-0.3,2.7-0.8,3.9c-0.5,1.1-1.3,2.1-2.3,2.9s-2.2,1.4-3.6,1.8
				C359.1,96,357.6,96.2,355.8,96.2z"/>
			<path class="st0" d="M379.2,85.1l-10.8-17.7h8.9l5.8,10.3l5.9-10.3h8.8L387.1,85v10.7h-7.9L379.2,85.1L379.2,85.1z"/>
			<path class="st0" d="M411.4,96.2c-2.5,0-4.9-0.4-7.2-1.2c-2.3-0.8-4.3-2-6.1-3.5l4.4-5.2c2.8,2.2,5.9,3.4,9.2,3.4
				c1,0,1.8-0.2,2.4-0.5c0.5-0.3,0.8-0.8,0.8-1.4v-0.1c0-0.3-0.1-0.5-0.2-0.8c-0.1-0.2-0.4-0.4-0.8-0.7c-0.4-0.2-0.9-0.4-1.4-0.6
				c-0.6-0.2-1.4-0.4-2.4-0.6c-1.5-0.4-2.9-0.7-4.2-1.2c-1.3-0.4-2.4-0.9-3.4-1.6c-0.9-0.7-1.7-1.5-2.2-2.5s-0.8-2.2-0.8-3.6l0,0
				c0-1.3,0.3-2.5,0.8-3.6s1.2-2.1,2.2-2.9c0.9-0.8,2.1-1.4,3.5-1.9s2.9-0.7,4.6-0.7c2.4,0,4.6,0.3,6.5,0.9s3.6,1.6,5.2,2.8
				l-3.9,5.6c-1.3-0.9-2.6-1.6-4-2.1c-1.3-0.4-2.7-0.7-3.9-0.7c-0.9,0-1.7,0.2-2.1,0.5c-0.5,0.4-0.7,0.8-0.7,1.3v0.1
				c0,0.3,0.1,0.6,0.2,0.9c0.1,0.2,0.4,0.4,0.8,0.7c0.4,0.2,0.9,0.4,1.5,0.6s1.4,0.4,2.4,0.6c1.6,0.4,3.1,0.8,4.4,1.2
				c1.3,0.4,2.4,1,3.3,1.7s1.6,1.5,2.1,2.4s0.7,2.1,0.7,3.4V87c0,1.4-0.3,2.7-0.8,3.9S421,93,420,93.8s-2.2,1.4-3.6,1.8
				C414.7,96,413.1,96.2,411.4,96.2z"/>
			<path class="st0" d="M433.5,74.3H425v-6.9h24.8v6.9h-8.5v21.4h-7.9L433.5,74.3L433.5,74.3z"/>
			<path class="st0" d="M453.3,67.5H476v6.7h-15v4.3h13.6v6.2H461v4.5h15.2v6.6h-22.9L453.3,67.5L453.3,67.5z"/>
			<path class="st0" d="M480.2,67.5h22.7v6.7h-15v4.3h13.6v6.2h-13.6v4.5h15.2v6.6h-22.9L480.2,67.5L480.2,67.5z"/>
			<path class="st0" d="M507.2,67.5h8.3l6.7,11l6.7-11h8.3v28.3h-7.8V79.5l-7.2,11.1h-0.1l-7.2-11v16.2h-7.7V67.5L507.2,67.5z"/>
		</g>
		<g>
			<path class="st0" d="M546.9,67.5h3l17.8,22.7V67.5h3.1v28.3h-2.6l-18.3-23.2v23.2h-3.1L546.9,67.5L546.9,67.5z"/>
			<path class="st0" d="M578.9,67.5h3.2v25.3H598v3h-19.1V67.5L578.9,67.5z"/>
		</g>
		<g>
			<path class="st0" d="M539.6,91.4h3.7v4.3h-3.7V91.4z"/>
		</g>
	</g>
</g>
<g id="Color_Fill_2">
	<g>
		<polygon class="st0" points="156.7,53.2 185.4,53.2 185.4,64.8 168.1,64.8 168.1,81.5 156.7,81.5 		"/>
	</g>
</g>
<g id="Color_Fill_2_copy">
	<g>
		<rect x="171.1" y="67.5" class="st0" width="28.7" height="28.3"/>
	</g>
</g>
<g id="Color_Fill_2_copy_2" class="st1">
	<g class="st2">
		<rect x="830.7" y="53.1" class="st3" width="28.7" height="28.3"/>
	</g>
</g>
</svg>
