<?xml version="1.0" encoding="UTF-8" standalone="no"?>
<svg
   version="1.1" id="Layer_1" xmlns="http://www.w3.org/2000/svg" xmlns:xlink="http://www.w3.org/1999/xlink" x="0px" y="0px"
     viewBox="-2 0 470 150.239" style="enable-background:new 0 0 495 155.239;" >

  <path
     id="path5"
     d="  M 65.439515,3.0399775   L 104.55923,25.67981   C 109.99919,28.799787 113.27916,34.559744 113.27916,40.879697   L 113.27916,86.159362   C 113.27916,92.399316 109.99919,98.159273 104.55923,101.27925   L 65.439515,123.91908   C 59.999556,127.03906 53.279605,127.03906 47.919645,123.91908   L 8.7199354,101.27925   C 3.3599751,98.159273 0,92.399316 0,86.159362   L 0,40.879697   C 0,34.559744 3.3599751,28.799787 8.7199354,25.67981   L 47.919645,3.0399775   C 53.279605,-0.079999407 59.999556,-0.079999407 65.439515,3.0399775   z "
     style="fill:#{{ site.color.secondary }};fill-rule:evenodd;fill-opacity:1;stroke:none;" />
  <path
     id="path7"
     d="  M 48.239643,68.479493   L 48.079644,86.479359   C 48.079644,87.439352 47.27965,88.239346 46.319657,88.239346   L 33.599751,88.239346   C 32.639758,88.239346 31.839764,87.439352 31.839764,86.479359   L 31.839764,40.399701   C 31.839764,39.439708 32.639758,38.639714 33.599751,38.639714   L 46.239657,38.639714   C 47.19965,38.639714 47.999644,39.439708 47.999644,40.399701   L 47.999644,56.879579   L 60.79955,39.359708   C 61.199547,38.879712 61.679543,38.639714 62.239539,38.639714   L 77.279428,38.639714   C 78.23942,38.639714 79.039415,39.439708 79.039415,40.399701   C 79.039415,40.799698 78.879416,41.199695 78.639417,41.519692   L 62.319538,61.359545   L 79.839409,85.439367   C 80.399404,86.239361 80.239406,87.359353 79.439412,87.919349   C 79.199413,88.079348 78.799416,88.239346 78.399419,88.239346   L 62.399538,88.239346   C 61.759543,88.239346 61.199547,87.919349 60.879549,87.439352   z "
     style="fill:#ffffff;fill-rule:evenodd;fill-opacity:1;stroke:none;" />
  <path
     id="path9"
     d="  M 163.67879,68.319494   L 163.51879,86.319361   C 163.51879,87.279353 162.71879,88.079348 161.7588,88.079348   L 149.0389,88.079348   C 148.0789,88.079348 147.27891,87.279353 147.27891,86.319361   L 147.27891,40.239702   C 147.27891,39.279709 148.0789,38.479715 149.0389,38.479715   L 161.6788,38.479715   C 162.6388,38.479715 163.43879,39.279709 163.43879,40.239702   L 163.43879,56.799579   L 176.31869,39.19971   C 176.63869,38.719713 177.11869,38.479715 177.67868,38.479715   L 192.71857,38.479715   C 193.67857,38.479715 194.47856,39.279709 194.47856,40.239702   C 194.47856,40.639699 194.31856,41.039696 194.07856,41.359694   L 177.75868,61.199547   L 195.27855,85.279368   C 195.83855,86.079362 195.67855,87.199354 194.87856,87.75935   C 194.63856,87.999348 194.23856,88.079348 193.91856,88.079348   L 177.83868,88.079348   C 177.19869,88.079348 176.71869,87.75935 176.39869,87.279353   z  M 236.79825,69.519485   C 236.79825,72.719461 236.23825,75.519441 235.03826,77.999422   C 233.91827,80.479404 232.39828,82.559388 230.47829,84.239376   C 228.47831,85.999363 226.23832,87.279353 223.75834,88.159347   C 221.19836,89.03934 218.47838,89.519337 215.6784,89.519337   C 212.95842,89.519337 210.31844,89.03934 207.75846,88.159347   C 205.19848,87.279353 203.0385,85.999363 201.11851,84.239376   C 199.19852,82.559388 197.67854,80.479404 196.47854,77.999422   C 195.35855,75.519441 194.79856,72.719461 194.79856,69.519485   C 194.79856,66.399508 195.35855,63.599529 196.47854,61.119547   C 197.67854,58.719565 199.19852,56.63958 201.11851,54.959593   C 203.0385,53.279605 205.19848,51.999615 207.75846,51.119621   C 210.31844,50.239628 212.95842,49.839631 215.6784,49.839631   C 218.47838,49.839631 221.19836,50.239628 223.75834,51.119621   C 226.23832,51.999615 228.47831,53.279605 230.47829,54.959593   C 232.39828,56.63958 233.91827,58.719565 235.03826,61.119547   C 236.23825,63.599529 236.79825,66.399508 236.79825,69.519485   z  M 215.6784,63.43953   C 213.91842,63.43953 212.47843,63.999526 211.43843,65.279516   C 210.31844,66.479508 209.75845,67.919497 209.75845,69.519485   C 209.75845,71.279472 210.31844,72.719461 211.43843,73.919452   C 212.55843,75.119444 213.99841,75.759439 215.7584,75.759439   C 217.59839,75.759439 219.03838,75.119444 220.15837,73.919452   C 221.27836,72.719461 221.83836,71.279472 221.83836,69.519485   C 221.83836,67.919497 221.19836,66.479508 220.07837,65.279516   C 218.95838,63.999526 217.51839,63.43953 215.6784,63.43953   z  M 243.0382,51.27962   L 255.27811,51.27962   C 256.3181,51.27962 257.0381,51.999615 257.0381,52.959608   L 257.0381,55.279591   L 257.19809,55.279591   C 258.15809,53.919601 259.51808,52.799609 261.35806,51.759617   C 263.19805,50.799624 265.35803,50.239628 267.67802,50.239628   C 270.238,50.239628 272.39798,50.719624 274.07797,51.679617   C 275.83796,52.559611 277.19795,53.759602 278.15794,55.279591   C 279.19793,56.71958 279.83793,58.399567 280.23792,60.239554   C 280.63792,61.999541 280.87792,63.839527 280.87792,65.679513   L 280.87792,86.319361   C 280.87792,87.279353 280.07793,88.079348 279.11793,88.079348   L 266.39803,88.079348   C 265.43803,88.079348 264.63804,87.279353 264.63804,86.319361   L 264.63804,68.479493   C 264.63804,66.639506 264.31804,65.279516 263.75805,64.559522   C 263.19805,63.839527 262.31806,63.43953 261.11807,63.43953   C 260.07807,63.43953 259.19808,63.839527 258.47809,64.719521   C 257.83809,65.599514 257.51809,66.799505 257.51809,68.479493   L 257.51809,86.319361   C 257.51809,87.279353 256.7181,88.079348 255.75811,88.079348   L 243.0382,88.079348   C 242.07821,88.079348 241.35821,87.279353 241.35821,86.319361   L 241.35821,52.959608   C 241.35821,51.999615 242.07821,51.27962 243.0382,51.27962   z  M 313.27768,45.759661   C 312.71768,45.599662 312.15769,45.599662 311.59769,45.599662   C 309.9977,45.599662 308.87771,46.079659 308.23772,47.039652   C 307.59772,47.999644 307.27772,49.279635 307.27772,50.719624   L 307.27772,51.27962   L 313.35768,51.27962   C 314.31767,51.27962 315.03767,51.999615 315.03767,52.959608   L 315.03767,61.039548   C 315.03767,61.999541 314.31767,62.799535 313.35768,62.799535   L 307.27772,62.799535   L 307.27772,86.319361   C 307.27772,87.279353 306.55773,88.079348 305.51774,88.079348   L 292.95783,88.079348   C 291.99784,88.079348 291.19784,87.279353 291.19784,86.319361   L 291.19784,62.799535   L 286.63788,62.799535   C 285.67788,62.799535 284.87789,61.999541 284.87789,61.039548   L 284.87789,52.959608   C 284.87789,51.999615 285.67788,51.27962 286.63788,51.27962   L 291.19784,51.27962   L 291.19784,50.399627   C 291.19784,48.079644 291.51784,45.91966 291.99784,43.839675   C 292.55783,41.679691 293.43783,39.839705 294.79782,38.239717   C 296.07781,36.639729 297.83779,35.359738 300.07778,34.399745   C 302.31776,33.519752 305.03774,33.039755 308.39772,33.039755   C 309.51771,33.039755 310.7177,33.119755 312.15769,33.279753   C 312.79768,33.359753 313.51768,33.439752 314.31767,33.679751   C 315.19767,33.919749 315.75766,34.639743 315.67766,35.519737   L 314.87767,44.55967   C 314.79767,45.279665 314.15767,45.83966 313.43768,45.759661   C 313.35768,45.759661 313.27768,45.759661 313.27768,45.759661   z  M 357.59735,88.079348   L 345.35744,88.079348   C 344.39745,88.079348 343.59745,87.279353 343.59745,86.319361   L 343.59745,83.999378   L 343.51746,83.999378   C 342.55746,85.359368 341.19747,86.559359 339.27749,87.599351   C 337.4375,88.559344 335.35752,89.03934 332.95753,89.03934   C 330.39755,89.03934 328.23757,88.639343 326.55758,87.679351   C 324.87759,86.799357 323.5176,85.599366 322.55761,84.159377   C 321.51762,82.639388 320.79762,81.0394 320.39763,79.119414   C 319.99763,77.279428 319.83763,75.439441 319.83763,73.679454   L 319.83763,52.959608   C 319.83763,51.999615 320.63762,51.27962 321.59762,51.27962   L 334.31752,51.27962   C 335.27752,51.27962 336.07751,51.999615 336.07751,52.959608   L 336.07751,70.719476   C 336.07751,72.559463 336.31751,73.919452 336.9575,74.639447   C 337.5175,75.359442 338.39749,75.759439 339.59748,75.759439   C 340.63748,75.759439 341.51747,75.359442 342.15747,74.479448   C 342.87746,73.599455 343.19746,72.319464 343.19746,70.719476   L 343.19746,52.959608   C 343.19746,51.999615 343.99745,51.27962 344.95744,51.27962   L 357.59735,51.27962   C 358.55734,51.27962 359.35734,51.999615 359.35734,52.959608   L 359.35734,86.319361   C 359.35734,87.279353 358.55734,88.079348 357.59735,88.079348   z  M 364.4773,76.319435   L 377.7572,63.199532   L 366.07729,63.199532   C 365.1173,63.199532 364.3173,62.399538 364.3173,61.439545   L 364.3173,52.959608   C 364.3173,51.999615 365.1173,51.27962 366.07729,51.27962   L 396.07707,51.27962   C 397.03706,51.27962 397.83705,51.999615 397.83705,52.959608   L 397.83705,61.039548   C 397.83705,61.439545 397.67705,61.919541 397.27706,62.239539   L 382.95716,76.079436   L 396.55706,76.079436   C 397.51706,76.079436 398.23705,76.879431 398.23705,77.839423   L 398.23705,86.319361   C 398.23705,87.279353 397.51706,88.079348 396.55706,88.079348   L 365.75729,88.079348   C 364.7973,88.079348 363.9973,87.279353 363.9973,86.319361   L 363.9973,77.519426   C 363.9973,77.039429 364.1573,76.639432 364.4773,76.319435   z  M 404.797,51.27962   L 417.43691,51.27962   C 418.3969,51.27962 419.19689,51.999615 419.19689,52.959608   L 419.19689,86.319361   C 419.19689,87.279353 418.3969,88.079348 417.43691,88.079348   L 404.797,88.079348   C 403.83701,88.079348 403.03701,87.279353 403.03701,86.319361   L 403.03701,52.959608   C 403.03701,51.999615 403.83701,51.27962 404.797,51.27962   z  M 402.71702,40.5597   C 402.71702,39.439708 402.95702,38.399716 403.43701,37.439723   C 403.83701,36.39973 404.477,35.519737 405.197,34.799742   C 405.99699,33.999748 406.87699,33.439752 407.91698,32.959756   C 408.95697,32.559759 410.07696,32.319761 411.19695,32.319761   C 412.31695,32.319761 413.35694,32.559759 414.39693,32.959756   C 415.35692,33.439752 416.23692,33.999748 416.95691,34.799742   C 417.75691,35.519737 418.3969,36.39973 418.7969,37.439723   C 419.27689,38.399716 419.43689,39.439708 419.43689,40.5597   C 419.43689,41.759691 419.27689,42.879682 418.7969,43.839675   C 418.3969,44.879668 417.75691,45.679662 416.95691,46.479656   C 416.23692,47.19965 415.35692,47.759646 414.39693,48.159643   C 413.35694,48.55964 412.31695,48.799639 411.19695,48.799639   C 410.07696,48.799639 408.95697,48.55964 407.91698,48.159643   C 406.87699,47.759646 405.99699,47.19965 405.197,46.479656   C 404.477,45.679662 403.83701,44.879668 403.43701,43.839675   C 402.95702,42.879682 402.71702,41.759691 402.71702,40.5597   z  M 465.75655,69.519485   C 465.75655,72.719461 465.19655,75.519441 464.07656,77.999422   C 462.95657,80.479404 461.35658,82.559388 459.4366,84.239376   C 457.51661,85.999363 455.27663,87.279353 452.71665,88.159347   C 450.15667,89.03934 447.51669,89.519337 444.71671,89.519337   C 441.99673,89.519337 439.35675,89.03934 436.79676,88.159347   C 434.23678,87.279353 431.9968,85.999363 430.07681,84.239376   C 428.15683,82.559388 426.63684,80.479404 425.51685,77.999422   C 424.39686,75.519441 423.83686,72.719461 423.83686,69.519485   C 423.83686,66.399508 424.39686,63.599529 425.51685,61.119547   C 426.63684,58.719565 428.15683,56.63958 430.07681,54.959593   C 431.9968,53.279605 434.23678,51.999615 436.79676,51.119621   C 439.35675,50.239628 441.99673,49.839631 444.71671,49.839631   C 447.51669,49.839631 450.15667,50.239628 452.71665,51.119621   C 455.27663,51.999615 457.51661,53.279605 459.4366,54.959593   C 461.35658,56.63958 462.95657,58.719565 464.07656,61.119547   C 465.19655,63.599529 465.75655,66.399508 465.75655,69.519485   z  M 444.71671,63.43953   C 442.95672,63.43953 441.51673,63.999526 440.39674,65.279516   C 439.35675,66.479508 438.79675,67.919497 438.79675,69.519485   C 438.79675,71.279472 439.35675,72.719461 440.47674,73.919452   C 441.59673,75.119444 443.03672,75.759439 444.79671,75.759439   C 446.55669,75.759439 447.99668,75.119444 449.11667,73.919452   C 450.23666,72.719461 450.79666,71.279472 450.79666,69.519485   C 450.79666,67.919497 450.23666,66.479508 449.11667,65.279516   C 447.91668,63.999526 446.47669,63.43953 444.71671,63.43953   z "
     style="fill:#{{ site.color.secondarydark }};fill-rule:evenodd;fill-opacity:1;stroke:none;" />
</svg>