<svg class="bob" font-family="arial" font-size="14"
     height="100%" width="100%"
     viewBox="0 0 464 720"
     xmlns="http://www.w3.org/2000/svg">
<defs>
<marker id="triangle" markerHeight="8" markerWidth="8" orient="auto" refX="4" refY="2" viewBox="0 0 8 4">
<polygon class="fg_fill" points="0,0 0,4 8,2 0,0"/>
</marker>
<marker id="clear_triangle" markerHeight="10" markerWidth="10" orient="auto" refX="1" refY="7" viewBox="0 0 20 14">
<polygon class="bg_fill fg_stroke" points="2,2 2,12 18,7 2,2"/>
</marker>
<marker id="circle" markerHeight="5" markerWidth="5" orient="auto" refX="10" refY="10" viewBox="0 0 20 20">
<circle class="fg_fill" cx="10" cy="10" r="8"/>
</marker>
<marker id="square" markerHeight="5" markerWidth="5" orient="auto" refX="10" refY="10" viewBox="0 0 20 20">
<rect class="fg_fill" height="20" width="20" x="0" y="0"/>
</marker>
<marker id="open_circle" markerHeight="10" markerWidth="10" orient="auto" refX="10" refY="10" viewBox="0 0 20 20">
<circle class="bg_fill fg_stroke" cx="10" cy="10" r="4"/>
</marker>
<marker id="big_open_circle" markerHeight="20" markerWidth="20" orient="auto" refX="20" refY="20" viewBox="0 0 40 40">
<circle class="bg_fill fg_stroke" cx="20" cy="20" r="6"/>
</marker>
</defs>
<style type="text/css">

rect.backdrop {
    fill: white;
}

.fg_fill {
    fill: black;
}



.bg_fill {
    fill: white;
}

.fg_stroke {
    stroke: black;
    stroke-width: 2;
}

.no_fill {
    fill: none;
}

.dashed {
    stroke-dasharray: 5;
}


text{
    fill: black;
}

line, path {
    stroke-linecap: round;
    stroke-linejoin: miter;
    stroke-opacity: 1;
    fill-opacity: 1;
}




tspan.head{
    fill: none;
    stroke: none;
}

</style>
<rect class="backdrop" width="460" x="0" y="8" height="703"></rect>
<g>
<line class="fg_stroke" x1="4" x2="4" y1="12" y2="708"/>
<path class="fg_stroke no_fill" d="M 4 708 A 4 4 0 0 0 8 712"/>
<path class="fg_stroke no_fill" d="M 8 8 A 4 4 0 0 0 4 12"/>
</g>
<g>
<line class="fg_stroke" x1="8" x2="456" y1="8" y2="8"/>
<path class="fg_stroke no_fill" d="M 460 12 A 4 4 0 0 0 456 8"/>
</g>
<g>
<line class="fg_stroke" x1="8" x2="456" y1="712" y2="712"/>
<path class="fg_stroke no_fill" d="M 456 712 A 4 4 0 0 0 460 708"/>
</g>
<g>
<line class="fg_stroke" x1="16" x2="448" y1="648" y2="648"/>
</g>
<g>
<line class="fg_stroke" x1="28" x2="28" y1="312" y2="344"/>
<line class="fg_stroke" x1="28" x2="132" y1="312" y2="312"/>
<line class="fg_stroke" x1="28" x2="28" y1="344" y2="456"/>
<line class="fg_stroke" x1="28" x2="132" y1="344" y2="344"/>
<line class="fg_stroke" x1="28" x2="132" y1="456" y2="456"/>
<line class="fg_stroke" x1="132" x2="132" y1="312" y2="344"/>
<line class="fg_stroke" x1="132" x2="260" y1="312" y2="312"/>
<line class="fg_stroke" x1="132" x2="132" y1="344" y2="456"/>
<line class="fg_stroke" x1="132" x2="260" y1="344" y2="344"/>
<line class="fg_stroke" x1="132" x2="260" y1="456" y2="456"/>
<line class="fg_stroke" x1="260" x2="260" y1="312" y2="344"/>
<line class="fg_stroke" x1="260" x2="332" y1="312" y2="312"/>
<line class="fg_stroke" x1="260" x2="260" y1="344" y2="456"/>
<line class="fg_stroke" x1="260" x2="332" y1="344" y2="344"/>
<line class="fg_stroke" x1="260" x2="332" y1="456" y2="456"/>
<line class="fg_stroke" x1="332" x2="332" y1="312" y2="344"/>
<line class="fg_stroke" x1="332" x2="428" y1="312" y2="312"/>
<line class="fg_stroke" x1="332" x2="332" y1="344" y2="456"/>
<line class="fg_stroke" x1="332" x2="428" y1="344" y2="344"/>
<line class="fg_stroke" x1="332" x2="428" y1="456" y2="456"/>
<line class="fg_stroke" x1="428" x2="428" y1="312" y2="344"/>
<line class="fg_stroke" x1="428" x2="428" y1="344" y2="456"/>
</g>
<g>
<line class="fg_stroke" x1="252" x2="252" y1="688" y2="704"/>
</g>
<g>
<line class="fg_stroke" x1="460" x2="460" y1="12" y2="708"/>
</g>
<g>
<line class="fg_stroke dashed" x1="328" x2="416" y1="488" y2="488"/>
</g>
<g>
<text class="fg_fill" x="17" y="668">
Kessler
</text>
</g>
<g>
<text class="fg_fill" x="17" y="684">
In
</text>
</g>
<g>
<text class="fg_fill" x="17" y="700">
IBAN:
</text>
</g>
<g>
<text class="fg_fill" x="25" y="60">
Fisch
</text>
</g>
<g>
<text class="fg_fill" x="25" y="76">
z.H.
</text>
</g>
<g>
<text class="fg_fill" x="25" y="92">
Schmalweg
</text>
</g>
<g>
<text class="fg_fill" x="25" y="108">
88709
</text>
</g>
<g>
<text class="fg_fill" x="25" y="172">
LIEFERSCHEIN
</text>
</g>
<g>
<text class="fg_fill" x="25" y="204">
Sehr
</text>
</g>
<g>
<text class="fg_fill" x="25" y="236">
vielen
</text>
</g>
<g>
<text class="fg_fill" x="25" y="252">
und
</text>
</g>
<g>
<text class="fg_fill" x="25" y="284">
Hiermit
</text>
</g>
<g >
<text class="highlight-red" x="25" y="524">
Leider
</text>
</g>
<g>
<text class="fg_fill  highlight-red" x="25" y="540">
3342345
</text>
</g>
<g>
<text class="fg_fill  highlight-red" x="25" y="556">
Wir
</text>
</g>
<g>
<text class="fg_fill" x="25" y="588">
Mit
</text>
</g>
<g>
<text class="fg_fill" x="25" y="620">
Ihr
</text>
</g>
<g>
<text class="fg_fill" x="41" y="332">
Datum
</text>
</g>
<g>
<text class="fg_fill" x="41" y="364">
22.01.2019
</text>
</g>
<g>
<text class="fg_fill" x="41" y="380">
22.01.2019
</text>
</g>
<g>
<text class="fg_fill" x="41" y="396">
22.01.2019
</text>
</g>
<g>
<text class="fg_fill" x="41" y="412">
22.01.2019
</text>
</g>
<g>
<text class="fg_fill" x="41" y="428">
13.02.2019
</text>
</g>
<g>
<text class="fg_fill" x="41" y="444">
13.02.2019
</text>
</g>
<g>
<text class="fg_fill" x="41" y="684">
der
</text>
</g>
<g>
<text class="fg_fill" x="57" y="252">
13.02.2019.
</text>
</g>
<g>
<text class="fg_fill  highlight-red" x="57" y="556">
senden
</text>
</g>
<g>
<text class="fg_fill" x="57" y="588">
freundlichen
</text>
</g>
<g>
<text class="fg_fill" x="57" y="620">
Kessler
</text>
</g>
<g>
<text class="fg_fill" x="65" y="76">
Joachim
</text>
</g>
<g>
<text class="fg_fill" x="65" y="204">
geehrter
</text>
</g>
<g>
<text class="fg_fill" x="65" y="700">
DE89370400440532013000
</text>
</g>
<g>
<text class="fg_fill" x="73" y="60">
Geiger
</text>
</g>
<g>
<text class="fg_fill" x="73" y="108">
Meersburg
</text>
</g>
<g>
<text class="fg_fill" x="73" y="684">
Kehl
</text>
</g>
<g>
<text class="fg_fill" x="81" y="236">
Dank
</text>
</g>
<g>
<text  class="fg_fill highlight-red" x="81" y="524">
konnten
</text>
</g>
<g>
<text class="fg_fill" x="81" y="668">
Zoologiegroßhandel
</text>
</g>
<g>
<text class="fg_fill" x="89" y="284">
übersenden
</text>
</g>
<g>
<text class="fg_fill  highlight-red" x="89" y="540">
und
</text>
</g>
<g>
<text class="fg_fill" x="105" y="92">
5
</text>
</g>
<g>
<text class="fg_fill  highlight-red" x="113" y="556">
Ihnen
</text>
</g>
<g>
<text class="fg_fill" x="113" y="684">
16,
</text>
</g>
<g>
<text class="fg_fill" x="121" y="236">
für
</text>
</g>
<g>
<text class="fg_fill  highlight-red" x="121" y="540">
4925903245
</text>
</g>
<g>
<text class="fg_fill" x="121" y="620">
Zoologiegroßhandel
</text>
</g>
<g>
<text class="fg_fill" x="129" y="60">
Fischfabriken
</text>
</g>
<g>
<text class="fg_fill" x="129" y="76">
Geiger
</text>
</g>
<g>
<text class="fg_fill" x="137" y="204">
Herr
</text>
</g>
<g>
<text class="fg_fill" x="145" y="332">
Artikelnummer
</text>
</g>
<g>
<text class="fg_fill" x="145" y="364">
35413131
</text>
</g>
<g>
<text class="fg_fill" x="145" y="380">
A001-323423
</text>
</g>
<g>
<text class="fg_fill" x="145" y="396">
HONDA-555-023
</text>
</g>
<g>
<text class="fg_fill" x="145" y="412">
Fischer-ABEW
</text>
</g>
<g>
<text class="fg_fill" x="145" y="428">
23409234
</text>
</g>
<g>
<text class="fg_fill" x="145" y="444">
A003-234234
</text>
</g>
<g>
<text class="fg_fill highlight-red" x="145" y="524">
wir
</text>
</g>
<g>
<text class="fg_fill" x="145" y="684">
67122
</text>
</g>
<g>
<text class="fg_fill" x="153" y="236">
Ihre
</text>
</g>
<g>
<text class="fg_fill  highlight-red" x="161" y="556">
diese
</text>
</g>
<g>
<text class="fg_fill" x="161" y="588">
Grüßen
</text>
</g>
<g>
<text class="fg_fill" x="177" y="204">
Geiger,
</text>
</g>
<g>
<text class="fg_fill" x="177" y="284">
wir
</text>
</g>
<g>
<text class="fg_fill  highlight-red" x="177" y="524">
die
</text>
</g>
<g>
<text class="fg_fill" x="193" y="236">
Bestellungen
</text>
</g>
<g>
<text class="fg_fill" x="193" y="684">
Altrip
</text>
</g>
<g>
<text class="fg_fill" x="209" y="284">
Ihnen
</text>
</g>
<g>
<text class="fg_fill  highlight-red" x="209" y="524">
von
</text>
</g>
<g>
<text class="fg_fill  highlight-red" x="209" y="540">
leider
</text>
</g>
<g>
<text class="fg_fill  highlight-red" x="209" y="556">
Artikel
</text>
</g>
<g>
<text class="fg_fill" x="233" y="476">
Gesamtbetrag
</text>
</g>
<g>
<text class="fg_fill" x="233" y="668">
GmbH
</text>
</g>
<g>
<text class="fg_fill  highlight-red" x="241" y="524">
Ihnen
</text>
</g>
<g>
<text class="fg_fill" x="257" y="284">
folgende
</text>
</g>
<g>
<text class="fg_fill  highlight-red" x="265" y="540">
nicht
</text>
</g>
<g>
<text class="fg_fill" x="265" y="700">
DE
</text>
</g>
<g>
<text class="fg_fill" x="273" y="332">
Menge
</text>
</g>
<g>
<text class="fg_fill  highlight-red" x="273" y="556">
gesondert
</text>
</g>
<g>
<text class="fg_fill" x="273" y="620">
GmbH
</text>
</g>
<g>
<text class="fg_fill" x="273" y="668">
&amp;
</text>
</g>
<g>
<text class="fg_fill" x="289" y="412">
500
</text>
</g>
<g>
<text class="fg_fill  highlight-red" x="289" y="524">
bestellten
</text>
</g>
<g>
<text class="fg_fill" x="289" y="668">
Co
</text>
</g>
<g>
<text class="fg_fill" x="289" y="700">
2582
</text>
</g>
<g>
<text class="fg_fill" x="297" y="236">
vom
</text>
</g>
<g>
<text class="fg_fill" x="297" y="364">
14
</text>
</g>
<g>
<text class="fg_fill" x="297" y="444">
50
</text>
</g>
<g>
<text class="fg_fill" x="305" y="380">
1
</text>
</g>
<g>
<text class="fg_fill" x="305" y="396">
8
</text>
</g>
<g>
<text class="fg_fill" x="305" y="428">
5
</text>
</g>
<g>
<text class="fg_fill  highlight-red" x="313" y="540">
sofort
</text>
</g>
<g>
<text class="fg_fill" x="313" y="620">
&amp;
</text>
</g>
<g>
<text class="fg_fill" x="321" y="668">
KG
</text>
</g>
<g>
<text class="fg_fill" x="329" y="236">
22.01.2019
</text>
</g>
<g>
<text class="fg_fill" x="329" y="284">
Artikel:
</text>
</g>
<g>
<text class="fg_fill" x="329" y="620">
Co
</text>
</g>
<g>
<text class="fg_fill" x="329" y="700">
67138
</text>
</g>
<g>
<text class="fg_fill" x="345" y="332">
Betrag
</text>
</g>
<g>
<text class="fg_fill" x="345" y="380">
5.268,85
</text>
</g>
<g>
<text class="fg_fill" x="345" y="428">
1.232,56
</text>
</g>
<g>
<text class="fg_fill" x="345" y="476">
9.164,83
</text>
</g>
<g>
<text class="fg_fill" x="345" y="668">
(HRB
</text>
</g>
<g>
<text class="fg_fill" x="353" y="140">
15.03.2019
</text>
</g>
<g>
<text class="fg_fill  highlight-red" x="353" y="556">
nach.
</text>
</g>
<g>
<text class="fg_fill" x="361" y="364">
359,20
</text>
</g>
<g>
<text class="fg_fill" x="361" y="396">
872,92
</text>
</g>
<g>
<text class="fg_fill" x="361" y="412">
500,00
</text>
</g>
<g>
<text class="fg_fill" x="361" y="444">
816,37
</text>
</g>
<g>
<text class="fg_fill  highlight-red" x="361" y="540">
liefern.
</text>
</g>
<g>
<text class="fg_fill" x="361" y="620">
KG
</text>
</g>
<g>
<text class="fg_fill  highlight-red" x="377" y="524">
Artikel
</text>
</g>
<g>
<text class="fg_fill" x="385" y="668">
60993)
</text>
</g>
</svg>