<?xml version="1.0" encoding="utf-8"?>
<!-- Generator: Adobe Illustrator 16.0.0, SVG Export Plug-In . SVG Version: 6.00 Build 0)  -->
<svg version="1.1" id="Layer_1" xmlns="http://www.w3.org/2000/svg" xmlns:xlink="http://www.w3.org/1999/xlink" x="0px" y="0px"
	 viewBox="0 0 377.841 107.315" enable-background="new 0 0 377.841 107.315"
	 xml:space="preserve">
<path fill="#0f2c41" d="M57.68,80.18c-2.076-0.019-4.151-0.019-6.227-0.013c-2.076,0.007-4.152,0.013-6.228,0.013v26.457h4.982
	v-7.774h7.473c1.44-0.007,2.717-0.221,3.837-0.643c1.113-0.415,2.076-0.987,2.868-1.717c0.799-0.724,1.441-1.554,1.919-2.484
	c0.478-0.932,0.792-1.912,0.95-2.95c0.164-1.031,0.157-2.063,0-3.102c-0.164-1.031-0.478-2.013-0.962-2.943
	c-0.478-0.931-1.113-1.761-1.912-2.485c-0.799-0.729-1.755-1.302-2.875-1.717C60.391,80.4,59.114,80.187,57.68,80.18 M50.207,84.936
	h7.473c0.906,0.006,1.686,0.183,2.333,0.516c0.648,0.34,1.164,0.786,1.554,1.34c0.39,0.554,0.654,1.164,0.78,1.83
	c0.132,0.661,0.132,1.327,0.006,1.988c-0.126,0.666-0.384,1.276-0.774,1.83s-0.912,1-1.56,1.34c-0.648,0.333-1.428,0.51-2.34,0.516
	h-7.473V84.936z"/>
<path fill="#0f2c41" d="M102.063,84.822c0.78,0.006,1.459,0.125,2.032,0.364c0.566,0.239,1.038,0.56,1.409,0.963
	c0.371,0.402,0.642,0.855,0.824,1.358c0.176,0.503,0.264,1.025,0.264,1.56c0,0.535-0.088,1.058-0.258,1.561
	c-0.176,0.503-0.453,0.956-0.818,1.358s-0.837,0.724-1.409,0.963s-1.251,0.358-2.044,0.364h-7.586v-8.491H102.063z M112.895,106.297
	l-8.001-9.021c1.252-0.264,2.302-0.667,3.164-1.22c0.856-0.548,1.541-1.201,2.057-1.956c0.516-0.762,0.893-1.573,1.119-2.453
	c0.233-0.881,0.346-1.774,0.34-2.693c0-1.156-0.201-2.258-0.61-3.302c-0.409-1.044-1.007-1.975-1.812-2.793
	c-0.799-0.817-1.793-1.459-2.976-1.938c-1.182-0.478-2.554-0.723-4.114-0.742c-2.094,0.02-4.189,0.02-6.284,0.013
	c-2.095-0.006-4.189-0.013-6.284-0.013v26.457h4.981v-8.832h4.793l7.699,8.832h5.925V106.297z"/>
<rect x="133.578" y="80.18" fill="#0f2c41" width="19.776" height="4.831"/>
<path fill="#0f2c41" d="M153.354,101.729h-14.833v-5.963h14.304v-4.642h-19.248c0,5.17,0,10.341,0,15.512h19.776V101.729z"/>
<polygon fill="#0f2c41" points="194.077,96.585 181.132,80.18 177.094,80.18 177.094,106.637 182.076,106.637 182.076,88.798 
	195.965,106.637 199.059,106.637 199.059,80.18 194.077,80.18 "/>
<rect x="222.271" y="80.18" fill="#0f2c41" width="19.776" height="4.831"/>
<path fill="#0f2c41" d="M242.047,101.729h-14.832v-5.963h14.304v-4.642h-19.248c0,5.17,0,10.341,0,15.512h19.776V101.729z"/>
<path fill="#0f2c41" d="M282.845,80.256V95.39c0,1.516-0.258,2.818-0.761,3.899c-0.497,1.089-1.232,1.919-2.188,2.504
	c-0.963,0.579-2.126,0.874-3.504,0.881c-1.377,0-2.579-0.277-3.598-0.83c-1.02-0.554-1.812-1.371-2.378-2.453
	c-0.56-1.082-0.85-2.416-0.855-4.001V80.256h-4.944V95.39c0.007,1.592,0.208,3.02,0.61,4.283c0.402,1.271,0.969,2.372,1.698,3.315
	c0.724,0.943,1.579,1.724,2.561,2.353c0.98,0.622,2.05,1.088,3.214,1.396c1.164,0.308,2.384,0.465,3.654,0.465
	c1.667,0,3.202-0.251,4.592-0.748c1.391-0.497,2.599-1.239,3.617-2.227c1.025-0.988,1.812-2.221,2.378-3.699
	c0.56-1.472,0.843-3.183,0.849-5.139V80.256H282.845z"/>
<path fill="#0f2c41" d="M323.983,84.822c0.78,0.006,1.46,0.125,2.032,0.364c0.565,0.239,1.037,0.56,1.409,0.963
	c0.37,0.402,0.641,0.855,0.823,1.358c0.177,0.503,0.265,1.025,0.265,1.56c0,0.535-0.088,1.058-0.258,1.561
	c-0.177,0.503-0.453,0.956-0.818,1.358c-0.364,0.402-0.836,0.724-1.409,0.963c-0.572,0.239-1.251,0.358-2.044,0.364h-7.586v-8.491
	H323.983z M334.815,106.297l-8.001-9.021c1.251-0.264,2.302-0.667,3.163-1.22c0.856-0.548,1.542-1.201,2.058-1.956
	c0.516-0.762,0.893-1.573,1.119-2.453c0.233-0.881,0.346-1.774,0.34-2.693c0-1.156-0.201-2.258-0.61-3.302
	c-0.408-1.044-1.006-1.975-1.812-2.793c-0.799-0.817-1.792-1.459-2.975-1.938c-1.183-0.478-2.554-0.723-4.114-0.742
	c-2.095,0.02-4.189,0.02-6.283,0.013c-2.096-0.006-4.189-0.013-6.284-0.013v26.457h4.981v-8.832h4.793l7.699,8.832h5.926V106.297z"
	/>
<path fill="#0f2c41" d="M377.01,84.558c-0.503-1.013-1.132-1.861-1.887-2.541c-0.749-0.679-1.585-1.214-2.51-1.61
	c-0.918-0.396-1.887-0.679-2.905-0.85c-1.014-0.169-2.039-0.251-3.076-0.245c-0.981,0.007-1.957,0.102-2.932,0.296
	c-0.975,0.188-1.899,0.478-2.773,0.868c-0.869,0.384-1.648,0.881-2.328,1.49c-0.673,0.604-1.208,1.321-1.598,2.158
	s-0.591,1.799-0.598,2.887c0.007,1.177,0.195,2.195,0.561,3.045c0.371,0.849,0.88,1.566,1.541,2.145
	c0.654,0.579,1.421,1.057,2.296,1.422c0.868,0.371,1.812,0.667,2.83,0.88c1.013,0.215,2.063,0.385,3.151,0.51
	c0.881,0.095,1.692,0.233,2.435,0.416c0.742,0.188,1.39,0.434,1.938,0.735c0.554,0.302,0.975,0.68,1.283,1.133
	c0.302,0.446,0.453,0.98,0.459,1.604c-0.006,0.717-0.177,1.327-0.51,1.83c-0.333,0.504-0.779,0.912-1.352,1.227
	c-0.573,0.314-1.221,0.548-1.944,0.692s-1.479,0.214-2.271,0.214c-0.806,0-1.592-0.082-2.353-0.245
	c-0.761-0.164-1.472-0.416-2.133-0.762c-0.654-0.339-1.239-0.773-1.748-1.302c-0.504-0.528-0.906-1.157-1.202-1.881l-4.151,2.151
	c0.661,1.604,1.548,2.875,2.654,3.83c1.113,0.95,2.416,1.637,3.913,2.052c1.491,0.415,3.139,0.616,4.943,0.609
	c1.183,0,2.321-0.101,3.416-0.308c1.095-0.208,2.107-0.528,3.032-0.956c0.931-0.435,1.742-0.981,2.44-1.648
	c0.691-0.66,1.232-1.453,1.616-2.365c0.391-0.918,0.585-1.963,0.592-3.139c-0.007-1.258-0.201-2.334-0.579-3.233
	c-0.377-0.893-0.905-1.647-1.579-2.258c-0.679-0.604-1.459-1.101-2.358-1.484c-0.894-0.384-1.862-0.686-2.906-0.912
	c-1.038-0.221-2.113-0.396-3.221-0.528c-0.799-0.095-1.554-0.208-2.258-0.353c-0.704-0.15-1.333-0.346-1.874-0.585
	c-0.541-0.245-0.969-0.56-1.283-0.949c-0.309-0.384-0.466-0.862-0.473-1.435c0-0.661,0.195-1.258,0.598-1.78
	c0.396-0.528,1-0.949,1.812-1.258s1.831-0.466,3.063-0.472c0.963,0.006,1.862,0.15,2.699,0.428c0.836,0.276,1.56,0.635,2.176,1.082
	c0.616,0.446,1.082,0.925,1.39,1.434L377.01,84.558z"/>
<polygon fill-rule="evenodd" clip-rule="evenodd" fill="#0f2c41" points="18.305,80.104 14.269,86.294 17.478,90.964 24.909,80.104 
	"/>
<polygon fill-rule="evenodd" clip-rule="evenodd" fill="#0f2c41" points="0.377,80.104 9.262,93.061 0,106.522 6.604,106.522 
	12.466,97.733 18.493,106.522 25.287,106.522 7.13,80.104 "/>
<path fill-rule="evenodd" clip-rule="evenodd" fill="#0f2c41" d="M158.931,0h59.978v59.979h-59.978V0z M206.563,8.766l-9.098,13.295
	l-3.104-4.516l5.726-8.779H206.563z M210.611,6.631L197.47,25.835l-5.676-8.259l7.137-10.945H210.611z M167.229,6.631l15.712,22.912
	l-16.379,23.806h11.68l10.366-15.543l10.657,15.543h12.015L179.169,6.631H167.229z"/>
</svg>
