<svg width="320" height="129" viewBox="0 0 320 129" fill="none" xmlns="http://www.w3.org/2000/svg">
<g filter="url(#filter0_d_116_2125)">
<rect x="0.5" y="0.5" width="315" height="124" stroke="#96FFA0" shape-rendering="crispEdges"/>
</g>
<path d="M23.8359 26H22.3047L16.0781 16.4062H16.0156C16.0312 16.6615 16.0495 16.9531 16.0703 17.2812C16.0911 17.6042 16.1068 17.9505 16.1172 18.3203C16.1328 18.6849 16.1406 19.0573 16.1406 19.4375V26H14.9062V14.5781H16.4297L22.6328 24.1406H22.6875C22.6771 23.9583 22.6641 23.7005 22.6484 23.3672C22.6328 23.0286 22.6172 22.6667 22.6016 22.2812C22.5911 21.8906 22.5859 21.5286 22.5859 21.1953V14.5781H23.8359V26ZM34.1406 21.7031C34.1406 22.4062 34.0495 23.0339 33.8672 23.5859C33.6849 24.138 33.4219 24.6042 33.0781 24.9844C32.7344 25.3646 32.3177 25.6562 31.8281 25.8594C31.3438 26.0573 30.7943 26.1562 30.1797 26.1562C29.6068 26.1562 29.0807 26.0573 28.6016 25.8594C28.1276 25.6562 27.7161 25.3646 27.3672 24.9844C27.0234 24.6042 26.7552 24.138 26.5625 23.5859C26.375 23.0339 26.2812 22.4062 26.2812 21.7031C26.2812 20.7656 26.4401 19.9688 26.7578 19.3125C27.0755 18.651 27.5286 18.1484 28.1172 17.8047C28.7109 17.4557 29.4167 17.2812 30.2344 17.2812C31.0156 17.2812 31.6979 17.4557 32.2812 17.8047C32.8698 18.1536 33.3255 18.6589 33.6484 19.3203C33.9766 19.9766 34.1406 20.7708 34.1406 21.7031ZM27.625 21.7031C27.625 22.3906 27.7161 22.987 27.8984 23.4922C28.0807 23.9974 28.362 24.388 28.7422 24.6641C29.1224 24.9401 29.612 25.0781 30.2109 25.0781C30.8047 25.0781 31.2917 24.9401 31.6719 24.6641C32.0573 24.388 32.3411 23.9974 32.5234 23.4922C32.7057 22.987 32.7969 22.3906 32.7969 21.7031C32.7969 21.0208 32.7057 20.4323 32.5234 19.9375C32.3411 19.4375 32.0599 19.0521 31.6797 18.7812C31.2995 18.5104 30.8073 18.375 30.2031 18.375C29.3125 18.375 28.6589 18.6693 28.2422 19.2578C27.8307 19.8464 27.625 20.6615 27.625 21.7031ZM38.2656 26L35.0156 17.4375H36.4062L38.2891 22.6172C38.4193 22.9714 38.5521 23.362 38.6875 23.7891C38.8229 24.2161 38.9167 24.5599 38.9688 24.8203H39.0234C39.0859 24.5599 39.1901 24.2161 39.3359 23.7891C39.4818 23.3568 39.6146 22.9661 39.7344 22.6172L41.6172 17.4375H43.0078L39.75 26H38.2656ZM47.5859 17.2969C48.6068 17.2969 49.3646 17.526 49.8594 17.9844C50.3542 18.4427 50.6016 19.1745 50.6016 20.1797V26H49.6562L49.4062 24.7344H49.3438C49.1042 25.0469 48.8542 25.3099 48.5938 25.5234C48.3333 25.7318 48.0312 25.8906 47.6875 26C47.349 26.1042 46.9323 26.1562 46.4375 26.1562C45.9167 26.1562 45.4531 26.0651 45.0469 25.8828C44.6458 25.7005 44.3281 25.4245 44.0938 25.0547C43.8646 24.6849 43.75 24.2161 43.75 23.6484C43.75 22.7943 44.0885 22.138 44.7656 21.6797C45.4427 21.2214 46.474 20.9714 47.8594 20.9297L49.3359 20.8672V20.3438C49.3359 19.6042 49.1771 19.0859 48.8594 18.7891C48.5417 18.4922 48.0938 18.3438 47.5156 18.3438C47.0677 18.3438 46.6406 18.4089 46.2344 18.5391C45.8281 18.6693 45.4427 18.8229 45.0781 19L44.6797 18.0156C45.0651 17.8177 45.5078 17.6484 46.0078 17.5078C46.5078 17.3672 47.0339 17.2969 47.5859 17.2969ZM49.3203 21.7812L48.0156 21.8359C46.9479 21.8776 46.1953 22.0521 45.7578 22.3594C45.3203 22.6667 45.1016 23.1016 45.1016 23.6641C45.1016 24.1536 45.25 24.5156 45.5469 24.75C45.8438 24.9844 46.237 25.1016 46.7266 25.1016C47.487 25.1016 48.1094 24.8906 48.5938 24.4688C49.0781 24.0469 49.3203 23.4141 49.3203 22.5703V21.7812ZM58.8125 23.6562C58.8125 24.2031 58.6745 24.6641 58.3984 25.0391C58.1276 25.4089 57.737 25.6875 57.2266 25.875C56.7214 26.0625 56.1172 26.1562 55.4141 26.1562C54.8151 26.1562 54.2969 26.1094 53.8594 26.0156C53.4219 25.9219 53.0391 25.7891 52.7109 25.6172V24.4219C53.0599 24.5938 53.4766 24.75 53.9609 24.8906C54.4453 25.0312 54.9401 25.1016 55.4453 25.1016C56.1849 25.1016 56.7214 24.9818 57.0547 24.7422C57.388 24.5026 57.5547 24.1771 57.5547 23.7656C57.5547 23.5312 57.487 23.3255 57.3516 23.1484C57.2214 22.9661 57 22.7917 56.6875 22.625C56.375 22.4531 55.9427 22.2656 55.3906 22.0625C54.8438 21.8542 54.3698 21.6484 53.9688 21.4453C53.5729 21.237 53.2656 20.9844 53.0469 20.6875C52.8333 20.3906 52.7266 20.0052 52.7266 19.5312C52.7266 18.8073 53.0182 18.2526 53.6016 17.8672C54.1901 17.4766 54.9609 17.2812 55.9141 17.2812C56.4297 17.2812 56.9115 17.3333 57.3594 17.4375C57.8125 17.5365 58.2344 17.6719 58.625 17.8438L58.1875 18.8828C57.8333 18.7318 57.4557 18.6042 57.0547 18.5C56.6536 18.3958 56.2448 18.3438 55.8281 18.3438C55.2292 18.3438 54.7682 18.4427 54.4453 18.6406C54.1276 18.8385 53.9688 19.1094 53.9688 19.4531C53.9688 19.7188 54.0417 19.9375 54.1875 20.1094C54.3385 20.2812 54.5781 20.4427 54.9062 20.5938C55.2344 20.7448 55.6667 20.9219 56.2031 21.125C56.7396 21.3229 57.2031 21.5286 57.5938 21.7422C57.9844 21.9505 58.2839 22.2057 58.4922 22.5078C58.7057 22.8047 58.8125 23.1875 58.8125 23.6562ZM69.0781 17.2812C70.1458 17.2812 70.9974 17.6484 71.6328 18.3828C72.2682 19.1172 72.5859 20.2214 72.5859 21.6953C72.5859 22.6693 72.4401 23.487 72.1484 24.1484C71.8568 24.8099 71.4453 25.3099 70.9141 25.6484C70.388 25.987 69.7656 26.1562 69.0469 26.1562C68.5938 26.1562 68.1953 26.0964 67.8516 25.9766C67.5078 25.8568 67.2135 25.6953 66.9688 25.4922C66.724 25.2891 66.5208 25.0677 66.3594 24.8281H66.2656C66.2812 25.0312 66.2995 25.276 66.3203 25.5625C66.3464 25.849 66.3594 26.099 66.3594 26.3125V29.8281H65.0547V17.4375H66.125L66.2969 18.7031H66.3594C66.526 18.4427 66.7292 18.2057 66.9688 17.9922C67.2083 17.7734 67.5 17.6016 67.8438 17.4766C68.1927 17.3464 68.6042 17.2812 69.0781 17.2812ZM68.8516 18.375C68.2578 18.375 67.7786 18.4896 67.4141 18.7188C67.0547 18.9479 66.7917 19.2917 66.625 19.75C66.4583 20.2031 66.3698 20.7734 66.3594 21.4609V21.7109C66.3594 22.4349 66.4375 23.0469 66.5938 23.5469C66.7552 24.0469 67.0182 24.4271 67.3828 24.6875C67.7526 24.9479 68.2474 25.0781 68.8672 25.0781C69.3984 25.0781 69.8411 24.9349 70.1953 24.6484C70.5495 24.362 70.8125 23.9635 70.9844 23.4531C71.1615 22.9375 71.25 22.3464 71.25 21.6797C71.25 20.6693 71.0521 19.8672 70.6562 19.2734C70.2656 18.6745 69.6641 18.375 68.8516 18.375ZM81.9219 17.4375V26H80.8594L80.6719 24.7969H80.6016C80.4245 25.0938 80.1953 25.3438 79.9141 25.5469C79.6328 25.75 79.3151 25.901 78.9609 26C78.612 26.1042 78.2396 26.1562 77.8438 26.1562C77.1667 26.1562 76.599 26.0469 76.1406 25.8281C75.6823 25.6094 75.3359 25.2708 75.1016 24.8125C74.8724 24.3542 74.7578 23.7656 74.7578 23.0469V17.4375H76.0703V22.9531C76.0703 23.6667 76.2318 24.2005 76.5547 24.5547C76.8776 24.9036 77.3698 25.0781 78.0312 25.0781C78.6667 25.0781 79.1719 24.9583 79.5469 24.7188C79.9271 24.4792 80.2005 24.1276 80.3672 23.6641C80.5339 23.1953 80.6172 22.6224 80.6172 21.9453V17.4375H81.9219ZM85.9609 13.8438V16.8828C85.9609 17.2318 85.9505 17.5703 85.9297 17.8984C85.9141 18.2266 85.901 18.4818 85.8906 18.6641H85.9609C86.1953 18.2786 86.5339 17.9531 86.9766 17.6875C87.4193 17.4219 87.9844 17.2891 88.6719 17.2891C89.7448 17.2891 90.599 17.6615 91.2344 18.4062C91.875 19.1458 92.1953 20.2474 92.1953 21.7109C92.1953 22.6745 92.0495 23.487 91.7578 24.1484C91.4661 24.8099 91.0547 25.3099 90.5234 25.6484C89.9922 25.987 89.3646 26.1562 88.6406 26.1562C87.9635 26.1562 87.4062 26.0312 86.9688 25.7812C86.5365 25.526 86.2031 25.2161 85.9688 24.8516H85.8672L85.6016 26H84.6641V13.8438H85.9609ZM88.4609 18.375C87.8411 18.375 87.349 18.4974 86.9844 18.7422C86.6198 18.9818 86.3568 19.3464 86.1953 19.8359C86.0391 20.3203 85.9609 20.9349 85.9609 21.6797V21.75C85.9609 22.8281 86.1406 23.6536 86.5 24.2266C86.8594 24.7943 87.513 25.0781 88.4609 25.0781C89.2578 25.0781 89.8542 24.7865 90.25 24.2031C90.651 23.6198 90.8516 22.7865 90.8516 21.7031C90.8516 20.599 90.6536 19.7682 90.2578 19.2109C89.8672 18.6536 89.2682 18.375 88.4609 18.375ZM95.7656 26H94.4609V13.8438H95.7656V26ZM99.8047 17.4375V26H98.5078V17.4375H99.8047ZM99.1719 14.2344C99.3854 14.2344 99.5677 14.3047 99.7188 14.4453C99.875 14.5807 99.9531 14.7943 99.9531 15.0859C99.9531 15.3724 99.875 15.5859 99.7188 15.7266C99.5677 15.8672 99.3854 15.9375 99.1719 15.9375C98.9479 15.9375 98.7604 15.8672 98.6094 15.7266C98.4635 15.5859 98.3906 15.3724 98.3906 15.0859C98.3906 14.7943 98.4635 14.5807 98.6094 14.4453C98.7604 14.3047 98.9479 14.2344 99.1719 14.2344ZM105.984 26.1562C105.214 26.1562 104.534 25.9974 103.945 25.6797C103.357 25.362 102.898 24.8776 102.57 24.2266C102.242 23.5755 102.078 22.7552 102.078 21.7656C102.078 20.7292 102.25 19.8828 102.594 19.2266C102.943 18.5651 103.422 18.0755 104.031 17.7578C104.641 17.4401 105.333 17.2812 106.109 17.2812C106.536 17.2812 106.948 17.3255 107.344 17.4141C107.745 17.4974 108.073 17.6042 108.328 17.7344L107.938 18.8203C107.677 18.7161 107.375 18.6224 107.031 18.5391C106.693 18.4557 106.375 18.4141 106.078 18.4141C105.484 18.4141 104.99 18.5417 104.594 18.7969C104.203 19.0521 103.909 19.4271 103.711 19.9219C103.518 20.4167 103.422 21.026 103.422 21.75C103.422 22.4427 103.516 23.0339 103.703 23.5234C103.896 24.013 104.18 24.388 104.555 24.6484C104.935 24.9036 105.409 25.0312 105.977 25.0312C106.43 25.0312 106.839 24.9844 107.203 24.8906C107.568 24.7917 107.898 24.6771 108.195 24.5469V25.7031C107.909 25.849 107.589 25.9609 107.234 26.0391C106.885 26.1172 106.469 26.1562 105.984 26.1562ZM113.43 17.2969C114.451 17.2969 115.208 17.526 115.703 17.9844C116.198 18.4427 116.445 19.1745 116.445 20.1797V26H115.5L115.25 24.7344H115.188C114.948 25.0469 114.698 25.3099 114.438 25.5234C114.177 25.7318 113.875 25.8906 113.531 26C113.193 26.1042 112.776 26.1562 112.281 26.1562C111.76 26.1562 111.297 26.0651 110.891 25.8828C110.49 25.7005 110.172 25.4245 109.938 25.0547C109.708 24.6849 109.594 24.2161 109.594 23.6484C109.594 22.7943 109.932 22.138 110.609 21.6797C111.286 21.2214 112.318 20.9714 113.703 20.9297L115.18 20.8672V20.3438C115.18 19.6042 115.021 19.0859 114.703 18.7891C114.385 18.4922 113.938 18.3438 113.359 18.3438C112.911 18.3438 112.484 18.4089 112.078 18.5391C111.672 18.6693 111.286 18.8229 110.922 19L110.523 18.0156C110.909 17.8177 111.352 17.6484 111.852 17.5078C112.352 17.3672 112.878 17.2969 113.43 17.2969ZM115.164 21.7812L113.859 21.8359C112.792 21.8776 112.039 22.0521 111.602 22.3594C111.164 22.6667 110.945 23.1016 110.945 23.6641C110.945 24.1536 111.094 24.5156 111.391 24.75C111.688 24.9844 112.081 25.1016 112.57 25.1016C113.331 25.1016 113.953 24.8906 114.438 24.4688C114.922 24.0469 115.164 23.4141 115.164 22.5703V21.7812ZM122.547 26.1562C121.776 26.1562 121.096 25.9974 120.508 25.6797C119.919 25.362 119.461 24.8776 119.133 24.2266C118.805 23.5755 118.641 22.7552 118.641 21.7656C118.641 20.7292 118.812 19.8828 119.156 19.2266C119.505 18.5651 119.984 18.0755 120.594 17.7578C121.203 17.4401 121.896 17.2812 122.672 17.2812C123.099 17.2812 123.51 17.3255 123.906 17.4141C124.307 17.4974 124.635 17.6042 124.891 17.7344L124.5 18.8203C124.24 18.7161 123.938 18.6224 123.594 18.5391C123.255 18.4557 122.938 18.4141 122.641 18.4141C122.047 18.4141 121.552 18.5417 121.156 18.7969C120.766 19.0521 120.471 19.4271 120.273 19.9219C120.081 20.4167 119.984 21.026 119.984 21.75C119.984 22.4427 120.078 23.0339 120.266 23.5234C120.458 24.013 120.742 24.388 121.117 24.6484C121.497 24.9036 121.971 25.0312 122.539 25.0312C122.992 25.0312 123.401 24.9844 123.766 24.8906C124.13 24.7917 124.461 24.6771 124.758 24.5469V25.7031C124.471 25.849 124.151 25.9609 123.797 26.0391C123.448 26.1172 123.031 26.1562 122.547 26.1562ZM123.82 28.2344C123.82 28.7396 123.625 29.1328 123.234 29.4141C122.844 29.7005 122.271 29.8438 121.516 29.8438C121.354 29.8438 121.201 29.8333 121.055 29.8125C120.909 29.7969 120.792 29.7786 120.703 29.7578V28.9375C120.802 28.9583 120.93 28.9766 121.086 28.9922C121.242 29.0078 121.398 29.0156 121.555 29.0156C121.945 29.0156 122.245 28.9583 122.453 28.8438C122.661 28.7292 122.766 28.5365 122.766 28.2656C122.766 27.9792 122.625 27.7708 122.344 27.6406C122.068 27.5104 121.714 27.4219 121.281 27.375L121.977 26H122.844L122.422 26.875C122.682 26.9271 122.917 27.0078 123.125 27.1172C123.339 27.2266 123.508 27.3724 123.633 27.5547C123.758 27.737 123.82 27.9635 123.82 28.2344ZM134.172 21.7031C134.172 22.4062 134.081 23.0339 133.898 23.5859C133.716 24.138 133.453 24.6042 133.109 24.9844C132.766 25.3646 132.349 25.6562 131.859 25.8594C131.375 26.0573 130.826 26.1562 130.211 26.1562C129.638 26.1562 129.112 26.0573 128.633 25.8594C128.159 25.6562 127.747 25.3646 127.398 24.9844C127.055 24.6042 126.786 24.138 126.594 23.5859C126.406 23.0339 126.312 22.4062 126.312 21.7031C126.312 20.7656 126.471 19.9688 126.789 19.3125C127.107 18.651 127.56 18.1484 128.148 17.8047C128.742 17.4557 129.448 17.2812 130.266 17.2812C131.047 17.2812 131.729 17.4557 132.312 17.8047C132.901 18.1536 133.357 18.6589 133.68 19.3203C134.008 19.9766 134.172 20.7708 134.172 21.7031ZM127.656 21.7031C127.656 22.3906 127.747 22.987 127.93 23.4922C128.112 23.9974 128.393 24.388 128.773 24.6641C129.154 24.9401 129.643 25.0781 130.242 25.0781C130.836 25.0781 131.323 24.9401 131.703 24.6641C132.089 24.388 132.372 23.9974 132.555 23.4922C132.737 22.987 132.828 22.3906 132.828 21.7031C132.828 21.0208 132.737 20.4323 132.555 19.9375C132.372 19.4375 132.091 19.0521 131.711 18.7812C131.331 18.5104 130.839 18.375 130.234 18.375C129.344 18.375 128.69 18.6693 128.273 19.2578C127.862 19.8464 127.656 20.6615 127.656 21.7031ZM127.297 16.2812C127.328 15.9688 127.388 15.6901 127.477 15.4453C127.565 15.2005 127.682 14.9922 127.828 14.8203C127.974 14.6484 128.146 14.5182 128.344 14.4297C128.547 14.3359 128.771 14.2891 129.016 14.2891C129.255 14.2891 129.484 14.3385 129.703 14.4375C129.922 14.5312 130.13 14.6406 130.328 14.7656C130.526 14.8854 130.716 14.9948 130.898 15.0938C131.086 15.1875 131.266 15.2344 131.438 15.2344C131.688 15.2344 131.88 15.1589 132.016 15.0078C132.156 14.8516 132.263 14.6068 132.336 14.2734H133.102C133.034 14.8828 132.854 15.3698 132.562 15.7344C132.271 16.0938 131.878 16.2734 131.383 16.2734C131.154 16.2734 130.932 16.2266 130.719 16.1328C130.505 16.0339 130.299 15.9245 130.102 15.8047C129.904 15.6797 129.708 15.5703 129.516 15.4766C129.328 15.3776 129.143 15.3281 128.961 15.3281C128.706 15.3281 128.51 15.4062 128.375 15.5625C128.24 15.7135 128.135 15.9531 128.062 16.2812H127.297ZM139.711 17.2812C140.44 17.2812 141.065 17.4427 141.586 17.7656C142.107 18.0885 142.505 18.5417 142.781 19.125C143.057 19.7031 143.195 20.3802 143.195 21.1562V21.9609H137.281C137.297 22.9661 137.547 23.7318 138.031 24.2578C138.516 24.7839 139.198 25.0469 140.078 25.0469C140.62 25.0469 141.099 24.9974 141.516 24.8984C141.932 24.7995 142.365 24.6536 142.812 24.4609V25.6016C142.38 25.7943 141.951 25.9349 141.523 26.0234C141.102 26.112 140.602 26.1562 140.023 26.1562C139.201 26.1562 138.482 25.9896 137.867 25.6562C137.258 25.3177 136.784 24.8229 136.445 24.1719C136.107 23.5208 135.938 22.724 135.938 21.7812C135.938 20.8594 136.091 20.0625 136.398 19.3906C136.711 18.7135 137.148 18.1927 137.711 17.8281C138.279 17.4635 138.945 17.2812 139.711 17.2812ZM139.695 18.3438C139.003 18.3438 138.451 18.5703 138.039 19.0234C137.628 19.4766 137.383 20.1094 137.305 20.9219H141.836C141.831 20.4115 141.75 19.9635 141.594 19.5781C141.443 19.1875 141.211 18.8854 140.898 18.6719C140.586 18.4531 140.185 18.3438 139.695 18.3438ZM150.938 23.6562C150.938 24.2031 150.799 24.6641 150.523 25.0391C150.253 25.4089 149.862 25.6875 149.352 25.875C148.846 26.0625 148.242 26.1562 147.539 26.1562C146.94 26.1562 146.422 26.1094 145.984 26.0156C145.547 25.9219 145.164 25.7891 144.836 25.6172V24.4219C145.185 24.5938 145.602 24.75 146.086 24.8906C146.57 25.0312 147.065 25.1016 147.57 25.1016C148.31 25.1016 148.846 24.9818 149.18 24.7422C149.513 24.5026 149.68 24.1771 149.68 23.7656C149.68 23.5312 149.612 23.3255 149.477 23.1484C149.346 22.9661 149.125 22.7917 148.812 22.625C148.5 22.4531 148.068 22.2656 147.516 22.0625C146.969 21.8542 146.495 21.6484 146.094 21.4453C145.698 21.237 145.391 20.9844 145.172 20.6875C144.958 20.3906 144.852 20.0052 144.852 19.5312C144.852 18.8073 145.143 18.2526 145.727 17.8672C146.315 17.4766 147.086 17.2812 148.039 17.2812C148.555 17.2812 149.036 17.3333 149.484 17.4375C149.938 17.5365 150.359 17.6719 150.75 17.8438L150.312 18.8828C149.958 18.7318 149.581 18.6042 149.18 18.5C148.779 18.3958 148.37 18.3438 147.953 18.3438C147.354 18.3438 146.893 18.4427 146.57 18.6406C146.253 18.8385 146.094 19.1094 146.094 19.4531C146.094 19.7188 146.167 19.9375 146.312 20.1094C146.464 20.2812 146.703 20.4427 147.031 20.5938C147.359 20.7448 147.792 20.9219 148.328 21.125C148.865 21.3229 149.328 21.5286 149.719 21.7422C150.109 21.9505 150.409 22.2057 150.617 22.5078C150.831 22.8047 150.938 23.1875 150.938 23.6562Z" fill="black"/>
<path d="M68.9795 81H66.29V63.8008C66.29 63.1478 66.29 62.5889 66.29 62.124C66.3011 61.6481 66.3122 61.2165 66.3232 60.8291C66.3454 60.4307 66.373 60.0267 66.4062 59.6172C66.0632 59.9714 65.7422 60.2757 65.4434 60.5303C65.1445 60.7738 64.7738 61.0781 64.3311 61.4434L61.5586 63.668L60.1143 61.792L66.6885 56.7285H68.9795V81ZM85.8467 66.1582C87.4958 66.1582 88.929 66.4404 90.1465 67.0049C91.3639 67.5583 92.3047 68.3662 92.9688 69.4287C93.6439 70.4912 93.9814 71.7806 93.9814 73.2969C93.9814 74.957 93.6217 76.3903 92.9023 77.5967C92.1829 78.792 91.1481 79.7161 89.7979 80.3691C88.4476 81.0111 86.8317 81.332 84.9502 81.332C83.6885 81.332 82.5153 81.2214 81.4307 81C80.346 80.7786 79.4329 80.4466 78.6914 80.0039V77.3809C79.4993 77.8678 80.4788 78.2552 81.6299 78.543C82.7809 78.8307 83.8988 78.9746 84.9834 78.9746C86.2119 78.9746 87.2855 78.7809 88.2041 78.3936C89.1338 77.9951 89.8532 77.3975 90.3623 76.6006C90.8825 75.7926 91.1426 74.7799 91.1426 73.5625C91.1426 71.9466 90.6445 70.7015 89.6484 69.8271C88.6634 68.9417 87.1029 68.499 84.9668 68.499C84.2806 68.499 83.528 68.5544 82.709 68.665C81.89 68.7757 81.2148 68.8975 80.6836 69.0303L79.2891 68.1172L80.2188 56.7285H92.2881V59.252H82.5762L81.9619 66.5732C82.3825 66.4847 82.9248 66.3962 83.5889 66.3076C84.2529 66.208 85.0055 66.1582 85.8467 66.1582Z" fill="black"/>
<g clip-path="url(#clip0_116_2125)">
<path d="M292 15L290.59 16.41L296.17 22H284V24H296.17L290.59 29.59L292 31L300 23L292 15Z" fill="black"/>
</g>
<defs>
<filter id="filter0_d_116_2125" x="0" y="0" width="320" height="129" filterUnits="userSpaceOnUse" color-interpolation-filters="sRGB">
<feFlood flood-opacity="0" result="BackgroundImageFix"/>
<feColorMatrix in="SourceAlpha" type="matrix" values="0 0 0 0 0 0 0 0 0 0 0 0 0 0 0 0 0 0 127 0" result="hardAlpha"/>
<feOffset dx="2" dy="2"/>
<feGaussianBlur stdDeviation="1"/>
<feComposite in2="hardAlpha" operator="out"/>
<feColorMatrix type="matrix" values="0 0 0 0 0 0 0 0 0 0 0 0 0 0 0 0 0 0 0.05 0"/>
<feBlend mode="normal" in2="BackgroundImageFix" result="effect1_dropShadow_116_2125"/>
<feBlend mode="normal" in="SourceGraphic" in2="effect1_dropShadow_116_2125" result="shape"/>
</filter>
<clipPath id="clip0_116_2125">
<rect width="24" height="24" fill="white" transform="translate(280 11)"/>
</clipPath>
</defs>
</svg>
