<svg width="527" height="32" viewBox="0 0 527 32" fill="none" xmlns="http://www.w3.org/2000/svg">
<line x1="0.346497" y1="19.1671" x2="192.1" y2="19.1671" stroke="black" stroke-opacity="0.5"/>
<line x1="334.263" y1="19.1671" x2="526.017" y2="19.1671" stroke="black" stroke-opacity="0.5"/>
<path d="M232.683 17.6782C231.783 17.6782 230.949 17.5222 230.181 17.2102C229.425 16.8862 228.759 16.4362 228.183 15.8602C227.607 15.2722 227.163 14.5762 226.851 13.7722C226.539 12.9562 226.383 12.0502 226.383 11.0542C226.383 10.0582 226.539 9.15821 226.851 8.35421C227.163 7.53821 227.607 6.84221 228.183 6.26621C228.759 5.67821 229.425 5.22821 230.181 4.91621C230.949 4.59221 231.783 4.43021 232.683 4.43021C233.583 4.43021 234.417 4.59221 235.185 4.91621C235.953 5.22821 236.619 5.67821 237.183 6.26621C237.759 6.84221 238.203 7.53821 238.515 8.35421C238.839 9.15821 239.001 10.0582 239.001 11.0542C239.001 12.0502 238.839 12.9562 238.515 13.7722C238.203 14.5762 237.759 15.2722 237.183 15.8602C236.619 16.4362 235.953 16.8862 235.185 17.2102C234.417 17.5222 233.583 17.6782 232.683 17.6782ZM232.683 16.5802C233.355 16.5802 233.967 16.4602 234.519 16.2202C235.071 15.9682 235.545 15.6022 235.941 15.1222C236.349 14.6422 236.661 14.0602 236.877 13.3762C237.093 12.6922 237.201 11.9182 237.201 11.0542C237.201 10.1902 237.093 9.41621 236.877 8.73221C236.661 8.04821 236.349 7.46621 235.941 6.98621C235.545 6.50621 235.071 6.14621 234.519 5.90621C233.967 5.65421 233.355 5.52821 232.683 5.52821C232.023 5.52821 231.411 5.65421 230.847 5.90621C230.295 6.14621 229.821 6.50621 229.425 6.98621C229.029 7.46621 228.723 8.04821 228.507 8.73221C228.291 9.41621 228.183 10.1902 228.183 11.0542C228.183 11.9182 228.291 12.6922 228.507 13.3762C228.723 14.0602 229.029 14.6422 229.425 15.1222C229.821 15.6022 230.295 15.9682 230.847 16.2202C231.411 16.4602 232.023 16.5802 232.683 16.5802ZM243.461 8.12021V14.5822C243.461 15.0142 243.509 15.3742 243.605 15.6622C243.701 15.9382 243.857 16.1422 244.073 16.2742C244.301 16.4062 244.607 16.4722 244.991 16.4722C245.387 16.4722 245.759 16.3942 246.107 16.2382C246.467 16.0822 246.809 15.8542 247.133 15.5542C247.457 15.2422 247.769 14.8582 248.069 14.4022V15.5542C247.757 16.0102 247.427 16.3942 247.079 16.7062C246.743 17.0062 246.377 17.2342 245.981 17.3902C245.585 17.5462 245.147 17.6242 244.667 17.6242C244.103 17.6242 243.605 17.5222 243.173 17.3182C242.753 17.1142 242.429 16.8022 242.201 16.3822C241.973 15.9622 241.859 15.4342 241.859 14.7982V9.83021C241.859 9.56621 241.745 9.38621 241.517 9.29021C241.301 9.18221 240.965 9.09221 240.509 9.02021L240.275 8.98421V8.12021H243.461ZM249.365 8.12021V15.9142C249.365 16.0822 249.425 16.2142 249.545 16.3102C249.677 16.4062 249.851 16.4782 250.067 16.5262C250.295 16.5622 250.559 16.5802 250.859 16.5802L250.931 16.5982V17.4442H247.961L247.889 15.5002L247.763 15.3022V9.83021C247.763 9.56621 247.649 9.38621 247.421 9.29021C247.193 9.18221 246.845 9.09821 246.377 9.03821L245.963 8.98421V8.12021H249.365ZM261.581 16.5802C262.121 16.5802 262.577 16.4842 262.949 16.2922C263.333 16.1002 263.657 15.8602 263.921 15.5722C264.197 15.2722 264.437 14.9782 264.641 14.6902L265.451 15.4282C265.187 15.8362 264.875 16.2082 264.515 16.5442C264.155 16.8802 263.729 17.1502 263.237 17.3542C262.745 17.5462 262.175 17.6422 261.527 17.6422C260.555 17.6422 259.709 17.4382 258.989 17.0302C258.269 16.6102 257.711 16.0402 257.315 15.3202C256.931 14.5882 256.739 13.7422 256.739 12.7822C256.739 11.8102 256.943 10.9642 257.351 10.2442C257.759 9.52421 258.335 8.96021 259.079 8.55221C259.823 8.14421 260.693 7.94021 261.689 7.94021C262.289 7.94021 262.829 8.00621 263.309 8.13821C263.789 8.27021 264.191 8.42021 264.515 8.58821C264.839 8.74421 265.079 8.89421 265.235 9.03821V11.4322H263.633V9.30821C263.765 9.33221 263.885 9.36821 263.993 9.41621C264.101 9.46421 264.191 9.53021 264.263 9.61421C264.347 9.69821 264.401 9.79421 264.425 9.90221C264.461 10.0102 264.473 10.1302 264.461 10.2622C264.221 9.90221 263.849 9.60221 263.345 9.36221C262.841 9.12221 262.289 9.00221 261.689 9.00221C260.957 9.00221 260.351 9.15821 259.871 9.47021C259.391 9.78221 259.031 10.2262 258.791 10.8022C258.551 11.3662 258.431 12.0262 258.431 12.7822C258.431 13.3702 258.497 13.8982 258.629 14.3662C258.761 14.8342 258.959 15.2362 259.223 15.5722C259.499 15.8962 259.829 16.1482 260.213 16.3282C260.609 16.4962 261.065 16.5802 261.581 16.5802ZM276.403 12.7822C276.403 13.7422 276.199 14.5882 275.791 15.3202C275.395 16.0522 274.837 16.6222 274.117 17.0302C273.409 17.4382 272.593 17.6422 271.669 17.6422C270.733 17.6422 269.905 17.4382 269.185 17.0302C268.477 16.6222 267.919 16.0522 267.511 15.3202C267.115 14.5882 266.917 13.7422 266.917 12.7822C266.917 12.0622 267.031 11.4082 267.259 10.8202C267.487 10.2202 267.811 9.71021 268.231 9.29021C268.663 8.85821 269.167 8.52821 269.743 8.30021C270.319 8.06021 270.961 7.94021 271.669 7.94021C272.365 7.94021 273.001 8.06021 273.577 8.30021C274.153 8.52821 274.651 8.85821 275.071 9.29021C275.503 9.71021 275.833 10.2202 276.061 10.8202C276.289 11.4082 276.403 12.0622 276.403 12.7822ZM268.609 12.7822C268.609 13.5742 268.729 14.2582 268.969 14.8342C269.209 15.3982 269.557 15.8302 270.013 16.1302C270.469 16.4302 271.021 16.5802 271.669 16.5802C272.317 16.5802 272.863 16.4302 273.307 16.1302C273.763 15.8302 274.111 15.3982 274.351 14.8342C274.591 14.2582 274.711 13.5742 274.711 12.7822C274.711 12.0022 274.591 11.3302 274.351 10.7662C274.111 10.2022 273.763 9.77021 273.307 9.47021C272.863 9.15821 272.317 9.00221 271.669 9.00221C271.021 9.00221 270.469 9.15821 270.013 9.47021C269.557 9.77021 269.209 10.2022 268.969 10.7662C268.729 11.3302 268.609 12.0022 268.609 12.7822ZM277.952 17.4442V16.6162H278.006C278.45 16.6162 278.804 16.5682 279.068 16.4722C279.344 16.3642 279.482 16.1542 279.482 15.8422V9.83021C279.482 9.65021 279.434 9.51821 279.338 9.43421C279.242 9.33821 279.092 9.26021 278.888 9.20021C278.696 9.14021 278.444 9.08021 278.132 9.02021L277.952 8.98421V8.12021H280.868L280.94 10.0462L281.084 10.2262V16.4362C281.084 16.4722 281.156 16.5082 281.3 16.5442C281.444 16.5682 281.612 16.5862 281.804 16.5982C281.996 16.6102 282.17 16.6162 282.326 16.6162H282.38V17.4442H277.952ZM287.852 17.4442H283.658V16.6162H283.694C283.862 16.6162 284.042 16.6102 284.234 16.5982C284.426 16.5862 284.594 16.5682 284.738 16.5442C284.882 16.5082 284.954 16.4722 284.954 16.4362V11.0002C284.954 10.5682 284.912 10.2142 284.828 9.93821C284.744 9.65021 284.612 9.44021 284.432 9.30821C284.252 9.16421 283.994 9.09221 283.658 9.09221C283.286 9.09221 282.938 9.17621 282.614 9.34421C282.29 9.50021 281.978 9.72821 281.678 10.0282C281.378 10.3282 281.078 10.7062 280.778 11.1622V9.97421C281.09 9.53021 281.402 9.15821 281.714 8.85821C282.038 8.55821 282.386 8.33021 282.758 8.17421C283.13 8.01821 283.538 7.94021 283.982 7.94021C284.498 7.94021 284.948 8.04221 285.332 8.24621C285.728 8.45021 286.028 8.76221 286.232 9.18221C286.448 9.60221 286.556 10.1362 286.556 10.7842V16.4362C286.556 16.4722 286.622 16.5082 286.754 16.5442C286.898 16.5682 287.066 16.5862 287.258 16.5982C287.462 16.6102 287.648 16.6162 287.816 16.6162H287.852V17.4442ZM293.576 17.4442H289.13V16.6162H289.184C289.352 16.6162 289.526 16.6102 289.706 16.5982C289.898 16.5742 290.06 16.5502 290.192 16.5262C290.336 16.5022 290.408 16.4722 290.408 16.4362V11.0002C290.408 10.5682 290.366 10.2142 290.282 9.93821C290.198 9.65021 290.066 9.44021 289.886 9.30821C289.706 9.16421 289.448 9.09221 289.112 9.09221C288.752 9.09221 288.404 9.17621 288.068 9.34421C287.744 9.50021 287.432 9.72821 287.132 10.0282C286.832 10.3282 286.532 10.7062 286.232 11.1622V9.97421C286.556 9.53021 286.874 9.15821 287.186 8.85821C287.51 8.55821 287.852 8.33021 288.212 8.17421C288.584 8.01821 288.992 7.94021 289.436 7.94021C289.964 7.94021 290.414 8.04221 290.786 8.24621C291.17 8.45021 291.47 8.76221 291.686 9.18221C291.902 9.60221 292.01 10.1362 292.01 10.7842V15.8422C292.01 16.1542 292.148 16.3642 292.424 16.4722C292.7 16.5682 293.06 16.6162 293.504 16.6162H293.576V17.4442Z" fill="black" fill-opacity="0.8"/>
</svg>
