<svg width="320" height="129" viewBox="0 0 320 129" fill="none" xmlns="http://www.w3.org/2000/svg">
<g filter="url(#filter0_d_116_2126)">
<rect x="0.5" y="0.5" width="315" height="124" stroke="#96FFA0" shape-rendering="crispEdges"/>
</g>
<path d="M31.1953 26H29.8594V15.75H26.2656V14.5781H34.7734V15.75H31.1953V26ZM43.375 17.4375V26H42.3125L42.125 24.7969H42.0547C41.8776 25.0938 41.6484 25.3438 41.3672 25.5469C41.0859 25.75 40.7682 25.901 40.4141 26C40.0651 26.1042 39.6927 26.1562 39.2969 26.1562C38.6198 26.1562 38.0521 26.0469 37.5938 25.8281C37.1354 25.6094 36.7891 25.2708 36.5547 24.8125C36.3255 24.3542 36.2109 23.7656 36.2109 23.0469V17.4375H37.5234V22.9531C37.5234 23.6667 37.6849 24.2005 38.0078 24.5547C38.3307 24.9036 38.8229 25.0781 39.4844 25.0781C40.1198 25.0781 40.625 24.9583 41 24.7188C41.3802 24.4792 41.6536 24.1276 41.8203 23.6641C41.987 23.1953 42.0703 22.6224 42.0703 21.9453V17.4375H43.375ZM48.8828 25.0938C49.0964 25.0938 49.3151 25.0755 49.5391 25.0391C49.763 25.0026 49.9453 24.9583 50.0859 24.9062V25.9141C49.9349 25.9818 49.724 26.0391 49.4531 26.0859C49.1875 26.1328 48.9271 26.1562 48.6719 26.1562C48.2188 26.1562 47.8073 26.0781 47.4375 25.9219C47.0677 25.7604 46.7708 25.4896 46.5469 25.1094C46.3281 24.7292 46.2188 24.2031 46.2188 23.5312V18.4531H45V17.8203L46.2266 17.3125L46.7422 15.4531H47.5234V17.4375H50.0312V18.4531H47.5234V23.4922C47.5234 24.0286 47.6458 24.4297 47.8906 24.6953C48.1406 24.9609 48.4714 25.0938 48.8828 25.0938ZM59.2031 21.7031C59.2031 22.4062 59.112 23.0339 58.9297 23.5859C58.7474 24.138 58.4844 24.6042 58.1406 24.9844C57.7969 25.3646 57.3802 25.6562 56.8906 25.8594C56.4062 26.0573 55.8568 26.1562 55.2422 26.1562C54.6693 26.1562 54.1432 26.0573 53.6641 25.8594C53.1901 25.6562 52.7786 25.3646 52.4297 24.9844C52.0859 24.6042 51.8177 24.138 51.625 23.5859C51.4375 23.0339 51.3438 22.4062 51.3438 21.7031C51.3438 20.7656 51.5026 19.9688 51.8203 19.3125C52.138 18.651 52.5911 18.1484 53.1797 17.8047C53.7734 17.4557 54.4792 17.2812 55.2969 17.2812C56.0781 17.2812 56.7604 17.4557 57.3438 17.8047C57.9323 18.1536 58.388 18.6589 58.7109 19.3203C59.0391 19.9766 59.2031 20.7708 59.2031 21.7031ZM52.6875 21.7031C52.6875 22.3906 52.7786 22.987 52.9609 23.4922C53.1432 23.9974 53.4245 24.388 53.8047 24.6641C54.1849 24.9401 54.6745 25.0781 55.2734 25.0781C55.8672 25.0781 56.3542 24.9401 56.7344 24.6641C57.1198 24.388 57.4036 23.9974 57.5859 23.4922C57.7682 22.987 57.8594 22.3906 57.8594 21.7031C57.8594 21.0208 57.7682 20.4323 57.5859 19.9375C57.4036 19.4375 57.1224 19.0521 56.7422 18.7812C56.362 18.5104 55.8698 18.375 55.2656 18.375C54.375 18.375 53.7214 18.6693 53.3047 19.2578C52.8932 19.8464 52.6875 20.6615 52.6875 21.7031ZM65.3359 17.2812C65.5078 17.2812 65.6875 17.2917 65.875 17.3125C66.0625 17.3281 66.2292 17.3516 66.375 17.3828L66.2109 18.5859C66.0703 18.5495 65.9141 18.5208 65.7422 18.5C65.5703 18.4792 65.4089 18.4688 65.2578 18.4688C64.9141 18.4688 64.5885 18.5391 64.2812 18.6797C63.9792 18.8151 63.7135 19.013 63.4844 19.2734C63.2552 19.5286 63.0755 19.8385 62.9453 20.2031C62.8151 20.5625 62.75 20.9635 62.75 21.4062V26H61.4453V17.4375H62.5234L62.6641 19.0156H62.7188C62.8958 18.6979 63.1094 18.4089 63.3594 18.1484C63.6094 17.8828 63.8984 17.6719 64.2266 17.5156C64.5599 17.3594 64.9297 17.2812 65.3359 17.2812ZM71.2891 17.2812C72.0182 17.2812 72.6432 17.4427 73.1641 17.7656C73.6849 18.0885 74.0833 18.5417 74.3594 19.125C74.6354 19.7031 74.7734 20.3802 74.7734 21.1562V21.9609H68.8594C68.875 22.9661 69.125 23.7318 69.6094 24.2578C70.0938 24.7839 70.776 25.0469 71.6562 25.0469C72.1979 25.0469 72.6771 24.9974 73.0938 24.8984C73.5104 24.7995 73.9427 24.6536 74.3906 24.4609V25.6016C73.9583 25.7943 73.5286 25.9349 73.1016 26.0234C72.6797 26.112 72.1797 26.1562 71.6016 26.1562C70.7786 26.1562 70.0599 25.9896 69.4453 25.6562C68.8359 25.3177 68.362 24.8229 68.0234 24.1719C67.6849 23.5208 67.5156 22.724 67.5156 21.7812C67.5156 20.8594 67.6693 20.0625 67.9766 19.3906C68.2891 18.7135 68.7266 18.1927 69.2891 17.8281C69.8568 17.4635 70.5234 17.2812 71.2891 17.2812ZM71.2734 18.3438C70.5807 18.3438 70.0286 18.5703 69.6172 19.0234C69.2057 19.4766 68.9609 20.1094 68.8828 20.9219H73.4141C73.4089 20.4115 73.3281 19.9635 73.1719 19.5781C73.0208 19.1875 72.7891 18.8854 72.4766 18.6719C72.1641 18.4531 71.763 18.3438 71.2734 18.3438ZM82.5156 23.6562C82.5156 24.2031 82.3776 24.6641 82.1016 25.0391C81.8307 25.4089 81.4401 25.6875 80.9297 25.875C80.4245 26.0625 79.8203 26.1562 79.1172 26.1562C78.5182 26.1562 78 26.1094 77.5625 26.0156C77.125 25.9219 76.7422 25.7891 76.4141 25.6172V24.4219C76.763 24.5938 77.1797 24.75 77.6641 24.8906C78.1484 25.0312 78.6432 25.1016 79.1484 25.1016C79.888 25.1016 80.4245 24.9818 80.7578 24.7422C81.0911 24.5026 81.2578 24.1771 81.2578 23.7656C81.2578 23.5312 81.1901 23.3255 81.0547 23.1484C80.9245 22.9661 80.7031 22.7917 80.3906 22.625C80.0781 22.4531 79.6458 22.2656 79.0938 22.0625C78.5469 21.8542 78.0729 21.6484 77.6719 21.4453C77.276 21.237 76.9688 20.9844 76.75 20.6875C76.5365 20.3906 76.4297 20.0052 76.4297 19.5312C76.4297 18.8073 76.7214 18.2526 77.3047 17.8672C77.8932 17.4766 78.6641 17.2812 79.6172 17.2812C80.1328 17.2812 80.6146 17.3333 81.0625 17.4375C81.5156 17.5365 81.9375 17.6719 82.3281 17.8438L81.8906 18.8828C81.5365 18.7318 81.1589 18.6042 80.7578 18.5C80.3568 18.3958 79.9479 18.3438 79.5312 18.3438C78.9323 18.3438 78.4714 18.4427 78.1484 18.6406C77.8307 18.8385 77.6719 19.1094 77.6719 19.4531C77.6719 19.7188 77.7448 19.9375 77.8906 20.1094C78.0417 20.2812 78.2812 20.4427 78.6094 20.5938C78.9375 20.7448 79.3698 20.9219 79.9062 21.125C80.4427 21.3229 80.9062 21.5286 81.2969 21.7422C81.6875 21.9505 81.987 22.2057 82.1953 22.5078C82.4089 22.8047 82.5156 23.1875 82.5156 23.6562ZM96.1406 21.7031C96.1406 22.4062 96.0495 23.0339 95.8672 23.5859C95.6849 24.138 95.4219 24.6042 95.0781 24.9844C94.7344 25.3646 94.3177 25.6562 93.8281 25.8594C93.3438 26.0573 92.7943 26.1562 92.1797 26.1562C91.6068 26.1562 91.0807 26.0573 90.6016 25.8594C90.1276 25.6562 89.7161 25.3646 89.3672 24.9844C89.0234 24.6042 88.7552 24.138 88.5625 23.5859C88.375 23.0339 88.2812 22.4062 88.2812 21.7031C88.2812 20.7656 88.4401 19.9688 88.7578 19.3125C89.0755 18.651 89.5286 18.1484 90.1172 17.8047C90.7109 17.4557 91.4167 17.2812 92.2344 17.2812C93.0156 17.2812 93.6979 17.4557 94.2812 17.8047C94.8698 18.1536 95.3255 18.6589 95.6484 19.3203C95.9766 19.9766 96.1406 20.7708 96.1406 21.7031ZM89.625 21.7031C89.625 22.3906 89.7161 22.987 89.8984 23.4922C90.0807 23.9974 90.362 24.388 90.7422 24.6641C91.1224 24.9401 91.612 25.0781 92.2109 25.0781C92.8047 25.0781 93.2917 24.9401 93.6719 24.6641C94.0573 24.388 94.3411 23.9974 94.5234 23.4922C94.7057 22.987 94.7969 22.3906 94.7969 21.7031C94.7969 21.0208 94.7057 20.4323 94.5234 19.9375C94.3411 19.4375 94.0599 19.0521 93.6797 18.7812C93.2995 18.5104 92.8073 18.375 92.2031 18.375C91.3125 18.375 90.6589 18.6693 90.2422 19.2578C89.8307 19.8464 89.625 20.6615 89.625 21.7031ZM102.438 17.2812C103.453 17.2812 104.221 17.5312 104.742 18.0312C105.263 18.526 105.523 19.3229 105.523 20.4219V26H104.242V20.5078C104.242 19.7943 104.078 19.2604 103.75 18.9062C103.427 18.5521 102.93 18.375 102.258 18.375C101.31 18.375 100.643 18.6432 100.258 19.1797C99.8724 19.7161 99.6797 20.4948 99.6797 21.5156V26H98.3828V17.4375H99.4297L99.625 18.6719H99.6953C99.8776 18.3698 100.109 18.1172 100.391 17.9141C100.672 17.7057 100.987 17.5495 101.336 17.4453C101.685 17.3359 102.052 17.2812 102.438 17.2812ZM107.469 22.2812V21.125H111.344V22.2812H107.469ZM114.656 26H113.352V13.8438H114.656V26ZM118.695 17.4375V26H117.398V17.4375H118.695ZM118.062 14.2344C118.276 14.2344 118.458 14.3047 118.609 14.4453C118.766 14.5807 118.844 14.7943 118.844 15.0859C118.844 15.3724 118.766 15.5859 118.609 15.7266C118.458 15.8672 118.276 15.9375 118.062 15.9375C117.839 15.9375 117.651 15.8672 117.5 15.7266C117.354 15.5859 117.281 15.3724 117.281 15.0859C117.281 14.7943 117.354 14.5807 117.5 14.4453C117.651 14.3047 117.839 14.2344 118.062 14.2344ZM125.5 17.2812C126.516 17.2812 127.284 17.5312 127.805 18.0312C128.326 18.526 128.586 19.3229 128.586 20.4219V26H127.305V20.5078C127.305 19.7943 127.141 19.2604 126.812 18.9062C126.49 18.5521 125.992 18.375 125.32 18.375C124.372 18.375 123.706 18.6432 123.32 19.1797C122.935 19.7161 122.742 20.4948 122.742 21.5156V26H121.445V17.4375H122.492L122.688 18.6719H122.758C122.94 18.3698 123.172 18.1172 123.453 17.9141C123.734 17.7057 124.049 17.5495 124.398 17.4453C124.747 17.3359 125.115 17.2812 125.5 17.2812ZM134.555 17.2812C135.284 17.2812 135.909 17.4427 136.43 17.7656C136.951 18.0885 137.349 18.5417 137.625 19.125C137.901 19.7031 138.039 20.3802 138.039 21.1562V21.9609H132.125C132.141 22.9661 132.391 23.7318 132.875 24.2578C133.359 24.7839 134.042 25.0469 134.922 25.0469C135.464 25.0469 135.943 24.9974 136.359 24.8984C136.776 24.7995 137.208 24.6536 137.656 24.4609V25.6016C137.224 25.7943 136.794 25.9349 136.367 26.0234C135.945 26.112 135.445 26.1562 134.867 26.1562C134.044 26.1562 133.326 25.9896 132.711 25.6562C132.102 25.3177 131.628 24.8229 131.289 24.1719C130.951 23.5208 130.781 22.724 130.781 21.7812C130.781 20.8594 130.935 20.0625 131.242 19.3906C131.555 18.7135 131.992 18.1927 132.555 17.8281C133.122 17.4635 133.789 17.2812 134.555 17.2812ZM134.539 18.3438C133.846 18.3438 133.294 18.5703 132.883 19.0234C132.471 19.4766 132.227 20.1094 132.148 20.9219H136.68C136.674 20.4115 136.594 19.9635 136.438 19.5781C136.286 19.1875 136.055 18.8854 135.742 18.6719C135.43 18.4531 135.029 18.3438 134.539 18.3438Z" fill="black"/>
<path d="M83.8525 81H67.9482V78.6924L74.4395 72.1016C75.6458 70.8841 76.6585 69.7995 77.4775 68.8477C78.3076 67.8958 78.9385 66.9606 79.3701 66.042C79.8018 65.1123 80.0176 64.0941 80.0176 62.9873C80.0176 61.6149 79.6081 60.569 78.7891 59.8496C77.9811 59.1191 76.9131 58.7539 75.585 58.7539C74.4229 58.7539 73.3936 58.9531 72.4971 59.3516C71.6006 59.75 70.682 60.3145 69.7412 61.0449L68.2637 59.1855C68.9056 58.6432 69.6029 58.1618 70.3555 57.7412C71.1191 57.3206 71.9326 56.9886 72.7959 56.7451C73.6702 56.5016 74.5999 56.3799 75.585 56.3799C77.0791 56.3799 78.3685 56.64 79.4531 57.1602C80.5378 57.6803 81.3734 58.4219 81.96 59.3848C82.5576 60.3477 82.8564 61.4932 82.8564 62.8213C82.8564 64.1051 82.6019 65.3005 82.0928 66.4072C81.5837 67.5029 80.8698 68.5931 79.9512 69.6777C79.0326 70.7513 77.959 71.8913 76.7305 73.0977L71.4512 78.3604V78.4766H83.8525V81Z" fill="black"/>
<g clip-path="url(#clip0_116_2126)">
<path d="M292 15L290.59 16.41L296.17 22H284V24H296.17L290.59 29.59L292 31L300 23L292 15Z" fill="black"/>
</g>
<rect x="34" y="62" width="12" height="13" rx="6" fill="#96FFA0"/>
<defs>
<filter id="filter0_d_116_2126" x="0" y="0" width="320" height="129" filterUnits="userSpaceOnUse" color-interpolation-filters="sRGB">
<feFlood flood-opacity="0" result="BackgroundImageFix"/>
<feColorMatrix in="SourceAlpha" type="matrix" values="0 0 0 0 0 0 0 0 0 0 0 0 0 0 0 0 0 0 127 0" result="hardAlpha"/>
<feOffset dx="2" dy="2"/>
<feGaussianBlur stdDeviation="1"/>
<feComposite in2="hardAlpha" operator="out"/>
<feColorMatrix type="matrix" values="0 0 0 0 0 0 0 0 0 0 0 0 0 0 0 0 0 0 0.05 0"/>
<feBlend mode="normal" in2="BackgroundImageFix" result="effect1_dropShadow_116_2126"/>
<feBlend mode="normal" in="SourceGraphic" in2="effect1_dropShadow_116_2126" result="shape"/>
</filter>
<clipPath id="clip0_116_2126">
<rect width="24" height="24" fill="white" transform="translate(280 11)"/>
</clipPath>
</defs>
</svg>
