<svg xmlns="http://www.w3.org/2000/svg" width="114.783" height="38.23" viewBox="0 0 114.783 38.23">
  <g id="Group_4" data-name="Group 4" transform="translate(-190.267 -138.29)">
    <g id="Group_1" data-name="Group 1" transform="translate(190.267 138.29)">
      <path id="Path_1" data-name="Path 1" d="M273.422,157.877l2.987-9.793,2.987-9.793-5.973,1.323-5.973-1.323,2.987,9.793Z" transform="translate(-254.715 -138.29)" fill="#4b70ff"/>
      <path id="Path_2" data-name="Path 2" d="M267.109,199.847l-.409-1.341a7.006,7.006,0,1,0,6.156,0l-.409,1.341a5.625,5.625,0,1,1-5.338,0Z" transform="translate(-251.071 -185.213)" fill="#4b70ff"/>
      <path id="Path_3" data-name="Path 3" d="M246.447,170.271h-.839a17.143,17.143,0,0,0-11.086-15.907l-.989,3.243a13.761,13.761,0,0,1,8.7,12.664h-2.15a11.612,11.612,0,0,0-7.176-10.6l-.286.94-.385,1.263a9.323,9.323,0,1,1-7.521,0l-.385-1.263-.287-.94a11.612,11.612,0,0,0-7.176,10.6h-2.15a13.761,13.761,0,0,1,8.7-12.664l-.989-3.243a17.143,17.143,0,0,0-11.086,15.907h-.89a.682.682,0,1,0,0,1.363h.932a17.138,17.138,0,0,0,16.366,15.89v.84a.682.682,0,1,0,1.364,0v-.836a17.138,17.138,0,0,0,16.458-15.894h.881a.682.682,0,1,0,0-1.363Zm-31.677,1.363h2.158a11.611,11.611,0,0,0,10.818,10.354v2.155A13.761,13.761,0,0,1,214.769,171.634Zm14.339,12.513v-2.152a11.612,11.612,0,0,0,10.909-10.361h2.158A13.759,13.759,0,0,1,229.108,184.147Z" transform="translate(-209.765 -150.816)" fill="#4b70ff"/>
    </g>
    <g id="Group_2" data-name="Group 2" transform="translate(228.553 141.839)">
      <path id="Path_4" data-name="Path 4" d="M383.2,187.47V154.364h6.929v15.1h.206l12.435-15.1h7.709l-12.251,14.683,13.1,18.423h-8.282l-9.82-13.834-3.1,3.717V187.47Z" transform="translate(-383.2 -154.364)" fill="#4b70ff"/>
      <path id="Path_5" data-name="Path 5" d="M520.1,187.47h-6.928V154.364h13.559c7.617,0,11.976,4.015,11.976,10.554a9.731,9.731,0,0,1-6.011,9.407l6.975,13.146h-7.847l-6.172-12.114H520.1Zm0-17.138h5.965c3.487,0,5.529-2,5.529-5.277,0-3.212-2.157-5.277-5.6-5.277h-5.9Z" transform="translate(-484.483 -154.364)" fill="#4b70ff"/>
      <path id="Path_6" data-name="Path 6" d="M641.462,190.532c6.172,0,10.187,3.12,10.278,7.892h-6.172c-.138-1.973-1.721-3.189-4.2-3.189-2.317,0-3.831,1.055-3.831,2.638,0,1.216,1.055,2.042,3.212,2.547l4.7,1.01c4.933,1.1,6.929,3.051,6.929,6.722,0,4.841-4.451,8.03-10.944,8.03-6.562,0-10.6-3.166-10.966-7.961h6.539c.321,2.065,1.95,3.258,4.612,3.258,2.547,0,4.084-1.009,4.084-2.615,0-1.239-.826-1.927-3.028-2.455l-4.543-1.01c-4.657-1.055-7.043-3.487-7.043-7.112C631.092,193.606,635.153,190.532,641.462,190.532Z" transform="translate(-575.887 -182.548)" fill="#4b70ff"/>
    </g>
  </g>
</svg>
