<svg xmlns="http://www.w3.org/2000/svg" width="16.516" height="15.75" viewBox="0 0 16.516 15.75">
  <path id="Path_453" data-name="Path 453" d="M65.674,21.381l-5.35-.5L58.2,15.951a.429.429,0,0,0-.787,0l-2.125,4.934-5.35.5a.429.429,0,0,0-.243.749l4.036,3.546-1.181,5.241a.429.429,0,0,0,.637.463l4.62-2.743,4.62,2.743a.429.429,0,0,0,.637-.463l-1.181-5.241,4.036-3.546A.429.429,0,0,0,65.674,21.381Z" transform="translate(-49.548 -15.691)" fill="#ff8d1a"/>
</svg>
