<svg xmlns="http://www.w3.org/2000/svg" width="24" height="24" viewBox="0 0 24 24">
  <g id="Group_408" data-name="Group 408" transform="translate(-1656.5 -187)">
    <circle id="Эллипс_1" data-name="Эллипс 1" cx="12" cy="12" r="12" transform="translate(1656.5 187)" fill="red"/>
    <g id="delete" transform="translate(1645.565 193)">
      <g id="Group_139" data-name="Group 139" transform="translate(17.379 1.969)">
        <g id="Group_138" data-name="Group 138">
          <g id="Group_137" data-name="Group 137">
            <path id="Path_309" data-name="Path 309" d="M305.628,175.094l-.675-.038-.146,6.079.675.038Z" transform="translate(-297.444 -172.541)" fill="#fff"/>
            <rect id="Rectangle_760" data-name="Rectangle 760" width="0.632" height="6.079" transform="translate(5.599 2.534)" fill="#fff"/>
            <path id="Path_310" data-name="Path 310" d="M159.24,181.128l-.146-6.079-.675.038.146,6.079Z" transform="translate(-154.806 -172.534)" fill="#fff"/>
            <path id="Path_311" data-name="Path 311" d="M17.379,76.867v1.027H18.45l.849,9.651a.514.514,0,0,0,.512.469h7.346a.514.514,0,0,0,.512-.469l.849-9.651h1.088V76.867Zm9.307,10.12h-6.4l-.8-9.092h8Z" transform="translate(-17.379 -76.867)" fill="#fff"/>
          </g>
        </g>
      </g>
      <g id="Group_141" data-name="Group 141" transform="translate(20.958)">
        <g id="Group_140" data-name="Group 140">
          <path id="Path_312" data-name="Path 312" d="M161.288,0h-3.356a.857.857,0,0,0-.856.856V2.483H158.1V1.027h3.014V2.483h1.027V.856A.857.857,0,0,0,161.288,0Z" transform="translate(-157.076)" fill="#fff"/>
        </g>
      </g>
    </g>
  </g>
</svg>
