<svg xmlns="http://www.w3.org/2000/svg" width="22.012" height="21.069" viewBox="0 0 22.012 21.069">
  <g id="star" transform="translate(-0.286 -10.938)">
    <path id="Path_467" data-name="Path 467" d="M72.934,28.857l-5.75-.533L64.9,23.02a.461.461,0,0,0-.846,0l-2.284,5.3-5.75.533a.461.461,0,0,0-.262.8L60.1,33.473l-1.27,5.633a.461.461,0,0,0,.685.5l4.965-2.948L69.442,39.6a.461.461,0,0,0,.685-.5l-1.27-5.633L73.2,29.662A.461.461,0,0,0,72.934,28.857Z" transform="translate(-53.185 -11.6)" fill="#ffdc64"/>
    <g id="Group_602" data-name="Group 602" transform="translate(0.286 10.938)">
      <path id="Path_468" data-name="Path 468" d="M95.192,18.459c.293.407,1.12,2.156,1.593,3.175a.16.16,0,0,1-.255.184c-.816-.772-2.212-2.111-2.505-2.518a.719.719,0,0,1,1.167-.84Z" transform="translate(-90.064 -18.161)" fill="#fff082"/>
      <path id="Path_469" data-name="Path 469" d="M353.984,18.459c-.293.407-1.12,2.156-1.593,3.175a.16.16,0,0,0,.255.184c.816-.772,2.212-2.111,2.505-2.518a.719.719,0,0,0-1.167-.84Z" transform="translate(-337.1 -18.161)" fill="#fff082"/>
      <path id="Path_470" data-name="Path 470" d="M413.683,282.495c-.477-.156-2.394-.413-3.509-.554a.16.16,0,0,0-.1.3c.983.543,2.683,1.466,3.16,1.622a.719.719,0,1,0,.446-1.367Z" transform="translate(-392.167 -270.257)" fill="#fff082"/>
      <path id="Path_471" data-name="Path 471" d="M8,282.495c.477-.156,2.394-.413,3.509-.554a.16.16,0,0,1,.1.3c-.983.543-2.683,1.466-3.16,1.622A.719.719,0,1,1,8,282.495Z" transform="translate(-7.506 -270.257)" fill="#fff082"/>
      <path id="Path_472" data-name="Path 472" d="M240.27,399.129c0-.5.35-2.4.562-3.507a.16.16,0,0,1,.314,0c.212,1.1.562,3.006.562,3.507a.719.719,0,1,1-1.438,0Z" transform="translate(-229.961 -378.779)" fill="#fff082"/>
    </g>
    <path id="Path_473" data-name="Path 473" d="M65.731,24.948,64.9,23.02a.461.461,0,0,0-.846,0l-2.284,5.3-5.75.533a.461.461,0,0,0-.262.8L60.1,33.473l-1.27,5.633a.461.461,0,0,0,.685.5l.661-.392A35.77,35.77,0,0,1,65.731,24.948Z" transform="translate(-53.185 -11.6)" fill="#ffc850"/>
  </g>
</svg>
