-- Merging decision tree log ---
manifest
ADDED from /Users/jx/Documents/mKasir/app/src/main/AndroidManifest.xml:2:1-43:12
INJECTED from /Users/jx/Documents/mKasir/app/src/main/AndroidManifest.xml:2:1-43:12
INJECTED from /Users/jx/Documents/mKasir/app/src/main/AndroidManifest.xml:2:1-43:12
INJECTED from /Users/jx/Documents/mKasir/app/src/main/AndroidManifest.xml:2:1-43:12
MERGED from [com.android.support:design:22.2.1] /Users/jx/.gradle/caches/transforms-1/files-1.1/design-22.2.1.aar/d7089a2b98787ee137f04369a28d8227/AndroidManifest.xml:17:1-24:12
MERGED from [com.android.support:appcompat-v7:22.2.1] /Users/jx/.gradle/caches/transforms-1/files-1.1/appcompat-v7-22.2.1.aar/ddc4e6da116305d0eb949369704c6f6c/AndroidManifest.xml:17:1-24:12
MERGED from [com.android.support:support-v4:22.2.1] /Users/jx/.gradle/caches/transforms-1/files-1.1/support-v4-22.2.1.aar/b11585306a8c0ca88ca2f880291ca5c5/AndroidManifest.xml:17:1-24:12
INJECTED from /Users/jx/Documents/mKasir/app/src/main/AndroidManifest.xml:2:1-43:12
INJECTED from /Users/jx/Documents/mKasir/app/src/main/AndroidManifest.xml:2:1-43:12
INJECTED from /Users/jx/Documents/mKasir/app/src/main/AndroidManifest.xml:2:1-43:12
	package
		ADDED from /Users/jx/Documents/mKasir/app/src/main/AndroidManifest.xml:3:5-34
		INJECTED from /Users/jx/Documents/mKasir/app/src/main/AndroidManifest.xml
		INJECTED from /Users/jx/Documents/mKasir/app/src/main/AndroidManifest.xml
	android:versionName
		INJECTED from /Users/jx/Documents/mKasir/app/src/main/AndroidManifest.xml
		ADDED from /Users/jx/Documents/mKasir/app/src/main/AndroidManifest.xml:2:1-43:12
		INJECTED from /Users/jx/Documents/mKasir/app/src/main/AndroidManifest.xml
	android:versionCode
		INJECTED from /Users/jx/Documents/mKasir/app/src/main/AndroidManifest.xml
		ADDED from /Users/jx/Documents/mKasir/app/src/main/AndroidManifest.xml:2:1-43:12
		INJECTED from /Users/jx/Documents/mKasir/app/src/main/AndroidManifest.xml
	xmlns:android
		ADDED from /Users/jx/Documents/mKasir/app/src/main/AndroidManifest.xml:2:11-69
uses-permission#android.permission.INTERNET
ADDED from /Users/jx/Documents/mKasir/app/src/main/AndroidManifest.xml:4:5-67
	android:name
		ADDED from /Users/jx/Documents/mKasir/app/src/main/AndroidManifest.xml:4:22-64
uses-permission#android.permission.ACCESS_NETWORK_STATE
ADDED from /Users/jx/Documents/mKasir/app/src/main/AndroidManifest.xml:5:5-79
	android:name
		ADDED from /Users/jx/Documents/mKasir/app/src/main/AndroidManifest.xml:5:22-76
uses-permission#android.permission.ACCESS_GPS
ADDED from /Users/jx/Documents/mKasir/app/src/main/AndroidManifest.xml:6:5-69
	android:name
		ADDED from /Users/jx/Documents/mKasir/app/src/main/AndroidManifest.xml:6:22-66
uses-permission#android.permission.ACCESS_ASSISTED_GPS
ADDED from /Users/jx/Documents/mKasir/app/src/main/AndroidManifest.xml:7:5-78
	android:name
		ADDED from /Users/jx/Documents/mKasir/app/src/main/AndroidManifest.xml:7:22-75
uses-permission#android.permission.ACCESS_LOCATION
ADDED from /Users/jx/Documents/mKasir/app/src/main/AndroidManifest.xml:8:5-74
	android:name
		ADDED from /Users/jx/Documents/mKasir/app/src/main/AndroidManifest.xml:8:22-71
uses-permission#android.permission.ACCESS_COARSE_LOCATION
ADDED from /Users/jx/Documents/mKasir/app/src/main/AndroidManifest.xml:9:5-81
	android:name
		ADDED from /Users/jx/Documents/mKasir/app/src/main/AndroidManifest.xml:9:22-78
uses-permission#android.permission.ACCESS_FINE_LOCATION
ADDED from /Users/jx/Documents/mKasir/app/src/main/AndroidManifest.xml:10:5-79
	android:name
		ADDED from /Users/jx/Documents/mKasir/app/src/main/AndroidManifest.xml:10:22-76
uses-permission#android.permission.VIBRATE
ADDED from /Users/jx/Documents/mKasir/app/src/main/AndroidManifest.xml:11:5-66
	android:name
		ADDED from /Users/jx/Documents/mKasir/app/src/main/AndroidManifest.xml:11:22-63
uses-permission#android.permission.WRITE_EXTERNAL_STORAGE
ADDED from /Users/jx/Documents/mKasir/app/src/main/AndroidManifest.xml:12:5-81
	android:name
		ADDED from /Users/jx/Documents/mKasir/app/src/main/AndroidManifest.xml:12:22-78
uses-permission#android.permission.READ_EXTERNAL_STORAGE
ADDED from /Users/jx/Documents/mKasir/app/src/main/AndroidManifest.xml:13:5-80
	android:name
		ADDED from /Users/jx/Documents/mKasir/app/src/main/AndroidManifest.xml:13:22-77
uses-permission#android.permission.BLUETOOTH
ADDED from /Users/jx/Documents/mKasir/app/src/main/AndroidManifest.xml:14:5-68
	android:name
		ADDED from /Users/jx/Documents/mKasir/app/src/main/AndroidManifest.xml:14:22-65
uses-permission#android.permission.BLUETOOTH_ADMIN
ADDED from /Users/jx/Documents/mKasir/app/src/main/AndroidManifest.xml:15:5-74
	android:name
		ADDED from /Users/jx/Documents/mKasir/app/src/main/AndroidManifest.xml:15:22-71
application
ADDED from /Users/jx/Documents/mKasir/app/src/main/AndroidManifest.xml:17:5-41:19
MERGED from [com.android.support:design:22.2.1] /Users/jx/.gradle/caches/transforms-1/files-1.1/design-22.2.1.aar/d7089a2b98787ee137f04369a28d8227/AndroidManifest.xml:22:5-20
MERGED from [com.android.support:design:22.2.1] /Users/jx/.gradle/caches/transforms-1/files-1.1/design-22.2.1.aar/d7089a2b98787ee137f04369a28d8227/AndroidManifest.xml:22:5-20
MERGED from [com.android.support:appcompat-v7:22.2.1] /Users/jx/.gradle/caches/transforms-1/files-1.1/appcompat-v7-22.2.1.aar/ddc4e6da116305d0eb949369704c6f6c/AndroidManifest.xml:22:5-20
MERGED from [com.android.support:appcompat-v7:22.2.1] /Users/jx/.gradle/caches/transforms-1/files-1.1/appcompat-v7-22.2.1.aar/ddc4e6da116305d0eb949369704c6f6c/AndroidManifest.xml:22:5-20
MERGED from [com.android.support:support-v4:22.2.1] /Users/jx/.gradle/caches/transforms-1/files-1.1/support-v4-22.2.1.aar/b11585306a8c0ca88ca2f880291ca5c5/AndroidManifest.xml:22:5-20
MERGED from [com.android.support:support-v4:22.2.1] /Users/jx/.gradle/caches/transforms-1/files-1.1/support-v4-22.2.1.aar/b11585306a8c0ca88ca2f880291ca5c5/AndroidManifest.xml:22:5-20
	android:supportsRtl
		ADDED from /Users/jx/Documents/mKasir/app/src/main/AndroidManifest.xml:21:9-35
	android:label
		ADDED from /Users/jx/Documents/mKasir/app/src/main/AndroidManifest.xml:20:9-41
	android:hardwareAccelerated
		ADDED from /Users/jx/Documents/mKasir/app/src/main/AndroidManifest.xml:23:9-43
	android:icon
		ADDED from /Users/jx/Documents/mKasir/app/src/main/AndroidManifest.xml:19:9-43
	android:allowBackup
		ADDED from /Users/jx/Documents/mKasir/app/src/main/AndroidManifest.xml:18:9-35
	android:theme
		ADDED from /Users/jx/Documents/mKasir/app/src/main/AndroidManifest.xml:22:9-40
activity#com.zencodev_mkasir.MainActivity
ADDED from /Users/jx/Documents/mKasir/app/src/main/AndroidManifest.xml:24:9-40:20
	android:screenOrientation
		ADDED from /Users/jx/Documents/mKasir/app/src/main/AndroidManifest.xml:28:13-49
	android:label
		ADDED from /Users/jx/Documents/mKasir/app/src/main/AndroidManifest.xml:27:13-45
	android:hardwareAccelerated
		ADDED from /Users/jx/Documents/mKasir/app/src/main/AndroidManifest.xml:30:13-47
	android:configChanges
		ADDED from /Users/jx/Documents/mKasir/app/src/main/AndroidManifest.xml:26:13-74
	android:theme
		ADDED from /Users/jx/Documents/mKasir/app/src/main/AndroidManifest.xml:29:13-44
	android:name
		ADDED from /Users/jx/Documents/mKasir/app/src/main/AndroidManifest.xml:25:13-60
intent-filter#android.intent.action.MAIN+android.intent.category.LAUNCHER
ADDED from /Users/jx/Documents/mKasir/app/src/main/AndroidManifest.xml:31:13-34:29
action#android.intent.action.MAIN
ADDED from /Users/jx/Documents/mKasir/app/src/main/AndroidManifest.xml:32:17-69
	android:name
		ADDED from /Users/jx/Documents/mKasir/app/src/main/AndroidManifest.xml:32:25-66
category#android.intent.category.LAUNCHER
ADDED from /Users/jx/Documents/mKasir/app/src/main/AndroidManifest.xml:33:17-77
	android:name
		ADDED from /Users/jx/Documents/mKasir/app/src/main/AndroidManifest.xml:33:27-74
intent-filter#android.intent.action.SEND+android.intent.category.DEFAULT
ADDED from /Users/jx/Documents/mKasir/app/src/main/AndroidManifest.xml:35:13-39:29
action#android.intent.action.SEND
ADDED from /Users/jx/Documents/mKasir/app/src/main/AndroidManifest.xml:36:17-69
	android:name
		ADDED from /Users/jx/Documents/mKasir/app/src/main/AndroidManifest.xml:36:25-66
category#android.intent.category.DEFAULT
ADDED from /Users/jx/Documents/mKasir/app/src/main/AndroidManifest.xml:37:17-76
	android:name
		ADDED from /Users/jx/Documents/mKasir/app/src/main/AndroidManifest.xml:37:27-73
data
ADDED from /Users/jx/Documents/mKasir/app/src/main/AndroidManifest.xml:38:17-55
	android:mimeType
		ADDED from /Users/jx/Documents/mKasir/app/src/main/AndroidManifest.xml:38:23-52
uses-sdk
INJECTED from /Users/jx/Documents/mKasir/app/src/main/AndroidManifest.xml reason: use-sdk injection requested
INJECTED from /Users/jx/Documents/mKasir/app/src/main/AndroidManifest.xml
INJECTED from /Users/jx/Documents/mKasir/app/src/main/AndroidManifest.xml
MERGED from [com.android.support:design:22.2.1] /Users/jx/.gradle/caches/transforms-1/files-1.1/design-22.2.1.aar/d7089a2b98787ee137f04369a28d8227/AndroidManifest.xml:20:5-43
MERGED from [com.android.support:design:22.2.1] /Users/jx/.gradle/caches/transforms-1/files-1.1/design-22.2.1.aar/d7089a2b98787ee137f04369a28d8227/AndroidManifest.xml:20:5-43
MERGED from [com.android.support:appcompat-v7:22.2.1] /Users/jx/.gradle/caches/transforms-1/files-1.1/appcompat-v7-22.2.1.aar/ddc4e6da116305d0eb949369704c6f6c/AndroidManifest.xml:20:5-43
MERGED from [com.android.support:appcompat-v7:22.2.1] /Users/jx/.gradle/caches/transforms-1/files-1.1/appcompat-v7-22.2.1.aar/ddc4e6da116305d0eb949369704c6f6c/AndroidManifest.xml:20:5-43
MERGED from [com.android.support:support-v4:22.2.1] /Users/jx/.gradle/caches/transforms-1/files-1.1/support-v4-22.2.1.aar/b11585306a8c0ca88ca2f880291ca5c5/AndroidManifest.xml:20:5-43
MERGED from [com.android.support:support-v4:22.2.1] /Users/jx/.gradle/caches/transforms-1/files-1.1/support-v4-22.2.1.aar/b11585306a8c0ca88ca2f880291ca5c5/AndroidManifest.xml:20:5-43
INJECTED from /Users/jx/Documents/mKasir/app/src/main/AndroidManifest.xml
INJECTED from /Users/jx/Documents/mKasir/app/src/main/AndroidManifest.xml
	android:targetSdkVersion
		INJECTED from /Users/jx/Documents/mKasir/app/src/main/AndroidManifest.xml
		ADDED from /Users/jx/Documents/mKasir/app/src/main/AndroidManifest.xml
		INJECTED from /Users/jx/Documents/mKasir/app/src/main/AndroidManifest.xml
	android:minSdkVersion
		INJECTED from /Users/jx/Documents/mKasir/app/src/main/AndroidManifest.xml
		ADDED from /Users/jx/Documents/mKasir/app/src/main/AndroidManifest.xml
		INJECTED from /Users/jx/Documents/mKasir/app/src/main/AndroidManifest.xml
