3 1 0 0 20 0.06250
3 2 0 1 56 0.18266
3 3 0 2 9 0.10150
3 4 0 3 87 0.52046
3 5 0 4 F2 6.27750
3 6 0 5 F1 4.96800
3 7 0 6 F0 3.96054
3 8 0 7 F4 13.53906
3 9 0 8 F0 2.25418
3 10 0 9 F4 7.25553
3 11 0 10 F0 1.24779
3 12 0 11 F4 5.61506
3 13 1 0 4B 0.20250
3 14 1 1 A 0.06282
3 15 1 2 3B 0.17073
3 16 1 3 95 0.71295
3 17 1 4 DE 2.45700
3 18 1 5 F5 4.07639
3 19 1 6 F6 14.19300
3 20 1 7 F0 4.52217
3 21 1 8 F4 15.13674
3 22 1 9 F4 10.75932
3 23 1 10 F0 1.66356
3 24 1 11 F4 5.61506
3 25 2 0 B 0.07220
3 26 2 1 3C 0.20093
3 27 2 2 66 0.55268
3 28 2 3 EB 9.45450
3 29 2 4 EB 5.00000
3 30 2 5 F9 6.52050
3 31 2 6 FA 22.50000
3 32 2 7 F4 29.03679
3 33 2 8 F9 6.48348
3 34 2 9 F4 15.55952
3 35 2 10 F2 5.02580
3 36 2 11 F0 1.56244
3 37 3 0 32 0.10041
3 38 3 1 3E 0.10850
3 39 3 2 91 0.88445
3 40 3 3 D7 7.80073
3 41 3 4 FB 20.19600
3 42 3 5 A9 1.03752
3 43 3 6 F5 6.16950
3 44 3 7 F9 22.50000
3 45 3 8 F4 29.75836
3 46 3 9 F4 21.43994
3 47 3 10 EE 6.13476
3 48 3 11 EC 1.95849
3 49 4 0 A 0.07551
3 50 4 1 32 0.20172
3 51 4 2 A 0.07710
3 52 4 3 E5 4.89991
3 53 4 4 C6 2.55810
3 54 4 5 48 0.20262
3 55 4 6 CA 2.28990
3 56 4 7 F1 45.00000
3 57 4 8 F0 8.50500
3 58 4 9 F4 28.32962
3 59 4 10 F4 19.82205
3 60 4 11 F4 13.16218
3 61 5 0 F 0.07185
3 62 5 1 35 0.09524
3 63 5 2 AB 1.14864
3 64 5 3 4D 0.48672
3 65 5 4 CA 3.00971
3 66 5 5 26 0.13711
3 67 5 6 5D 0.29245
3 68 5 7 69 0.30880
3 69 5 8 C5 1.63312
3 70 5 9 F2 8.41803
3 71 5 10 F4 25.64064
3 72 5 11 FC 5.39627
3 73 6 0 F0 4.42134
3 74 6 1 8 0.11900
3 75 6 2 18 0.28341
3 76 6 3 46 0.21140
3 77 6 4 14 0.10225
3 78 6 5 E4 5.83193
3 79 6 6 7A 0.52753
3 80 6 7 C9 2.54942
3 81 6 8 E5 4.51143
3 82 6 9 D2 2.10298
3 83 6 10 F8 4.54575
3 84 6 11 F9 6.00129
3 90 7 5 F1 8.00550
3 91 7 6 EF 16.25872
3 92 7 7 DB 4.46257
3 93 7 8 FF 45.00000
3 94 7 9 F1 5.70814
3 95 7 10 FA 11.10630
3 96 7 11 F0 5.57272
3 102 8 5 1F 0.32289
3 103 8 6 BD 1.43424
3 104 8 7 E4 2.42938
3 105 8 8 87 0.78610
3 106 8 9 7D 0.63952
3 107 8 10 DD 13.07731
3 108 8 11 9D 0.63796
3 114 9 5 23 0.30799
3 115 9 6 A2 1.03900
3 116 9 7 74 0.69280
3 117 9 8 AB 1.16719
3 118 9 9 16 0.29607
3 119 9 10 CB 1.34927
3 120 9 11 BD 0.95278
3 126 10 5 44 0.09250
3 127 10 6 2A 0.17856
3 128 10 7 D8 4.12767
3 129 10 8 34 0.40369
3 130 10 9 3B 0.39351
3 131 10 10 2 0.11650
3 132 10 11 DD 11.94375
3 138 11 5 54 0.10009
3 139 11 6 6D 0.59381
3 140 11 7 63 0.58807
3 141 11 8 CF 1.81076
3 142 11 9 12 0.29961
3 143 11 10 63 0.48116
3 144 11 11 6D 0.43910
3 150 12 5 5E 0.43350
3 151 12 6 F3 5.59908
3 152 12 7 81 0.77307
3 153 12 8 94 0.91710
3 154 12 9 0 4.25440
3 155 12 10 ED 4.51870
3 156 12 11 F6 2.19575
3 162 13 5 A6 0.89905
3 163 13 6 62 0.54602
3 164 13 7 FC 14.13000
3 165 13 8 90 0.88267
3 166 13 9 81 0.71303
3 167 13 10 5 0.23751
3 168 13 11 6A 0.42784
3 174 14 5 AD 1.03626
3 175 14 6 ED 2.71651
3 176 14 7 E5 5.00000
3 177 14 8 32 0.39490
3 178 14 9 C1 1.37309
3 179 14 10 E0 1.79733
3 180 14 11 F2 1.95904
3 186 15 5 51 0.23466
3 187 15 6 E4 4.83352
3 188 15 7 4F 0.24995
3 189 15 8 B 0.14740
3 190 15 9 44 0.39645
3 191 15 10 F0 4.32022
3 192 15 11 F2 1.86632
3 198 16 5 FC 22.50000
3 199 16 6 DE 5.00000
3 200 16 7 DF 5.00000
3 201 16 8 A9 1.13470
3 202 16 9 F3 6.19681
3 203 16 10 0 0.08250
3 204 16 11 F0 5.55605
3 205 17 0 F3 9.26271
3 206 17 1 FA 10.64796
3 207 17 2 FC 11.72837
3 208 17 3 F8 23.78115
3 209 17 4 E1 5.00000
3 210 17 5 DE 5.00000
3 211 17 6 F9 45.00000
3 212 17 7 0 0.15053
3 213 17 8 F3 6.76800
3 214 17 9 EC 4.24250
3 215 17 10 0 0.06978
3 216 17 11 B7 0.51191
3 217 18 0 D6 14.65976
3 218 18 1 F8 24.29784
3 219 18 2 DE 4.25970
3 220 18 3 F8 25.89012
3 221 18 4 F9 22.50000
3 222 18 5 DE 5.00000
3 223 18 6 F2 32.93000
3 224 18 7 B2 1.31062
3 225 18 8 E4 3.73388
3 226 18 9 E0 5.00000
3 227 18 10 FE 8.77480
3 228 18 11 F4 16.88679
3 229 19 0 EF 22.75454
3 230 19 1 E7 5.14452
3 231 19 2 C4 1.61834
3 232 19 3 F5 12.60994
3 233 19 4 DF 5.00000
3 234 19 5 8C 0.67049
3 235 19 6 CE 2.57280
3 236 19 7 DC 3.13636
3 237 19 8 FC 6.23126
3 238 19 9 F4 28.32962
3 239 19 10 F4 19.82205
3 240 19 11 FA 7.94118
3 241 20 0 F8 26.16170
3 242 20 1 D5 3.92410
3 243 20 2 E7 4.96193
3 244 20 3 F4 5.90888
3 245 20 4 FF 45.00000
3 246 20 5 EC 45.00000
3 247 20 6 EF 5.26950
3 248 20 7 FA 11.82150
3 249 20 8 F4 29.75836
3 250 20 9 F4 21.43994
3 251 20 10 F2 13.86291
3 252 20 11 FE 1.70969
3 253 21 0 E7 9.48097
3 254 21 1 D7 15.06327
3 255 21 2 8E 0.79741
3 256 21 3 FB 12.08700
3 257 21 4 EF 5.59506
3 258 21 5 E9 16.03350
3 259 21 6 FC 23.85434
3 260 21 7 EC 11.43404
3 261 21 8 F0 4.88950
3 262 21 9 F0 3.45767
3 263 21 10 F0 2.39096
3 264 21 11 F4 7.03098
3 265 22 0 F8 21.78378
3 266 22 1 FE 12.01078
3 267 22 2 8E 0.70226
3 268 22 3 FE 11.11967
3 269 22 4 F3 37.19250
3 270 22 5 F4 32.01183
3 271 22 6 F4 26.29238
3 272 22 7 F4 20.34976
3 273 22 8 F0 3.36372
3 274 22 9 F0 2.39096
3 275 22 10 F3 7.20000
3 276 22 11 F4 5.61506
3 277 23 0 F5 2.23980
3 278 23 1 9A 0.68169
3 279 23 2 F8 17.47548
3 280 23 3 7A 0.46101
3 281 23 4 F4 26.29238
3 282 23 5 F8 12.57090
3 283 23 6 F0 3.96054
3 284 23 7 FD 9.09524
3 285 23 8 F4 10.14381
3 286 23 9 F0 1.61234
3 287 23 10 F4 5.61506
3 288 23 11 F4 5.61506
4 1 0 0 1B 0.12110
4 2 0 1 4C 0.16936
4 3 0 2 32 0.13516
4 4 0 3 D2 1.20936
4 5 0 4 F4 26.29238
4 6 0 5 F4 22.00275
4 7 0 6 F0 3.96054
4 8 0 7 F4 13.53906
4 9 0 8 F0 2.25418
4 10 0 9 F4 7.25553
4 11 0 10 F0 1.24779
4 12 0 11 F4 5.61506
4 13 1 0 A 0.06353
4 14 1 1 84 0.65446
4 15 1 2 9D 0.80675
4 16 1 3 88 0.62833
4 17 1 4 F4 37.81737
4 18 1 5 F4 32.01183
4 19 1 6 FA 16.06500
4 20 1 7 F4 20.37150
4 21 1 8 FB 9.41169
4 22 1 9 F4 10.75932
4 23 1 10 F0 1.66356
4 24 1 11 EF 2.42570
4 25 2 0 13 0.07621
4 26 2 1 3A 0.39546
4 27 2 2 2 0.13225
4 28 2 3 93 0.79921
4 29 2 4 F3 12.87411
4 30 2 5 E7 3.86636
4 31 2 6 E1 2.60322
4 32 2 7 F4 29.03679
4 33 2 8 F4 22.00275
4 34 2 9 F4 15.55952
4 35 2 10 F4 10.75932
4 36 2 11 F4 7.03098
4 37 3 0 A 0.07630
4 38 3 1 46 0.23069
4 39 3 2 35 0.20106
4 40 3 3 75 0.66161
4 41 3 4 D5 3.32365
4 42 3 5 F2 13.69094
4 43 3 6 F4 11.98117
4 44 3 7 FE 6.57450
4 45 3 8 F9 8.73589
4 46 3 9 EF 18.71550
4 47 3 10 F0 3.27187
4 48 3 11 F4 9.84717
4 49 4 0 3C 0.42620
4 50 4 1 4D 0.49127
4 51 4 2 A3 1.09767
4 52 4 3 8E 0.88028
4 53 4 4 D2 3.54662
4 54 4 5 E9 12.02850
4 55 4 6 C1 1.86361
4 56 4 7 ED 10.26900
4 57 4 8 F4 38.71282
4 58 4 9 E8 5.00000
4 59 4 10 FD 6.71747
4 60 4 11 F4 13.16218
4 61 5 0 EA 19.35000
4 62 5 1 F7 3.03736
4 63 5 2 21 0.08516
4 64 5 3 1C 0.17065
4 65 5 4 75 0.49254
4 66 5 5 E9 6.69861
4 67 5 6 AC 1.32586
4 68 5 7 F4 29.83050
4 69 5 8 FE 8.14500
4 70 5 9 F4 36.07726
4 71 5 10 F4 25.64064
4 72 5 11 F4 16.88679
4 73 6 0 57 0.40800
4 74 6 1 3D 0.34145
4 75 6 2 2C 0.16239
4 76 6 3 50 0.11513
4 77 6 4 EB 6.77250
4 78 6 5 DF 5.08950
4 79 6 6 F6 39.84716
4 80 6 7 FD 45.00000
4 81 6 8 ED 22.27050
4 82 6 9 FB 13.83300
4 83 6 10 EF 6.73650
4 84 6 11 F4 20.88900
4 90 7 5 EC 6.88886
4 91 7 6 82 0.62492
4 92 7 7 FC 23.71501
4 93 7 8 F6 17.02800
4 94 7 9 FB 15.81750
4 95 7 10 FC 12.00150
4 96 7 11 F4 25.00222
4 102 8 5 E5 2.27070
4 103 8 6 76 0.69584
4 104 8 7 D6 4.02350
4 105 8 8 8C 0.82139
4 106 8 9 6B 0.54374
4 107 8 10 7B 0.54520
4 108 8 11 E9 6.51504
4 114 9 5 49 0.20328
4 115 9 6 DF 8.79843
4 116 9 7 DF 9.19351
4 117 9 8 F8 3.20588
4 118 9 9 D3 13.80158
4 119 9 10 1B 0.13257
4 120 9 11 DB 1.39560
4 126 10 5 18 0.13534
4 127 10 6 42 0.10625
4 128 10 7 AD 1.22006
4 129 10 8 5F 0.56762
4 130 10 9 4F 0.45726
4 131 10 10 4E 0.20065
4 132 10 11 F0 1.96091
4 138 11 5 23 0.27668
4 139 11 6 6 0.13653
4 140 11 7 9 0.15156
4 141 11 8 4F 0.49849
4 142 11 9 F3 2.81158
4 143 11 10 9C 0.82974
4 144 11 11 59 0.37006
4 150 12 5 EE 4.37047
4 151 12 6 48 0.43426
4 152 12 7 D2 1.89258
4 153 12 8 E7 10.01878
4 154 12 9 9A 0.91453
4 155 12 10 F5 2.54160
4 156 12 11 E0 1.57563
4 162 13 5 2B 0.30805
4 163 13 6 5B 0.25815
4 164 13 7 EE 11.29604
4 165 13 8 CE 1.77044
4 166 13 9 ED 2.54671
4 167 13 10 B1 1.02068
4 168 13 11 C4 1.07539
4 174 14 5 DC 7.42425
4 175 14 6 F8 6.45437
4 176 14 7 E4 19.67353
4 177 14 8 A9 1.13767
4 178 14 9 D4 3.55485
4 179 14 10 7F 0.59188
4 180 14 11 F6 8.22600
4 186 15 5 E4 2.25145
4 187 15 6 F0 5.75336
4 188 15 7 EB 5.46452
4 189 15 8 EA 20.39218
4 190 15 9 DF 7.72695
4 191 15 10 DE 3.32514
4 192 15 11 FD 2.20500
4 198 16 5 E1 5.00000
4 199 16 6 E9 13.63950
4 200 16 7 F1 33.27000
4 201 16 8 C9 2.42899
4 202 16 9 F1 22.50000
4 203 16 10 F0 16.47000
4 204 16 11 EB 4.81050
4 205 17 0 F8 19.89603
4 206 17 1 F8 20.59124
4 207 17 2 F8 22.02741
4 208 17 3 E2 17.14357
4 209 17 4 EE 29.22750
4 210 17 5 F7 10.47844
4 211 17 6 F9 43.24950
4 212 17 7 EE 14.25150
4 213 17 8 EA 20.43000
4 214 17 9 F3 42.28200
4 215 17 10 EE 6.63750
4 216 17 11 FE 7.11079
4 217 18 0 5 0.26911
4 218 18 1 F2 11.05282
4 219 18 2 F8 25.08606
4 220 18 3 DD 4.37125
4 221 18 4 DE 5.00000
4 222 18 5 F9 45.00000
4 223 18 6 EB 13.03200
4 224 18 7 E5 4.87482
4 225 18 8 0 0.85008
4 226 18 9 F0 8.01717
4 227 18 10 F0 22.50000
4 228 18 11 F0 3.75262
4 229 19 0 DD 8.73936
4 230 19 1 D9 2.07917
4 231 19 2 DF 2.29194
4 232 19 3 E6 5.00000
4 233 19 4 AE 1.47015
4 234 19 5 8F 0.70899
4 235 19 6 0 0.13245
4 236 19 7 CE 2.16520
4 237 19 8 DD 5.00000
4 238 19 9 F8 4.02910
4 239 19 10 F4 19.82205
4 240 19 11 F0 2.92493
4 241 20 0 F8 26.16170
4 242 20 1 F8 25.89012
4 243 20 2 EB 2.65790
4 244 20 3 E8 4.94828
4 245 20 4 E9 5.89200
4 246 20 5 EC 45.00000
4 247 20 6 FC 31.15800
4 248 20 7 F4 38.71282
4 249 20 8 F4 29.75836
4 250 20 9 F4 10.92007
4 251 20 10 F4 7.28973
4 252 20 11 F1 4.54064
4 253 21 0 D6 14.98050
4 254 21 1 F1 5.49693
4 255 21 2 3F 0.40227
4 256 21 3 EA 4.60319
4 257 21 4 B8 1.31139
4 258 21 5 0 0.79424
4 259 21 6 F4 36.93892
4 260 21 7 F3 6.98173
4 261 21 8 F6 11.63212
4 262 21 9 F4 15.55952
4 263 21 10 F4 10.75932
4 264 21 11 EA 5.19355
4 265 22 0 F4 10.37386
4 266 22 1 D8 13.56300
4 267 22 2 F8 20.82632
4 268 22 3 AE 0.93707
4 269 22 4 D5 1.98673
4 270 22 5 CE 1.35708
4 271 22 6 F8 7.49233
4 272 22 7 F4 20.34976
4 273 22 8 F0 13.57650
4 274 22 9 FB 6.63252
4 275 22 10 EE 3.11418
4 276 22 11 F4 1.41250
4 277 23 0 A3 0.76890
4 278 23 1 8F 0.61589
4 279 23 2 56 0.35250
4 280 23 3 D 0.19730
4 281 23 4 C2 0.83704
4 282 23 5 FE 3.76088
4 283 23 6 F4 17.82243
4 284 23 7 F5 7.08845
4 285 23 8 F4 10.14381
4 286 23 9 F3 7.02658
4 287 23 10 FE 1.92659
4 288 23 11 BF 0.16417
