3 1 0 0 63 0.39463
3 2 0 1 9D 0.67370
3 3 0 2 52 0.33974
3 4 0 3 8C 0.57187
3 5 0 4 B2 0.73709
3 6 0 5 C2 1.10953
3 7 0 6 CE 1.38601
3 8 0 7 EE 13.87641
3 9 0 8 F5 119.61191
3 10 0 9 CF 1.37961
3 11 0 10 F5 17.33712
3 12 0 11 F7 18.34750
3 13 1 0 6D 1.37178
3 14 1 1 44 0.13380
3 15 1 2 74 0.45605
3 16 1 3 74 0.45531
3 17 1 4 74 0.21386
3 18 1 5 B2 0.71904
3 19 1 6 C3 1.04865
3 20 1 7 F4 8.38770
3 21 1 8 F7 4.72429
3 22 1 9 F9 11.04958
3 23 1 10 F3 10.99325
3 24 1 11 F5 7.80381
3 25 2 0 5 0.12969
3 26 2 1 5F 0.37476
3 27 2 2 A8 5.95753
3 28 2 3 D0 1.21110
3 29 2 4 92 0.35806
3 30 2 5 97 0.78707
3 31 2 6 DE 4.64805
3 32 2 7 D4 29.31690
3 33 2 8 E9 5.41968
3 34 2 9 DA 2.06269
3 35 2 10 FA 20.78470
3 36 2 11 FC 22.06797
3 37 3 0 32 0.09375
3 38 3 1 23 0.64933
3 39 3 2 8A 0.56269
3 40 3 3 7B 0.48940
3 41 3 4 43 0.09502
3 42 3 5 7D 1.93558
3 43 3 6 88 14.01103
3 44 3 7 F9 156.30962
3 45 3 8 D7 1.80435
3 46 3 9 C0 9.89609
3 47 3 10 C2 67.31939
3 48 3 11 B2 19.99004
3 49 4 0 6 0.16368
3 50 4 1 67 0.78342
3 51 4 2 8 0.05796
3 52 4 3 94 0.61435
3 53 4 4 A3 0.52658
3 54 4 5 70 0.19082
3 55 4 6 90 0.35579
3 56 4 7 E9 24.28713
3 57 4 8 C0 1.01767
3 58 4 9 CF 2.98689
3 59 4 10 FA 7.58049
3 60 4 11 F7 21.75228
3 61 5 0 2C 0.05472
3 62 5 1 C 0.29067
3 63 5 2 82 0.51500
3 64 5 3 28 0.50093
3 65 5 4 F 56.12631
3 66 5 5 34 0.07354
3 67 5 6 51 0.11539
3 68 5 7 59 0.12788
3 69 5 8 8B 0.32224
3 70 5 9 CD 1.36737
3 71 5 10 F8 66.64251
3 72 5 11 D6 1.71554
3 73 6 0 1B 0.56454
3 74 6 1 49 0.07665
3 75 6 2 3E 0.29463
3 76 6 3 9 0.19876
3 77 6 4 29 0.03187
3 78 6 5 23 0.91291
3 79 6 6 77 0.22602
3 80 6 7 B5 0.79725
3 81 6 8 B2 0.70587
3 82 6 9 8D 0.34689
3 83 6 10 A9 0.59456
3 84 6 11 B2 0.73752
3 90 7 5 95 0.39632
3 91 7 6 81 0.26304
3 92 7 7 57 0.12584
3 93 7 8 B8 0.82786
3 94 7 9 92 0.36060
3 95 7 10 D7 1.74928
3 96 7 11 BD 0.94563
3 102 8 5 95 0.61337
3 103 8 6 E4 1.56927
3 104 8 7 F1 1.92448
3 105 8 8 B1 0.84562
3 106 8 9 99 0.64639
3 107 8 10 F3 12.40977
3 108 8 11 AB 0.79489
3 114 9 5 B5 0.88679
3 115 9 6 E8 1.74258
3 116 9 7 CD 1.18102
3 117 9 8 D2 1.25718
3 118 9 9 A7 0.76055
3 119 9 10 F4 2.00952
3 120 9 11 88 0.53530
3 126 10 5 2B 0.14609
3 127 10 6 80 0.51080
3 128 10 7 F8 141.72861
3 129 10 8 95 0.62402
3 130 10 9 C3 1.05761
3 131 10 10 5D 0.37131
3 132 10 11 EE 15.55671
3 138 11 5 48 0.31443
3 139 11 6 B6 1.81377
3 140 11 7 BD 0.95987
3 141 11 8 D2 2.53246
3 142 11 9 92 0.60911
3 143 11 10 C2 1.03018
3 144 11 11 97 0.64138
3 150 12 5 51 0.04184
3 151 12 6 ED 59.55550
3 152 12 7 FE 18.70174
3 153 12 8 D8 87.34043
3 154 12 9 0 0.00000
3 155 12 10 2A 0.06281
3 156 12 11 DD 23.97291
3 162 13 5 FE 36.32716
3 163 13 6 F8 17.55180
3 164 13 7 D1 20.08728
3 165 13 8 D6 5.41160
3 166 13 9 56 0.17774
3 167 13 10 3D 0.07134
3 168 13 11 37 0.06882
3 174 14 5 ED 1.83162
3 175 14 6 F7 67.62938
3 176 14 7 D0 162.10060
3 177 14 8 59 92.44986
3 178 14 9 E0 95.73389
3 179 14 10 48 0.15339
3 180 14 11 28 0.48833
3 186 15 5 9 0.09874
3 187 15 6 E5 104.15700
3 188 15 7 E9 3.51480
3 189 15 8 44 0.30139
3 190 15 9 59 0.02198
3 191 15 10 E3 271.39101
3 192 15 11 F7 8.59585
3 198 16 5 EB 5207.00528
3 199 16 6 F7 145.59411
3 200 16 7 FA 5.81432
3 201 16 8 A2 0.50150
3 202 16 9 B6 0.82476
3 203 16 10 0 0.00000
3 204 16 11 FB 88.93164
3 205 17 0 D3 32.70903
3 206 17 1 FF 158.48257
3 207 17 2 D4 41.84661
3 208 17 3 F1 65.09530
3 209 17 4 FF 186.11207
3 210 17 5 FF 186.18173
3 211 17 6 DB 2.13474
3 212 17 7 0 0.00000
3 213 17 8 BE 0.97956
3 214 17 9 BB 0.93329
3 215 17 10 0 0.00000
3 216 17 11 C2 1.09831
3 217 18 0 D5 91.53055
3 218 18 1 FE 316.39113
3 219 18 2 EC 3.69522
3 220 18 3 F6 35.03445
3 221 18 4 EA 101.83305
3 222 18 5 FC 84.03642
3 223 18 6 F0 3.60686
3 224 18 7 B4 0.73776
3 225 18 8 CB 1.26074
3 226 18 9 F5 19.44589
3 227 18 10 CB 3.06688
3 228 18 11 DD 2.26733
3 229 19 0 D2 173.35681
3 230 19 1 F3 7.40512
3 231 19 2 F0 3.83651
3 232 19 3 E1 101.10422
3 233 19 4 F2 30.98594
3 234 19 5 A9 0.58694
3 235 19 6 BF 0.96241
3 236 19 7 C2 1.11824
3 237 19 8 E0 2.34811
3 238 19 9 DD 75.17500
3 239 19 10 F8 18.78377
3 240 19 11 F8 6.83328
3 241 20 0 ED 877.24466
3 242 20 1 F0 19.56678
3 243 20 2 FB 4.55995
3 244 20 3 F8 26.24410
3 245 20 4 F0 7.35153
3 246 20 5 EA 121.90501
3 247 20 6 C4 1.08996
3 248 20 7 D0 1.40187
3 249 20 8 EF 7.20359
3 250 20 9 CC 1.27255
3 251 20 10 EA 3.03279
3 252 20 11 92 0.36790
3 253 21 0 F2 51.00893
3 254 21 1 DF 80.79217
3 255 21 2 D1 2.48288
3 256 21 3 FE 18.58431
3 257 21 4 C7 1.18987
3 258 21 5 EE 3.42846
3 259 21 6 FA 4.72757
3 260 21 7 F2 11.46272
3 261 21 8 F4 11.69380
3 262 21 9 FF 187.81472
3 263 21 10 FF 751.59020
3 264 21 11 E6 5.41165
3 265 22 0 E5 100.21625
3 266 22 1 D2 118.46973
3 267 22 2 C6 1.09439
3 268 22 3 E4 13.12222
3 269 22 4 BA 0.87647
3 270 22 5 B8 0.80091
3 271 22 6 E7 2.93588
3 272 22 7 EC 8.32800
3 273 22 8 E9 29.72885
3 274 22 9 EB 5.43681
3 275 22 10 F6 59.11722
3 276 22 11 DB 2.00289
3 277 23 0 B6 0.88827
3 278 23 1 D1 2.50612
3 279 23 2 C7 1.07041
3 280 23 3 DB 1.34751
3 281 23 4 C8 1.19259
3 282 23 5 2D 0.02030
3 283 23 6 E9 16.48517
3 284 23 7 C2 1.05767
3 285 23 8 F0 5.06896
3 286 23 9 EF 37.20728
3 287 23 10 F1 23.37852
3 288 23 11 EB 3280.39644
4 1 0 0 56 0.34930
4 2 0 1 3F 0.14608
4 3 0 2 55 0.35210
4 4 0 3 A3 0.71869
4 5 0 4 EA 23.78121
4 6 0 5 3E 0.17340
4 7 0 6 F2 51.17672
4 8 0 7 F4 5.02501
4 9 0 8 EE 95.44046
4 10 0 9 FB 34.41186
4 11 0 10 EF 42.27717
4 12 0 11 94 0.37479
4 13 1 0 3E 0.29509
4 14 1 1 35 0.27254
4 15 1 2 CB 2.42040
4 16 1 3 47 0.31015
4 17 1 4 2D 0.26773
4 18 1 5 2E 0.57771
4 19 1 6 C3 2.03630
4 20 1 7 D2 1.58966
4 21 1 8 D4 1.59827
4 22 1 9 FB 8.72610
4 23 1 10 EE 7.00270
4 24 1 11 E1 3.26943
4 25 2 0 46 0.03977
4 26 2 1 70 0.44567
4 27 2 2 62 0.38136
4 28 2 3 96 0.62050
4 29 2 4 A9 0.55075
4 30 2 5 93 0.36769
4 31 2 6 B6 0.79573
4 32 2 7 EF 22.68502
4 33 2 8 ED 3.50220
4 34 2 9 DD 2.17213
4 35 2 10 FA 11.77527
4 36 2 11 F1 4.44131
4 37 3 0 6A 0.41640
4 38 3 1 4E 1.67818
4 39 3 2 5E 0.37759
4 40 3 3 A1 0.70423
4 41 3 4 70 0.19108
4 42 3 5 88 0.29854
4 43 3 6 9E 0.45825
4 44 3 7 8C 0.33101
4 45 3 8 AC 0.64748
4 46 3 9 E0 2.26538
4 47 3 10 F0 3.71561
4 48 3 11 FE 5.84216
4 49 4 0 91 0.59855
4 50 4 1 36 0.27277
4 51 4 2 C9 1.12637
4 52 4 3 7C 0.48979
4 53 4 4 59 0.13376
4 54 4 5 7C 0.23356
4 55 4 6 73 0.20668
4 56 4 7 96 0.37692
4 57 4 8 2D 0.13024
4 58 4 9 F6 139.63629
4 59 4 10 FC 13.29599
4 60 4 11 D9 1.89543
4 61 5 0 EC 115.06943
4 62 5 1 6C 0.42531
4 63 5 2 28 1.21828
4 64 5 3 1B 0.11151
4 65 5 4 28 0.06162
4 66 5 5 87 0.30558
4 67 5 6 66 0.15772
4 68 5 7 C2 1.02558
4 69 5 8 97 0.41911
4 70 5 9 E2 2.43616
4 71 5 10 DA 1.91289
4 72 5 11 ED 8.96747
4 73 6 0 12 0.21328
4 74 6 1 13 0.19726
4 75 6 2 1 0.19030
4 76 6 3 1 0.28974
4 77 6 4 5D 0.14086
4 78 6 5 59 0.13034
4 79 6 6 CC 1.31390
4 80 6 7 F8 78.07350
4 81 6 8 BC 0.92988
4 82 6 9 BB 0.90307
4 83 6 10 9B 0.41868
4 84 6 11 FC 5.38059
4 90 7 5 67 0.16405
4 91 7 6 5C 0.13746
4 92 7 7 DD 2.05124
4 93 7 8 AB 0.60174
4 94 7 9 B8 0.84083
4 95 7 10 B6 0.79394
4 96 7 11 DC 2.14854
4 102 8 5 D1 23.55351
4 103 8 6 8E 0.58714
4 104 8 7 F5 16.69472
4 105 8 8 E6 1.66912
4 106 8 9 A8 0.74517
4 107 8 10 7D 0.49274
4 108 8 11 F3 3.49832
4 114 9 5 A9 0.75888
4 115 9 6 D3 41.09937
4 116 9 7 DA 20.26601
4 117 9 8 E3 1.58182
4 118 9 9 FC 19.10419
4 119 9 10 3F 0.28838
4 120 9 11 E5 1.61906
4 126 10 5 C3 1.05296
4 127 10 6 90 0.58726
4 128 10 7 C4 1.03599
4 129 10 8 BB 0.95145
4 130 10 9 BC 0.96884
4 131 10 10 74 0.45086
4 132 10 11 DB 1.41914
4 138 11 5 C0 1.00119
4 139 11 6 8F 0.57857
4 140 11 7 A0 0.69805
4 141 11 8 91 0.58079
4 142 11 9 EA 2.62391
4 143 11 10 BF 0.96286
4 144 11 11 C2 1.03575
4 150 12 5 D2 19.82376
4 151 12 6 F4 2.00459
4 152 12 7 E4 1.63942
4 153 12 8 FE 2.56106
4 154 12 9 BE 0.97857
4 155 12 10 DB 1.45382
4 156 12 11 DD 1.44830
4 162 13 5 F6 2.06565
4 163 13 6 94 0.61501
4 164 13 7 E1 13.46313
4 165 13 8 EA 4.61520
4 166 13 9 D2 3.79523
4 167 13 10 D5 1.29123
4 168 13 11 AF 0.82635
4 174 14 5 DB 6.37219
4 175 14 6 D0 24.21603
4 176 14 7 DC 9.88109
4 177 14 8 AF 0.81213
4 178 14 9 D5 4.04419
4 179 14 10 A5 0.73527
4 180 14 11 D4 3.13933
4 186 15 5 E6 1.65119
4 187 15 6 D3 32.60844
4 188 15 7 ED 4.84580
4 189 15 8 F0 15.10600
4 190 15 9 A5 0.71189
4 191 15 10 D1 1.16661
4 192 15 11 91 0.59205
4 198 16 5 FF 182.91539
4 199 16 6 9C 0.43485
4 200 16 7 E2 316.87772
4 201 16 8 73 0.40527
4 202 16 9 D8 1.77255
4 203 16 10 D1 1.50484
4 204 16 11 8A 0.30860
4 205 17 0 FD 38.49311
4 206 17 1 ED 1482.42099
4 207 17 2 F7 96.28967
4 208 17 3 F3 25.18248
4 209 17 4 F8 148.07470
4 210 17 5 F4 21.00030
4 211 17 6 EA 98.61255
4 212 17 7 DA 1.93520
4 213 17 8 6E 0.74752
4 214 17 9 B0 0.65204
4 215 17 10 AC 0.66348
4 216 17 11 BF 1.01956
4 217 18 0 68 0.40774
4 218 18 1 FC 16.89865
4 219 18 2 DE 13409.94042
4 220 18 3 F5 35.07705
4 221 18 4 F4 131.08478
4 222 18 5 E3 2.58511
4 223 18 6 BD 0.91323
4 224 18 7 B3 0.75026
4 225 18 8 0 0.00000
4 226 18 9 FA 13.12094
4 227 18 10 F5 264.49110
4 228 18 11 ED 3.71487
4 229 19 0 F9 3.47090
4 230 19 1 DF 1.50444
4 231 19 2 E2 5.25573
4 232 19 3 D7 86.64663
4 233 19 4 CE 1.43431
4 234 19 5 A5 0.54380
4 235 19 6 0 0.00000
4 236 19 7 92 0.37753
4 237 19 8 BC 0.92992
4 238 19 9 BF 0.96111
4 239 19 10 FA 19.38262
4 240 19 11 F1 7.17554
4 241 20 0 FB 75.22020
4 242 20 1 DD 131.28698
4 243 20 2 FD 2.37951
4 244 20 3 FB 5.77632
4 245 20 4 F4 129.97130
4 246 20 5 E9 7.95367
4 247 20 6 77 0.91052
4 248 20 7 E0 2.17001
4 249 20 8 EF 371.69237
4 250 20 9 F6 5.97815
4 251 20 10 F3 22.22144
4 252 20 11 E9 16.54723
4 253 21 0 E8 15.37873
4 254 21 1 D8 2.74574
4 255 21 2 AF 0.80718
4 256 21 3 DC 6.94076
4 257 21 4 98 0.41932
4 258 21 5 0 0.00000
4 259 21 6 F6 65.66065
4 260 21 7 FD 8.95292
4 261 21 8 E9 13.46025
4 262 21 9 FD 50.46631
4 263 21 10 F7 13.21782
4 264 21 11 FA 34.59190
4 265 22 0 EA 7.80258
4 266 22 1 E9 7.02205
4 267 22 2 ED 357.02898
4 268 22 3 D4 1.28478
4 269 22 4 A7 0.54021
4 270 22 5 68 0.15928
4 271 22 6 C6 1.13763
4 272 22 7 F9 4.73747
4 273 22 8 97 0.82928
4 274 22 9 E2 3.32147
4 275 22 10 EB 4.89930
4 276 22 11 CD 1.33341
4 277 23 0 BB 0.93185
4 278 23 1 79 0.47166
4 279 23 2 A3 0.69584
4 280 23 3 67 0.40168
4 281 23 4 26 3.72795
4 282 23 5 B1 0.68022
4 283 23 6 B0 1.43926
4 284 23 7 C3 2.09047
4 285 23 8 9D 0.97321
4 286 23 9 F0 92.28683
4 287 23 10 FB 400.26128
4 288 23 11 15 0.04728
