!SETdevice 0
!setctrl 0 0
!sleep 100
!rdac E0 0xF6
!sleep 100
!rdac E2 0xF9
!sleep 100
!rdac E4 0xF5
!sleep 100
!rdac E6 0xF9
!sleep 100
!rdac E8 0xF4
!sleep 100
!rdac EA 0xEB
!sleep 100
!rdac EC 0xFF
!sleep 100
!rdac EE 0xEC
!sleep 100
!rdac F0 0xEC
!sleep 100
!rdac F2 0xFF
!sleep 100
!rdac F4 0xFF
!sleep 100
!rdac F6 0xFF
!sleep 100
!rdac F8 0xEC
!sleep 100
!rdac FA 0xEC
!sleep 100
!rdac FC 0xFF
!sleep 100
!rdac FE 0xFF
!sleep 100
!setctrl 0 1
!sleep 100
!rdac E0 0xFE
!sleep 100
!rdac E2 0xEB
!sleep 100
!rdac E4 0xF3
!sleep 100
!rdac E6 0x89
!sleep 100
!rdac E8 0xFE
!sleep 100
!rdac EA 0xF9
!sleep 100
!rdac EC 0xFF
!sleep 100
!rdac EE 0xFD
!sleep 100
!rdac F0 0xF4
!sleep 100
!rdac F2 0xFF
!sleep 100
!rdac F4 0xFF
!sleep 100
!rdac F6 0xFF
!sleep 100
!rdac F8 0xF6
!sleep 100
!rdac FA 0xEA
!sleep 100
!rdac FC 0xEC
!sleep 100
!rdac FE 0xF6
!sleep 100
!setctrl 0 2
!sleep 100
!rdac E0 0xC7
!sleep 100
!rdac E2 0xEB
!sleep 100
!rdac E4 0x37
!sleep 100
!rdac E6 0x30
!sleep 100
!rdac E8 0xEC
!sleep 100
!rdac EA 0x1A
!sleep 100
!rdac EC 0xF9
!sleep 100
!rdac EE 0x23
!sleep 100
!rdac F0 0xF4
!sleep 100
!rdac F2 0xD8
!sleep 100
!rdac F4 0xF7
!sleep 100
!rdac F6 0xEC
!sleep 100
!rdac F8 0xFF
!sleep 100
!rdac FA 0xF3
!sleep 100
!rdac FC 0xF9
!sleep 100
!rdac FE 0xE9
!sleep 100
!setctrl 0 3
!sleep 100
!rdac E0 0x17
!sleep 100
!rdac E2 0xFA
!sleep 100
!rdac E4 0xFC
!sleep 100
!rdac E6 0xF4
!sleep 100
!rdac E8 0x84
!sleep 100
!rdac EA 0xFE
!sleep 100
!rdac EC 0xB0
!sleep 100
!rdac EE 0xEC
!sleep 100
!rdac F0 0xDF
!sleep 100
!rdac F2 0xF5
!sleep 100
!rdac F4 0xD6
!sleep 100
!rdac F6 0xFC
!sleep 100
!rdac F8 0xFE
!sleep 100
!rdac FA 0xEB
!sleep 100
!rdac FC 0xF5
!sleep 100
!setctrl 1 0
!sleep 100
!rdac E0 0xC5
!sleep 100
!rdac E2 0xFA
!sleep 100
!rdac E4 0x0
!sleep 100
!rdac E6 0x0
!sleep 100
!rdac E8 0xF5
!sleep 100
!rdac EA 0xEE
!sleep 100
!rdac EC 0xF7
!sleep 100
!rdac EE 0x9E
!sleep 100
!rdac F0 0x0
!sleep 100
!rdac F2 0xF3
!sleep 100
!rdac F4 0xFD
!sleep 100
!rdac F6 0xF2
!sleep 100
!rdac F8 0xE9
!sleep 100
!rdac FA 0xF5
!sleep 100
!rdac FC 0xF5
!sleep 100
!setctrl 1 1
!sleep 100
!rdac E0 0xEF
!sleep 100
!rdac E2 0xFF
!sleep 100
!rdac E4 0xFF
!sleep 100
!rdac E6 0xF7
!sleep 100
!rdac E8 0xFF
!sleep 100
!rdac EA 0xF4
!sleep 100
!rdac EC 0xFD
!sleep 100
!rdac EE 0xEB
!sleep 100
!rdac F0 0xCB
!sleep 100
!rdac F2 0x9B
!sleep 100
!rdac F4 0xCF
!sleep 100
!rdac F6 0xEE
!sleep 100
!rdac F8 0x99
!sleep 100
!rdac FA 0xF9
!sleep 100
!rdac FC 0xF3
!sleep 100
!rdac FE 0xFD
!sleep 100
!setctrl 1 2
!sleep 100
!rdac E0 0xEC
!sleep 100
!rdac E2 0xF2
!sleep 100
!rdac E4 0xFF
!sleep 100
!rdac E6 0xEB
!sleep 100
!rdac E8 0xEC
!sleep 100
!rdac EA 0xFF
!sleep 100
!rdac EC 0xEC
!sleep 100
!rdac EE 0xFF
!sleep 100
!rdac F0 0xF8
!sleep 100
!rdac F2 0xFE
!sleep 100
!rdac F4 0xF9
!sleep 100
!rdac F6 0xEA
!sleep 100
!rdac F8 0xFD
!sleep 100
!rdac FA 0xFA
!sleep 100
!rdac FC 0xF0
!sleep 100
!rdac FE 0xE9
!sleep 100
!setctrl 1 3
!sleep 100
!rdac E0 0xFF
!sleep 100
!rdac E2 0xFF
!sleep 100
!rdac E4 0xFF
!sleep 100
!rdac E6 0xF7
!sleep 100
!rdac E8 0xEC
!sleep 100
!rdac EA 0xEC
!sleep 100
!rdac EC 0xFF
!sleep 100
!rdac EE 0xF4
!sleep 100
!rdac F0 0xF7
!sleep 100
!rdac F2 0xF0
!sleep 100
!rdac F4 0xEC
!sleep 100
!rdac F6 0xEF
!sleep 100
!rdac F8 0xE9
!sleep 100
!rdac FA 0xEA
!sleep 100
!rdac FC 0xFF
!sleep 100
!rdac FE 0xEB
!sleep 100
!setctrl 2 0
!sleep 100
!rdac E0 0xE6
!sleep 100
!rdac E2 0xF6
!sleep 100
!rdac E4 0xDE
!sleep 100
!rdac E6 0xFF
!sleep 100
!rdac E8 0xA7
!sleep 100
!rdac EA 0xE9
!sleep 100
!rdac EC 0xEE
!sleep 100
!rdac EE 0xDF
!sleep 100
!rdac F0 0xDE
!sleep 100
!rdac F2 0x64
!sleep 100
!rdac F4 0x6C
!sleep 100
!rdac F6 0xD5
!sleep 100
!rdac F8 0x4A
!sleep 100
!rdac FA 0xED
!sleep 100
!rdac FC 0xEC
!sleep 100
!rdac FE 0xFB
!sleep 100
!setctrl 2 1
!sleep 100
!rdac E0 0xFB
!sleep 100
!rdac E2 0xE6
!sleep 100
!rdac E8 0xFF
!sleep 100
!rdac EC 0xE1
!sleep 100
!rdac F0 0xFF
!sleep 100
!rdac F2 0xE6
!sleep 100
!rdac F4 0xE3
!sleep 100
!rdac F6 0xDF
!sleep 100
!rdac F8 0xCE
!sleep 100
!rdac FA 0xFF
!sleep 100
!rdac FC 0xF7
!sleep 100
!rdac FE 0xEF
!sleep 100
!setctrl 2 2
!sleep 100
!rdac E0 0x30
!sleep 100
!rdac E2 0x74
!sleep 100
!rdac E4 0x2E
!sleep 100
!rdac E6 0x10
!sleep 100
!rdac E8 0xF2
!sleep 100
!rdac EA 0x38
!sleep 100
!rdac EC 0xD5
!sleep 100
!rdac EE 0xED
!sleep 100
!rdac F0 0x5B
!sleep 100
!rdac F2 0xD2
!sleep 100
!rdac F4 0xF2
!sleep 100
!rdac F6 0x15
!sleep 100
!rdac F8 0x4C
!sleep 100
!rdac FA 0x4F
!sleep 100
!rdac FC 0x35
!sleep 100
!rdac FE 0x51
!sleep 100
!setctrl 2 3
!sleep 100
!rdac E0 0xF0
!sleep 100
!rdac E2 0x48
!sleep 100
!rdac E4 0xF5
!sleep 100
!rdac E6 0xFA
!sleep 100
!rdac E8 0xEE
!sleep 100
!rdac EA 0x5
!sleep 100
!rdac EC 0xE3
!sleep 100
!rdac EE 0xF8
!sleep 100
!rdac F8 0x0
!sleep 100
!rdac FA 0x39
!sleep 100
!rdac FC 0xB3
!sleep 100
!rdac FE 0x44
!sleep 100
!setctrl 3 0
!sleep 100
!rdac E0 0x2E
!sleep 100
!rdac E2 0x58
!sleep 100
!rdac E4 0x3
!sleep 100
!rdac E6 0x7A
!sleep 100
!rdac E8 0x0
!sleep 100
!rdac EA 0x41
!sleep 100
!rdac EC 0x18
!sleep 100
!rdac EE 0xAB
!sleep 100
!rdac F0 0x0
!sleep 100
!rdac F2 0x0
!sleep 100
!rdac F4 0xC
!sleep 100
!rdac F6 0xEF
!sleep 100
!rdac F8 0x0
!sleep 100
!rdac FA 0x0
!sleep 100
!rdac FC 0xC
!sleep 100
!rdac FE 0xD6
!sleep 100
!setctrl 3 1
!sleep 100
!rdac E4 0xE9
!sleep 100
!rdac E6 0x0
!sleep 100
!rdac EA 0x0
!sleep 100
!rdac EE 0x3C
!sleep 100
!rdac F0 0x51
!sleep 100
!rdac F2 0x0
!sleep 100
!rdac F4 0x34
!sleep 100
!rdac F6 0x7A
!sleep 100
!rdac F8 0x0
!sleep 100
!rdac FA 0x44
!sleep 100
!rdac FC 0x3B
!sleep 100
!rdac FE 0xDA
!sleep 100
!setctrl 3 2
!sleep 100
!rdac E0 0xF3
!sleep 100
!rdac E2 0x0
!sleep 100
!rdac E4 0x23
!sleep 100
!rdac E6 0x54
!sleep 100
!rdac E8 0x1
!sleep 100
!rdac EA 0x0
!sleep 100
!rdac EC 0x5E
!sleep 100
!rdac EE 0x95
!sleep 100
!rdac F0 0x21
!sleep 100
!rdac F2 0x0
!sleep 100
!rdac F4 0x66
!sleep 100
!rdac F6 0xF7
!sleep 100
!rdac F8 0xCC
!sleep 100
!rdac FA 0x17
!sleep 100
!rdac FC 0x91
!sleep 100
!rdac FE 0x69
!sleep 100
!setctrl 3 3
!sleep 100
!rdac E0 0x50
!sleep 100
!rdac E2 0xF9
!sleep 100
!rdac E4 0xC7
!sleep 100
!rdac E6 0x92
!sleep 100
!rdac E8 0x8
!sleep 100
!rdac EA 0x0
!sleep 100
!rdac EC 0xB3
!sleep 100
!rdac EE 0xFF
!sleep 100
!rdac F0 0x3E
!sleep 100
!rdac F2 0x4
!sleep 100
!rdac F4 0x21
!sleep 100
!rdac F6 0x17
!sleep 100
!SETdevice 1
!setctrl 0 0
!sleep 100
!rdac E0 0x0
!sleep 100
!rdac E2 0x5C
!sleep 100
!rdac E4 0x52
!sleep 100
!rdac E6 0xBA
!sleep 100
!rdac E8 0x0
!sleep 100
!rdac EA 0x31
!sleep 100
!rdac EC 0x7E
!sleep 100
!rdac EE 0x73
!sleep 100
!rdac F0 0x0
!sleep 100
!rdac F2 0x3A
!sleep 100
!rdac F4 0x17
!sleep 100
!rdac F6 0xC
!sleep 100
!rdac F8 0x0
!sleep 100
!rdac FA 0x6
!sleep 100
!rdac FC 0x40
!sleep 100
!rdac FE 0x59
!sleep 100
!setctrl 0 1
!sleep 100
!rdac E4 0x3E
!sleep 100
!rdac E6 0xFC
!sleep 100
!rdac EA 0xE
!sleep 100
!rdac EE 0x3D
!sleep 100
!rdac F0 0xD7
!sleep 100
!rdac F2 0x11
!sleep 100
!rdac F4 0x1B
!sleep 100
!rdac F6 0x0
!sleep 100
!rdac F8 0x8E
!sleep 100
!rdac FA 0x0
!sleep 100
!rdac FC 0x44
!sleep 100
!rdac FE 0x56
!sleep 100
!setctrl 0 2
!sleep 100
!rdac E0 0x95
!sleep 100
!rdac E2 0xF7
!sleep 100
!rdac E4 0xF1
!sleep 100
!rdac E6 0xE6
!sleep 100
!rdac E8 0x44
!sleep 100
!rdac EA 0xE8
!sleep 100
!rdac EC 0xE4
!sleep 100
!rdac EE 0xFF
!sleep 100
!rdac F0 0x41
!sleep 100
!rdac F2 0xFF
!sleep 100
!rdac F4 0x2C
!sleep 100
!rdac F6 0xF6
!sleep 100
!rdac F8 0x40
!sleep 100
!rdac FA 0x6E
!sleep 100
!rdac FC 0xD1
!sleep 100
!rdac FE 0xDB
!sleep 100
!setctrl 0 3
!sleep 100
!rdac E0 0xFF
!sleep 100
!rdac E2 0x31
!sleep 100
!rdac E8 0xF3
!sleep 100
!rdac EC 0xFF
!sleep 100
!rdac F0 0xF0
!sleep 100
!rdac F2 0xCC
!sleep 100
!rdac F4 0xF9
!sleep 100
!rdac F6 0xFF
!sleep 100
!rdac F8 0xD4
!sleep 100
!rdac FA 0xFC
!sleep 100
!rdac FC 0xF9
!sleep 100
!rdac FE 0xDF
!sleep 100
!setctrl 1 0
!sleep 100
!rdac E0 0xF8
!sleep 100
!rdac E2 0xBB
!sleep 100
!rdac E4 0xE9
!sleep 100
!rdac E6 0xF3
!sleep 100
!rdac E8 0xE2
!sleep 100
!rdac EA 0xA1
!sleep 100
!rdac EC 0x8B
!sleep 100
!rdac EE 0xE8
!sleep 100
!rdac F8 0x4B
!sleep 100
!rdac FA 0xEC
!sleep 100
!rdac FC 0xFC
!sleep 100
!rdac FE 0xDE
!sleep 100
!setctrl 1 1
!sleep 100
!rdac E0 0xE0
!sleep 100
!rdac E2 0x32
!sleep 100
!rdac E4 0xFB
!sleep 100
!rdac E6 0xF6
!sleep 100
!rdac E8 0x53
!sleep 100
!rdac EA 0xE
!sleep 100
!rdac EC 0xD0
!sleep 100
!rdac EE 0xE9
!sleep 100
!rdac F0 0xC4
!sleep 100
!rdac F2 0xD4
!sleep 100
!rdac F4 0xD6
!sleep 100
!rdac F6 0xF6
!sleep 100
!rdac F8 0xE9
!sleep 100
!rdac FA 0xCE
!sleep 100
!rdac FC 0x47
!sleep 100
!rdac FE 0xE8
!sleep 100
!setctrl 1 2
!sleep 100
!rdac E0 0x31
!sleep 100
!rdac E2 0xDC
!sleep 100
!rdac E4 0xE4
!sleep 100
!rdac E6 0xD8
!sleep 100
!rdac E8 0xA9
!sleep 100
!rdac EA 0x28
!sleep 100
!rdac EC 0x21
!sleep 100
!rdac EE 0x9E
!sleep 100
!rdac F0 0xFE
!sleep 100
!rdac F2 0x38
!sleep 100
!rdac F4 0xDA
!sleep 100
!rdac F6 0x61
!sleep 100
!rdac F8 0x1D
!sleep 100
!rdac FA 0x25
!sleep 100
!rdac FC 0xDE
!sleep 100
!rdac FE 0xC7
!sleep 100
!setctrl 1 3
!sleep 100
!rdac E0 0x4F
!sleep 100
!rdac E2 0x3
!sleep 100
!rdac E4 0x3B
!sleep 100
!rdac E6 0xE3
!sleep 100
!rdac E8 0x1C
!sleep 100
!rdac EA 0x49
!sleep 100
!rdac EC 0xFF
!sleep 100
!rdac EE 0x95
!sleep 100
!rdac F0 0x2C
!sleep 100
!rdac F2 0x8A
!sleep 100
!rdac F4 0xF4
!sleep 100
!rdac F6 0xE6
!sleep 100
!setctrl 2 0
!sleep 100
!rdac E0 0xE0
!sleep 100
!rdac E2 0xB9
!sleep 100
!rdac E4 0xF2
!sleep 100
!rdac E6 0xDB
!sleep 100
!rdac E8 0xEE
!sleep 100
!rdac EA 0xFB
!sleep 100
!rdac EC 0xEB
!sleep 100
!rdac EE 0xFF
!sleep 100
!rdac F0 0xFF
!sleep 100
!rdac F2 0xF0
!sleep 100
!rdac F4 0xFF
!sleep 100
!rdac F6 0xFD
!sleep 100
!rdac F8 0xED
!sleep 100
!rdac FA 0xF6
!sleep 100
!rdac FC 0xCF
!sleep 100
!rdac FE 0xF2
!sleep 100
!setctrl 2 1
!sleep 100
!rdac E0 0xA7
!sleep 100
!rdac E2 0xFC
!sleep 100
!rdac E4 0x0
!sleep 100
!rdac E6 0xFF
!sleep 100
!rdac E8 0xFC
!sleep 100
!rdac EA 0xFF
!sleep 100
!rdac EC 0xEE
!sleep 100
!rdac EE 0xFF
!sleep 100
!rdac F0 0xFC
!sleep 100
!rdac F2 0xFF
!sleep 100
!rdac F4 0xFC
!sleep 100
!rdac F6 0xEA
!sleep 100
!rdac F8 0xF0
!sleep 100
!rdac FA 0xEC
!sleep 100
!rdac FC 0xF3
!sleep 100
!rdac FE 0xEF
!sleep 100
!setctrl 2 2
!sleep 100
!rdac E0 0xE9
!sleep 100
!rdac E2 0xF2
!sleep 100
!rdac E4 0x87
!sleep 100
!rdac E6 0xFD
!sleep 100
!rdac E8 0x0
!sleep 100
!rdac EA 0xEF
!sleep 100
!rdac EC 0xE7
!sleep 100
!rdac EE 0xF9
!sleep 100
!rdac F0 0xF1
!sleep 100
!rdac F2 0x0
!sleep 100
!rdac F4 0xE9
!sleep 100
!rdac F6 0xF4
!sleep 100
!rdac F8 0xFF
!sleep 100
!rdac FA 0xFF
!sleep 100
!rdac FC 0xEC
!sleep 100
!rdac FE 0xEC
!sleep 100
!setctrl 2 3
!sleep 100
!rdac E0 0xFE
!sleep 100
!rdac E2 0xF5
!sleep 100
!rdac E4 0xEB
!sleep 100
!rdac E8 0xE9
!sleep 100
!rdac EA 0xED
!sleep 100
!rdac EC 0xF0
!sleep 100
!rdac EE 0xFB
!sleep 100
!rdac F0 0xF4
!sleep 100
!rdac F2 0xFE
!sleep 100
!rdac F4 0xF7
!sleep 100
!rdac F6 0xED
!sleep 100
!rdac F8 0xF2
!sleep 100
!rdac FA 0xEB
!sleep 100
!rdac FC 0xFA
!sleep 100
!rdac FE 0xFF
!sleep 100
!setctrl 3 0
!sleep 100
!rdac E0 0xF1
!sleep 100
!rdac E2 0xFF
!sleep 100
!rdac E4 0xF3
!sleep 100
!rdac E6 0xE9
!sleep 100
!rdac E8 0xFF
!sleep 100
!rdac EA 0xFE
!sleep 100
!rdac EC 0xF0
!sleep 100
!rdac EE 0xEF
!sleep 100
!rdac F0 0xFC
!sleep 100
!rdac F2 0xE9
!sleep 100
!rdac F4 0xF7
!sleep 100
!rdac F6 0x2D
!sleep 100
!rdac F8 0xFA
!sleep 100
!rdac FA 0xF5
!sleep 100
!rdac FC 0xFF
!sleep 100
!setctrl 3 1
!sleep 100
!rdac E0 0xFF
!sleep 100
!rdac E2 0xFF
!sleep 100
!rdac E4 0xEE
!sleep 100
!rdac E6 0xFA
!sleep 100
!rdac E8 0xFB
!sleep 100
!rdac EA 0xFF
!sleep 100
!rdac EC 0xFF
!sleep 100
!rdac EE 0xEB
!sleep 100
!rdac F0 0xF1
!sleep 100
!rdac F2 0xEF
!sleep 100
!rdac F4 0xF8
!sleep 100
!rdac F6 0xC5
!sleep 100
!rdac F8 0xED
!sleep 100
!rdac FA 0xFA
!sleep 100
!rdac FC 0xF2
!sleep 100
!rdac FE 0x68
!sleep 100
!setctrl 3 2
!sleep 100
!rdac E0 0xFF
!sleep 100
!rdac E2 0xFF
!sleep 100
!rdac E4 0xFF
!sleep 100
!rdac E6 0xF4
!sleep 100
!rdac E8 0xFF
!sleep 100
!rdac EA 0xFF
!sleep 100
!rdac EC 0xEA
!sleep 100
!rdac EE 0xFE
!sleep 100
!rdac F0 0xFF
!sleep 100
!rdac F2 0xEB
!sleep 100
!rdac F4 0xF0
!sleep 100
!rdac F6 0xF8
!sleep 100
!rdac F8 0xF8
!sleep 100
!rdac FA 0xF6
!sleep 100
!rdac FC 0xF3
!sleep 100
!rdac FE 0xEC
!sleep 100
!setctrl 3 3
!sleep 100
!rdac E0 0xFF
!sleep 100
!rdac E2 0xFA
!sleep 100
!rdac E4 0xF4
!sleep 100
!rdac E6 0xEC
!sleep 100
!rdac E8 0xFF
!sleep 100
!rdac EA 0xFF
!sleep 100
!rdac EC 0xEC
!sleep 100
!rdac EE 0xFA
!sleep 100
!rdac F0 0xFA
!sleep 100
!rdac F2 0xFF
!sleep 100
!rdac F4 0xEC
!sleep 100
!rdac F6 0xEC
!sleep 100
!rdac F8 0xFF
!sleep 100
!rdac FA 0xF5
!sleep 100
!rdac FC 0xFF
!sleep 100
!rdac FE 0xFF
!sleep 100
