1 1 0 0 -1575 188063.02146
1 2 0 1 -1419 14.56408
1 3 0 2 -1600 19783737.11370
1 4 0 3 -1445 29.03961
1 5 0 4 -1600 1918.47356
1 6 0 5 -1575 16635.01019
1 7 0 6 -1439 23.37492
1 8 0 7 -1600 42201.20340
1 9 0 8 -1600 54.00000
1 10 0 9 -1600 27.00000
1 18 1 0 -1466 0.75224
1 19 1 1 -1476 0.83115
1 20 1 2 -1263 2.06473
1 21 1 3 -1200 0.06659
1 22 1 4 -1431 0.56264
1 23 1 5 -1633 5.65492
1 24 1 6 -1627 2.68468
1 25 1 7 -1600 15389579.56810
1 26 1 8 -1600 778681.65466
1 27 1 9 -1412 3.82863
1 28 1 10 -1600 159.71400
1 35 2 0 -1315 0.20150
1 36 2 1 -1356 0.28859
1 37 2 2 -1348 0.27288
1 38 2 3 -1302 0.17881
1 39 2 4 -1408 0.46167
1 40 2 5 -1345 0.26142
1 41 2 6 -1384 0.38171
1 42 2 7 -1384 0.37878
1 43 2 8 -1362 0.29338
1 44 2 9 -1386 0.63999
1 45 2 10 -1600 1525412272.84000
1 46 2 11 -1455 11.55559
1 52 3 0 -1500 0.98510
1 53 3 1 -1282 0.14574
1 54 3 2 -1229 0.08570
1 55 3 3 -1375 0.34447
1 56 3 4 -1287 0.15436
1 57 3 5 -1344 0.25666
1 58 3 6 -1344 0.25993
1 59 3 7 -1301 0.17336
1 60 3 8 -1645 3.29305
1 61 3 9 -1441 0.61240
1 62 3 10 -1600 15147133.66800
1 63 3 11 -1590 852.48955
1 64 3 12 -1600 1360156907.00000
1 69 4 0 -1389 0.39060
1 70 4 1 -1439 0.60662
1 71 4 2 -1306 0.17903
1 72 4 3 -1439 0.60700
1 73 4 4 -1649 6.91686
1 74 4 5 -1508 1.06532
1 75 4 6 -1256 0.11619
1 76 4 7 -1441 0.66489
1 77 4 8 -1479 0.85239
1 78 4 9 -1471 0.79310
1 79 4 10 -1345 0.26359
1 80 4 11 -1517 2.30188
1 81 4 12 -1572 1.78041
1 82 4 13 -1600 47319280.55740
1 86 5 0 -1476 0.82753
1 87 5 1 -1233 0.09140
1 88 5 2 -1292 0.16070
1 89 5 3 -1236 0.09288
1 90 5 4 -1405 0.45017
1 91 5 5 -1340 0.24871
1 92 5 6 -1526 1.22822
1 93 5 7 -1463 0.74907
1 94 5 8 -1336 0.24430
1 95 5 9 -1529 1.27079
1 96 5 10 -1440 0.60762
1 97 5 11 -1553 1.54407
1 98 5 12 -1566 1.70168
1 99 5 13 -1386 2.45574
1 100 5 14 -1600 21543181776.10000
1 103 6 0 -1287 0.14930
1 104 6 1 -1200 0.06472
1 105 6 2 -1243 0.10054
1 106 6 3 -1147 0.03847
1 107 6 4 -1223 0.08183
1 108 6 5 -1306 0.18817
1 109 6 6 -1580 1.85568
1 110 6 7 -1458 0.71030
1 111 6 8 -1402 0.43121
1 112 6 9 -1366 0.31888
1 113 6 10 -1594 2.11002
1 114 6 11 -1536 1.34781
1 115 6 12 -1504 1.04988
1 116 6 13 -1420 0.50752
1 117 6 14 -1252 0.10952
1 118 6 15 -1600 12992.66479
1 120 7 0 -1228 0.17473
1 121 7 1 -1281 0.14563
1 122 7 2 -1331 0.22885
1 123 7 3 -1346 0.26926
1 124 7 4 -1381 0.36025
1 125 7 5 -1362 0.29930
1 126 7 6 -1488 0.91535
1 127 7 7 -1436 0.58232
1 128 7 8 -1363 0.30992
1 129 7 9 -1326 0.22163
1 130 7 10 -1600 51172579.13490
1 131 7 11 -1613 42.66724
1 132 7 12 -1600 0.11815
1 133 7 13 -1677 33.44051
1 134 7 14 -1621 4.09255
1 135 7 15 -1600 118518564.20000
1 136 7 16 -1600 1605542046.86000
1 137 8 0 -1354 0.27904
1 138 8 1 -1398 0.41377
1 139 8 2 -1333 0.23270
1 140 8 3 -1240 0.09662
1 141 8 4 -1300 0.17363
1 142 8 5 -1460 0.71671
1 143 8 6 -1387 0.38402
1 144 8 7 -1402 0.43238
1 145 8 8 -1376 0.34615
1 146 8 9 -1508 1.08558
1 147 8 10 -1387 0.37676
1 148 8 11 -1322 0.21214
1 149 8 12 -1356 0.28657
1 150 8 13 -1497 0.99059
1 151 8 14 -1429 0.55329
1 152 8 15 -1431 0.55488
1 153 8 16 -1600 162785774.25100
1 162 9 8 -1459 0.71040
1 163 9 9 -1453 0.68793
1 164 9 10 -1344 0.26255
1 165 9 11 -1570 1.77083
1 166 9 12 -1416 0.49249
1 167 9 13 -1499 0.98487
1 168 9 14 -1686 12.79036
1 169 9 15 -1696 7.57601
1 170 9 16 -1600 4153690009.30000
1 179 10 8 -1429 0.54618
1 180 10 9 -1546 1.45748
1 181 10 10 -1550 1.52724
1 182 10 11 -1584 1.94134
1 183 10 12 -1628 2.73180
1 184 10 13 -1532 1.29485
1 185 10 14 -1416 0.49964
1 186 10 15 -1482 0.85632
1 187 10 16 -1600 2154579540.85000
1 196 11 8 -1591 2.05897
1 197 11 9 -1405 0.44669
1 198 11 10 -1590 2.04324
1 199 11 11 -1569 1.73396
1 200 11 12 -1567 1.70587
1 201 11 13 -1560 1.62442
1 202 11 14 -1339 0.24374
1 203 11 15 -1560 1.62272
1 204 11 16 -1600 2282322355.32000
1 213 12 8 -1484 0.86681
1 214 12 9 -1438 0.59500
1 215 12 10 -1486 0.89805
1 216 12 11 -1373 0.34127
1 217 12 12 -1422 0.51441
1 218 12 13 -1461 0.72646
1 219 12 14 -1542 1.39613
1 220 12 15 -1617 2.50644
1 221 12 16 -1600 85115.91565
1 230 13 8 -1471 0.79164
1 231 13 9 -1445 0.62744
1 232 13 10 -1390 0.38614
1 233 13 11 -1423 0.53629
1 234 13 12 -1629 5.45013
1 235 13 13 -1464 0.74718
1 236 13 14 -1465 0.75628
1 237 13 15 -1413 0.48145
1 238 13 16 -1600 3424557633.32000
1 247 14 8 -1584 1.93935
1 248 14 9 -1422 0.52757
1 249 14 10 -1445 0.63461
1 250 14 11 -1472 0.79756
1 251 14 12 -1485 0.88991
1 252 14 13 -1648 3.21362
1 253 14 14 -1521 1.19305
1 254 14 15 -1565 1.69248
1 255 14 16 -1545 72572.88833
1 264 15 8 -1529 1.25126
1 265 15 9 -1470 0.78360
1 266 15 10 -1494 0.94184
1 267 15 11 -1325 0.22042
1 268 15 12 -1487 0.91101
1 269 15 13 -1477 0.82196
1 270 15 14 -1521 1.19922
1 271 15 15 -1507 1.07693
1 272 15 16 -1525 3818.94096
1 281 16 8 -1398 0.42248
1 282 16 9 -1640 5.93320
1 283 16 10 -1441 0.62112
1 284 16 11 -1423 0.52453
1 285 16 12 -1427 0.54488
1 286 16 13 -1338 0.24639
1 287 16 14 -1485 0.88944
1 288 16 15 -1518 1.14995
1 289 16 16 -1600 4687736840.04000
1 298 17 8 -1672 3.75038
1 299 17 9 -1488 0.92801
1 300 17 10 -1554 1.53187
1 301 17 11 -1488 0.90971
1 302 17 12 -1411 0.47129
1 303 17 13 -1432 0.57251
1 304 17 14 -1383 0.36932
1 305 17 15 -1419 0.51602
1 306 17 16 -1600 442759989.43800
1 315 18 8 -1636 2.89163
1 316 18 9 -1458 0.69638
1 317 18 10 -1575 1.79374
1 318 18 11 -1381 0.36239
1 319 18 12 -1446 0.64289
1 320 18 13 -1607 2.33378
1 321 18 14 -1453 0.67272
1 322 18 15 -1588 2.01944
1 323 18 16 -1550 78.45049
1 332 19 8 -1473 0.80154
1 333 19 9 -1394 0.40833
1 334 19 10 -1404 0.45085
1 335 19 11 -1608 2.34237
1 336 19 12 -1282 0.14546
1 337 19 13 -1660 3.43884
1 338 19 14 -1429 0.55406
1 339 19 15 -1496 0.96841
1 340 19 16 -1358 0.40627
1 349 20 8 -1423 0.52712
1 350 20 9 -1541 1.40565
1 351 20 10 -1338 0.24451
1 352 20 11 -1248 0.10570
1 353 20 12 -1359 0.29808
1 354 20 13 -1518 1.16317
1 355 20 14 -1304 0.18133
1 356 20 15 -1627 2.75014
1 357 20 16 -1473 151.99925
1 366 21 8 -1456 0.68953
1 367 21 9 -1280 0.14326
1 368 21 10 -1540 1.37729
1 369 21 11 -1361 0.30104
1 370 21 12 -1339 0.24486
1 371 21 13 -1564 295.76833
1 372 21 14 -1428 0.55084
1 373 21 15 -1476 0.82920
1 374 21 16 -1600 45868.13476
1 383 22 8 -1366 0.31799
1 384 22 9 -1213 0.07408
1 385 22 10 -1436 0.58484
1 386 22 11 -1534 1.31645
1 387 22 12 -1348 0.27812
1 388 22 13 -1343 0.26078
1 389 22 14 -1499 0.97933
1 390 22 15 -1529 1.28021
1 391 22 16 -1313 0.04287
1 400 23 8 -1498 0.99972
1 401 23 9 -1460 0.71209
1 402 23 10 -1352 0.27929
1 403 23 11 -1382 0.36183
1 404 23 12 -1143 0.03642
1 405 23 13 -1391 0.39320
1 406 23 14 -1292 0.16257
1 407 23 15 -1580 1.89090
1 408 23 16 -1352 2.16218
1 417 24 8 -1355 0.28809
1 418 24 9 -1236 0.09346
1 419 24 10 -1360 0.30462
1 420 24 11 -1521 1.28602
1 421 24 12 -1366 0.32102
1 422 24 13 -1508 1.05383
1 423 24 14 -1292 0.15995
1 424 24 15 -1433 0.56701
1 425 24 16 -1600 788522386.51200
1 426 25 0 -1435 0.58904
1 427 25 1 -1585 1.99479
1 428 25 2 -1538 1.36241
1 429 25 3 -1484 0.88323
1 430 25 4 -1623 2.64909
1 431 25 5 -1461 0.71640
1 432 25 6 -1622 2.59006
1 433 25 7 -1517 1.14921
1 434 25 8 -1343 0.26350
1 435 25 9 -1501 1.00842
1 436 25 10 -1411 0.46540
1 437 25 11 -1373 0.33758
1 438 25 12 -1300 0.17385
1 439 25 13 -1206 0.06985
1 440 25 14 -1527 1.23873
1 441 25 15 -1315 0.19638
1 442 25 16 -1334 0.57621
1 443 26 0 -1555 1.55837
1 444 26 1 -1610 2.39439
1 445 26 2 -1405 0.44606
1 446 26 3 -1430 0.55464
1 447 26 4 -1340 0.24892
1 448 26 5 -1496 0.96193
1 449 26 6 -1611 5.18571
1 450 26 7 -1462 0.73012
1 451 26 8 -1339 0.25113
1 452 26 9 -1262 0.12093
1 453 26 10 -1249 0.10599
1 454 26 11 -1368 0.32214
1 455 26 12 -1315 0.20335
1 456 26 13 -1348 0.27080
1 457 26 14 -1330 0.22938
1 458 26 15 -1396 0.40974
1 459 26 16 -1401 85.58849
1 460 27 0 -1520 1.18143
1 461 27 1 -1256 0.11350
1 462 27 2 -1433 0.57111
1 463 27 3 -1453 0.66236
1 464 27 4 -1322 0.21455
1 465 27 5 -1450 0.67124
1 466 27 6 -1442 0.61954
1 467 27 7 -1375 0.34614
1 468 27 8 -1601 2.19988
1 469 27 9 -1475 0.80024
1 470 27 10 -1367 0.32631
1 471 27 11 -1170 0.04780
1 472 27 12 -1164 0.04564
1 473 27 13 -1305 0.17924
1 474 27 14 -1572 61.64934
1 475 27 15 -1385 2.33339
1 477 28 0 -1184 0.05584
1 478 28 1 -1447 0.64136
1 479 28 2 -1179 0.05247
1 480 28 3 -1312 0.19674
1 481 28 4 -1272 0.13385
1 482 28 5 -1416 0.48949
1 483 28 6 -1275 140.69548
1 484 28 7 -1175 0.05113
1 485 28 8 -1559 1.58838
1 486 28 9 -1220 0.07823
1 487 28 10 -1212 0.07416
1 488 28 11 -1285 0.15124
1 489 28 12 -1308 0.18887
1 490 28 13 -1465 0.73044
1 491 28 14 -1440 20.61372
1 494 29 0 -1448 0.65969
1 495 29 1 -1401 0.43830
1 496 29 2 -1300 0.17248
1 497 29 3 -1216 0.07656
1 498 29 4 -1365 0.31833
1 499 29 5 -1206 0.07041
1 500 29 6 -1286 0.14993
1 501 29 7 -1210 0.07176
1 502 29 8 -1316 0.20314
1 503 29 9 -1390 0.39588
1 504 29 10 -1202 0.06702
1 505 29 11 -1314 0.39683
1 506 29 12 -1389 0.38945
1 507 29 13 -1359 5.14642
1 511 30 0 -1333 0.23402
1 512 30 1 -1384 0.36598
1 513 30 2 -1220 0.07826
1 514 30 3 -1306 0.18064
1 515 30 4 -1235 0.09263
1 516 30 5 -1290 0.15635
1 517 30 6 -1302 0.17998
1 518 30 7 -1363 0.31451
1 519 30 8 -1293 0.16156
1 520 30 9 -1449 0.65235
1 521 30 10 -1252 0.11076
1 522 30 11 -941 3.41148
1 523 30 12 -1600 0.00000
1 528 31 0 -1525 42.50768
1 529 31 1 -1303 0.17709
1 530 31 2 -1228 0.08604
1 531 31 3 -1212 0.07343
1 532 31 4 -1224 0.08434
1 533 31 5 -1390 0.38950
1 534 31 6 -1323 0.21754
1 535 31 7 -1286 0.15409
1 536 31 8 -1218 0.07934
1 537 31 9 -1412 0.46715
1 538 31 10 -1406 0.45633
1 539 31 11 -1213 0.00047
1 545 32 0 -1191 0.05950
1 546 32 1 -1427 0.54039
1 547 32 2 -1378 0.36154
1 548 32 3 -1525 1.23525
1 549 32 4 -1161 0.31776
1 550 32 5 -1264 0.32425
1 551 32 6 -1433 0.56788
1 552 32 7 -1285 0.15048
1 553 32 8 -1256 0.11420
1 554 32 9 -1291 0.16155
1 555 32 10 -1303 0.01800
1 562 33 0 -1321 0.12192
1 563 33 1 -1203 0.00057
1 564 33 2 -1322 0.19283
1 565 33 3 -1165 0.00017
1 566 33 4 -952 117.58240
1 567 33 5 -1353 0.90782
1 568 33 6 -1397 1.16317
1 569 33 7 -1328 0.26831
1 570 33 8 -1203 0.00167
1 571 33 9 -1239 0.02157
2 1 0 0 -1600 206995.91760
2 2 0 1 -1564 389264.40348
2 3 0 2 -1600 473674018.02800
2 4 0 3 -1562 88672.52442
2 5 0 4 -1600 5739335.87664
2 6 0 5 -1600 5073559.86087
2 7 0 6 -1600 508759997.91500
2 8 0 7 -1600 806774.93878
2 9 0 8 -1600 234908.61699
2 10 0 9 -1600 1846405468.46000
2 18 1 0 -1304 0.17729
2 19 1 1 -1226 0.08597
2 20 1 2 -1225 0.84073
2 21 1 3 -1263 0.12241
2 22 1 4 -1304 0.17773
2 23 1 5 -1456 0.69189
2 24 1 6 -1531 1.28319
2 25 1 7 -1327 0.22353
2 26 1 8 -1472 0.79083
2 27 1 9 -1440 0.59783
2 28 1 10 -1423 14.51585
2 35 2 0 -1596 17.15873
2 36 2 1 -1344 0.26214
2 37 2 2 -1377 1.70058
2 38 2 3 -1305 0.18599
2 39 2 4 -1245 0.10290
2 40 2 5 -1290 0.16053
2 41 2 6 -1478 0.84073
2 42 2 7 -1362 0.30374
2 43 2 8 -1382 0.37038
2 44 2 9 -1625 2.65871
2 45 2 10 -1648 5.20579
2 46 2 11 -1431 3074.45479
2 52 3 0 -1410 0.46574
2 53 3 1 -1200 0.06441
2 54 3 2 -1340 0.25075
2 55 3 3 -1206 0.06982
2 56 3 4 -1249 0.10658
2 57 3 5 -1321 0.20839
2 58 3 6 -1448 0.65824
2 59 3 7 -1448 0.64927
2 60 3 8 -1456 0.69411
2 61 3 9 -1565 1.66885
2 62 3 10 -1637 3.98712
2 63 3 11 -1394 0.40688
2 64 3 12 -1600 99970.48973
2 69 4 0 -1429 0.54811
2 70 4 1 -1351 0.28223
2 71 4 2 -1205 0.06812
2 72 4 3 -1243 0.09915
2 73 4 4 -1354 0.29010
2 74 4 5 -1247 0.10568
2 75 4 6 -1528 5.36833
2 76 4 7 -1371 0.32952
2 77 4 8 -1296 0.16836
2 78 4 9 -1429 1.39465
2 79 4 10 -1536 1.35406
2 80 4 11 -1413 0.95962
2 81 4 12 -1392 0.41015
2 82 4 13 -1451 2343.38905
2 86 5 0 -1355 0.28414
2 87 5 1 -1215 0.07324
2 88 5 2 -1253 0.11171
2 89 5 3 -1425 0.53078
2 90 5 4 -1210 0.07378
2 91 5 5 -1381 0.36476
2 92 5 6 -1191 0.05975
2 93 5 7 -1402 0.43539
2 94 5 8 -1480 0.85038
2 95 5 9 -1561 1.63853
2 96 5 10 -1449 0.65842
2 97 5 11 -1336 0.24180
2 98 5 12 -1456 0.70236
2 99 5 13 -1674 6.39534
2 100 5 14 -1600 56994.15916
2 103 6 0 -1379 0.35365
2 104 6 1 -1180 0.05243
2 105 6 2 -1236 0.09443
2 106 6 3 -1232 0.09080
2 107 6 4 -1296 0.17998
2 108 6 5 -1212 0.07533
2 109 6 6 -1265 0.12681
2 110 6 7 -1334 0.24082
2 111 6 8 -1248 0.10451
2 112 6 9 -1453 0.67997
2 113 6 10 -1433 0.56470
2 114 6 11 -1371 0.84244
2 115 6 12 -1238 0.09609
2 116 6 13 -1368 0.32811
2 117 6 14 -1252 0.10931
2 118 6 15 -1600 18673075.05530
2 120 7 0 -1236 0.09321
2 121 7 1 -1362 0.30705
2 122 7 2 -1296 0.16739
2 123 7 3 -1149 0.03822
2 124 7 4 -1160 0.04293
2 125 7 5 -1319 0.20640
2 126 7 6 -1264 0.12588
2 127 7 7 -1400 0.43143
2 128 7 8 -1558 1.60552
2 129 7 9 -1596 2.13247
2 130 7 10 -1419 0.51899
2 131 7 11 -1357 0.28608
2 132 7 12 -1548 1.49744
2 133 7 13 -1502 1.01321
2 134 7 14 -1357 0.29167
2 135 7 15 -1573 1.77576
2 136 7 16 -1600 3711338546.54000
2 137 8 0 -1295 0.16620
2 138 8 1 -1562 1.64153
2 139 8 2 -1215 0.07627
2 140 8 3 -1254 0.11039
2 141 8 4 -1305 0.18327
2 142 8 5 -1479 0.84244
2 143 8 6 -1362 308.79382
2 144 8 7 -1569 13.83282
2 145 8 8 -1295 0.16478
2 146 8 9 -1525 1.23110
2 147 8 10 -1316 0.20509
2 148 8 11 -1434 0.58114
2 149 8 12 -1549 1.50306
2 150 8 13 -1340 1.34104
2 151 8 14 -1422 0.53258
2 152 8 15 -1528 1.24426
2 153 8 16 -1571 24964.61439
2 162 9 8 -1597 2.14479
2 163 9 9 -1510 1.09378
2 164 9 10 -1305 0.17930
2 165 9 11 -1654 3.33727
2 166 9 12 -1547 1.46434
2 167 9 13 -1697 7.59553
2 168 9 14 -1539 1.36569
2 169 9 15 -1483 0.87609
2 170 9 16 -1373 6.59753
2 179 10 8 -1642 10.10756
2 180 10 9 -1393 0.40412
2 181 10 10 -1340 0.25298
2 182 10 11 -1305 0.18473
2 183 10 12 -1371 0.33089
2 184 10 13 -1440 0.61166
2 185 10 14 -1403 0.45054
2 186 10 15 -1522 1.18254
2 187 10 16 -1600 160488684.25800
2 196 11 8 -1659 3.43996
2 197 11 9 -1549 1.48591
2 198 11 10 -1422 0.51956
2 199 11 11 -1376 0.34429
2 200 11 12 -1384 0.37079
2 201 11 13 -1267 0.12639
2 202 11 14 -1518 1.15554
2 203 11 15 -1328 0.22234
2 204 11 16 -1600 5036544375.71000
2 213 12 8 -1385 0.37774
2 214 12 9 -1501 1.00137
2 215 12 10 -1342 0.24992
2 216 12 11 -1486 0.89048
2 217 12 12 -1359 0.29923
2 218 12 13 -1455 0.68198
2 219 12 14 -1413 0.48444
2 220 12 15 -1598 75.40731
2 221 12 16 -1581 2648536.80967
2 230 13 8 -1525 1.20862
2 231 13 9 -1639 5.94113
2 232 13 10 -1299 0.17483
2 233 13 11 -1318 0.20922
2 234 13 12 -1547 1.45944
2 235 13 13 -1323 0.21454
2 236 13 14 -1348 0.26822
2 237 13 15 -1631 4.19436
2 238 13 16 -1600 29062546.17690
2 247 14 8 -1588 1.98966
2 248 14 9 -1414 0.48480
2 249 14 10 -1538 1.37108
2 250 14 11 -1428 0.55233
2 251 14 12 -1429 0.55213
2 252 14 13 -1476 0.80546
2 253 14 14 -1517 1.14028
2 254 14 15 -1513 1.12074
2 255 14 16 -1600 2016593.26277
2 264 15 8 -1418 0.50454
2 265 15 9 -1367 0.32498
2 266 15 10 -1343 0.27713
2 267 15 11 -1450 0.65546
2 268 15 12 -1336 0.24376
2 269 15 13 -1456 0.68564
2 270 15 14 -1292 0.16354
2 271 15 15 -1371 0.32679
2 272 15 16 -1427 2.62435
2 281 16 8 -1524 1.21987
2 282 16 9 -1258 0.11751
2 283 16 10 -1485 0.87923
2 284 16 11 -1667 5.36600
2 285 16 12 -1302 0.17857
2 286 16 13 -1257 0.11555
2 287 16 14 -1445 0.64172
2 288 16 15 -1462 0.73812
2 289 16 16 -1470 7.30264
2 298 17 8 -1313 0.19462
2 299 17 9 -1360 0.29850
2 300 17 10 -1331 0.23511
2 301 17 11 -1379 0.35128
2 302 17 12 -1358 0.30021
2 303 17 13 -1396 0.41636
2 304 17 14 -1505 1.04859
2 305 17 15 -1432 0.56295
2 306 17 16 -1432 1.54753
2 315 18 8 -1555 1.55528
2 316 18 9 -1461 0.72799
2 317 18 10 -1500 0.99816
2 318 18 11 -1403 0.44491
2 319 18 12 -1191 0.05870
2 320 18 13 -1621 5.14872
2 321 18 14 -1461 0.71971
2 322 18 15 -1537 1.34022
2 323 18 16 -1600 577939.18540
2 332 19 8 -1316 0.20394
2 333 19 9 -1464 0.75104
2 334 19 10 -1317 0.20535
2 335 19 11 -1357 0.28919
2 336 19 12 -1305 2.18137
2 337 19 13 -1456 0.68521
2 338 19 14 -1384 0.37637
2 339 19 15 -1431 0.56247
2 340 19 16 -1600 1145273.01526
2 349 20 8 -1384 0.36833
2 350 20 9 -1609 4.75845
2 351 20 10 -1371 0.33691
2 352 20 11 -1501 1.02234
2 353 20 12 -1426 0.54174
2 354 20 13 -1414 0.48839
2 355 20 14 -1324 0.21743
2 356 20 15 -1498 0.97629
2 357 20 16 -1600 3550083.09076
2 366 21 8 -1664 3.59994
2 367 21 9 -1377 0.35068
2 368 21 10 -1534 1.33069
2 369 21 11 -1251 0.11001
2 370 21 12 -1395 0.41546
2 371 21 13 -1485 0.88605
2 372 21 14 -1434 0.56845
2 373 21 15 -1385 0.38294
2 374 21 16 -1600 1146.11986
2 383 22 8 -1390 0.40282
2 384 22 9 -1508 1.04568
2 385 22 10 -1380 0.35965
2 386 22 11 -1351 0.27348
2 387 22 12 -1393 0.40573
2 388 22 13 -1332 0.23389
2 389 22 14 -1328 0.22459
2 390 22 15 -1614 2.43549
2 391 22 16 -1514 10.87107
2 400 23 8 -1405 0.44417
2 401 23 9 -1417 0.50448
2 402 23 10 -1167 0.04637
2 403 23 11 -1470 0.79559
2 404 23 12 -1420 0.51915
2 405 23 13 -1432 0.56857
2 406 23 14 -1624 2.59215
2 407 23 15 -1436 0.58017
2 408 23 16 -1593 2940.18630
2 417 24 8 -1491 0.93651
2 418 24 9 -1521 1.18761
2 419 24 10 -1323 0.21075
2 420 24 11 -1419 0.50518
2 421 24 12 -1295 0.16221
2 422 24 13 -1467 0.75739
2 423 24 14 -1338 0.24606
2 424 24 15 -1469 0.77591
2 425 24 16 -1597 257331.15881
2 426 25 0 -1666 62.46095
2 427 25 1 -1664 3.63435
2 428 25 2 -1536 365.78535
2 429 25 3 -1444 0.63069
2 430 25 4 -1624 11.38088
2 431 25 5 -1453 0.66672
2 432 25 6 -1573 1.77749
2 433 25 7 -1392 0.40957
2 434 25 8 -1418 0.50695
2 435 25 9 -1359 0.30331
2 436 25 10 -1339 0.25075
2 437 25 11 -1390 0.38664
2 438 25 12 -1288 0.15835
2 439 25 13 -1396 0.41049
2 440 25 14 -1340 0.25073
2 441 25 15 -1387 0.38420
2 442 25 16 -1600 97948638.99680
2 443 26 0 -1410 0.47279
2 444 26 1 -1324 0.22094
2 445 26 2 -1260 0.11723
2 446 26 3 -1371 0.33003
2 447 26 4 -1263 0.12389
2 448 26 5 -1468 0.77118
2 449 26 6 -1259 0.11607
2 450 26 7 -1325 0.21909
2 451 26 8 -1523 1.19918
2 452 26 9 -1333 0.23405
2 453 26 10 -1300 0.17505
2 454 26 11 -1326 0.22004
2 455 26 12 -1356 0.28656
2 456 26 13 -1403 0.44969
2 457 26 14 -1348 0.27237
2 458 26 15 -1434 0.56946
2 459 26 16 -1587 31719.58761
2 460 27 0 -1350 0.27783
2 461 27 1 -1416 0.49424
2 462 27 2 -1243 0.10269
2 463 27 3 -1257 0.11427
2 464 27 4 -1220 0.07931
2 465 27 5 -1307 0.18566
2 466 27 6 -1568 1.71155
2 467 27 7 -1269 0.12880
2 468 27 8 -1198 0.06384
2 469 27 9 -1271 0.13364
2 470 27 10 -1220 0.08230
2 471 27 11 -1415 0.48945
2 472 27 12 -1154 0.03969
2 473 27 13 -1293 0.16048
2 474 27 14 -1193 0.14129
2 475 27 15 -1401 1.84343
2 477 28 0 -1421 0.51938
2 478 28 1 -1446 0.63990
2 479 28 2 -1233 0.09108
2 480 28 3 -1225 0.08373
2 481 28 4 -1291 0.16016
2 482 28 5 -1196 0.06375
2 483 28 6 -1224 0.08247
2 484 28 7 -1268 0.12640
2 485 28 8 -1260 0.11906
2 486 28 9 -1344 0.25616
2 487 28 10 -1298 0.17009
2 488 28 11 -1238 0.09598
2 489 28 12 -1241 0.09658
2 490 28 13 -1253 0.11009
2 491 28 14 -1278 0.27262
2 494 29 0 -1227 0.08511
2 495 29 1 -1403 0.44007
2 496 29 2 -1246 0.10283
2 497 29 3 -1334 0.24404
2 498 29 4 -1282 0.14504
2 499 29 5 -1393 0.47034
2 500 29 6 -1213 0.07484
2 501 29 7 -1351 0.28102
2 502 29 8 -1273 0.13247
2 503 29 9 -1255 0.11188
2 504 29 10 -1154 0.04067
2 505 29 11 -1362 0.31183
2 506 29 12 -1345 0.26431
2 507 29 13 -1256 0.22957
2 511 30 0 -1332 0.23377
2 512 30 1 -1354 0.28791
2 513 30 2 -1291 0.15872
2 514 30 3 -1250 0.10795
2 515 30 4 -1408 0.45811
2 516 30 5 -1336 0.24611
2 517 30 6 -1303 0.17820
2 518 30 7 -1217 0.07629
2 519 30 8 -1227 0.08619
2 520 30 9 -1309 0.18590
2 521 30 10 -1291 0.16110
2 522 30 11 -1398 0.42978
2 523 30 12 -1324 0.26624
2 528 31 0 -1270 0.13117
2 529 31 1 -1224 0.08245
2 530 31 2 -1224 0.08479
2 531 31 3 -1405 0.44744
2 532 31 4 -1224 0.08127
2 533 31 5 -1276 0.14116
2 534 31 6 -1335 0.24265
2 535 31 7 -1241 0.09894
2 536 31 8 -1284 0.14785
2 537 31 9 -1344 0.25691
2 538 31 10 -1373 0.33016
2 539 31 11 -1370 0.47483
2 545 32 0 -1138 0.03455
2 546 32 1 -1303 0.18260
2 547 32 2 -1215 0.07631
2 548 32 3 -1254 0.11108
2 549 32 4 -1394 0.40627
2 550 32 5 -1240 0.09871
2 551 32 6 -1242 0.09923
2 552 32 7 -1196 0.06282
2 553 32 8 -1422 0.51610
2 554 32 9 -1357 0.29090
2 555 32 10 -1383 0.61347
2 562 33 0 -1287 0.07342
2 563 33 1 -1364 0.27871
2 564 33 2 -1206 0.00281
2 565 33 3 -1273 0.15002
2 566 33 4 -1230 0.00296
2 567 33 5 -1292 0.01932
2 568 33 6 -1307 0.03730
2 569 33 7 -1344 0.20434
2 570 33 8 -1246 0.08635
2 571 33 9 -1219 0.00253
