1 1 0 0 -1600 227679.20274
1 2 0 1 -1432 16.29092
1 3 0 2 -1600 14388172.44630
1 4 0 3 -1447 29.51180
1 5 0 4 -1600 959.23678
1 6 0 5 -1600 20163.64872
1 7 0 6 -1447 25.02668
1 8 0 7 -1600 42243.44685
1 9 0 8 -1600 5.40000
1 10 0 9 -1600 5.40000
1 18 1 0 -1350 0.27394
1 19 1 1 -1535 1.33841
1 20 1 2 -1283 2.49363
1 21 1 3 -1170 0.04907
1 22 1 4 -1475 0.81189
1 23 1 5 -1698 4.57148
1 24 1 6 -1589 2.00949
1 25 1 7 -1600 13347423.73640
1 26 1 8 -1600 641946.95355
1 27 1 9 -1367 2.56783
1 28 1 10 -1600 15.97140
1 35 2 0 -1274 0.13624
1 36 2 1 -1365 0.31334
1 37 2 2 -1367 0.32370
1 38 2 3 -1328 0.22749
1 39 2 4 -1426 0.53997
1 40 2 5 -1372 0.33472
1 41 2 6 -1395 0.41900
1 42 2 7 -1454 0.69120
1 43 2 8 -1342 0.24592
1 44 2 9 -1378 0.59534
1 45 2 10 -1600 643091177.42100
1 46 2 11 -1451 11.17562
1 52 3 0 -1496 0.94995
1 53 3 1 -1246 0.10256
1 54 3 2 -1232 0.08817
1 55 3 3 -1356 0.29069
1 56 3 4 -1284 0.15060
1 57 3 5 -1351 0.27362
1 58 3 6 -1365 0.31392
1 59 3 7 -1419 0.50248
1 60 3 8 -1623 2.79072
1 61 3 9 -1414 0.48411
1 62 3 10 -1597 14371094.56170
1 63 3 11 -1600 920.61506
1 64 3 12 -1600 680078453.50200
1 69 4 0 -1418 0.50400
1 70 4 1 -1414 0.49000
1 71 4 2 -1291 0.15595
1 72 4 3 -1435 0.58818
1 73 4 4 -1649 3.45843
1 74 4 5 -1425 0.53266
1 75 4 6 -1255 0.11481
1 76 4 7 -1459 0.77133
1 77 4 8 -1436 0.59276
1 78 4 9 -1534 1.32184
1 79 4 10 -1362 0.30829
1 80 4 11 -1540 2.75674
1 81 4 12 -1623 2.63764
1 82 4 13 -1600 23659640.27870
1 86 5 0 -1471 0.79114
1 87 5 1 -1237 0.09551
1 88 5 2 -1272 0.13226
1 89 5 3 -1258 0.11538
1 90 5 4 -1394 0.40850
1 91 5 5 -1364 0.30972
1 92 5 6 -1556 1.56461
1 93 5 7 -1463 0.74609
1 94 5 8 -1344 0.26269
1 95 5 9 -1544 1.43107
1 96 5 10 -1426 0.53724
1 97 5 11 -1572 1.78919
1 98 5 12 -1545 1.44701
1 99 5 13 -1396 2.68094
1 100 5 14 -1600 11459139242.60000
1 103 6 0 -1314 0.19290
1 104 6 1 -1218 0.07770
1 105 6 2 -1243 0.10034
1 106 6 3 -1130 0.03214
1 107 6 4 -1229 0.08696
1 108 6 5 -1323 0.21983
1 109 6 6 -1554 1.51484
1 110 6 7 -1455 0.69163
1 111 6 8 -1413 0.47438
1 112 6 9 -1376 0.34812
1 113 6 10 -1627 2.70516
1 114 6 11 -1535 1.33844
1 115 6 12 -1513 1.13012
1 116 6 13 -1451 0.66083
1 117 6 14 -1393 0.40265
1 118 6 15 -1561 7789.36738
1 120 7 0 -1270 0.26394
1 121 7 1 -1329 0.22755
1 122 7 2 -1340 0.24794
1 123 7 3 -1342 0.25990
1 124 7 4 -1409 0.46068
1 125 7 5 -1388 0.37791
1 126 7 6 -1494 0.96454
1 127 7 7 -1431 0.55939
1 128 7 8 -1343 0.25891
1 129 7 9 -1322 0.21331
1 130 7 10 -1600 19151414.34690
1 131 7 11 -1630 48.43047
1 132 7 12 -1600 0.02363
1 133 7 13 -1638 25.14324
1 134 7 14 -1625 4.23221
1 135 7 15 -1600 59259282.10020
1 136 7 16 -1600 802771023.42900
1 137 8 0 -1461 0.70822
1 138 8 1 -1440 0.59450
1 139 8 2 -1346 0.26234
1 140 8 3 -1270 0.12917
1 141 8 4 -1346 0.26631
1 142 8 5 -1494 0.95307
1 143 8 6 -1413 0.48063
1 144 8 7 -1426 0.53118
1 145 8 8 -1393 0.40064
1 146 8 9 -1500 1.01456
1 147 8 10 -1427 0.53214
1 148 8 11 -1337 0.24328
1 149 8 12 -1363 0.30519
1 150 8 13 -1471 0.79758
1 151 8 14 -1391 0.39634
1 152 8 15 -1464 0.73107
1 153 8 16 -1600 99138717.57090
1 162 9 8 -1494 0.95228
1 163 9 9 -1470 0.79072
1 164 9 10 -1367 0.32373
1 165 9 11 -1543 1.42809
1 166 9 12 -1408 0.46027
1 167 9 13 -1504 1.02165
1 168 9 14 -1518 28.42302
1 169 9 15 -1618 8.50282
1 170 9 16 -1600 2763599473.92000
1 179 10 8 -1479 0.83132
1 180 10 9 -1605 2.29887
1 181 10 10 -1564 1.70071
1 182 10 11 -1571 1.75211
1 183 10 12 -1602 2.25025
1 184 10 13 -1536 1.33904
1 185 10 14 -1468 0.77463
1 186 10 15 -1500 0.98997
1 187 10 16 -1600 1160872597.44000
1 196 11 8 -1628 2.72711
1 197 11 9 -1432 0.56615
1 198 11 10 -1632 2.81051
1 199 11 11 -1559 1.60552
1 200 11 12 -1539 1.37018
1 201 11 13 -1550 1.49716
1 202 11 14 -1324 0.21269
1 203 11 15 -1547 1.46720
1 204 11 16 -1600 1141161177.66000
1 213 12 8 -1496 0.95780
1 214 12 9 -1433 0.57047
1 215 12 10 -1490 0.92582
1 216 12 11 -1356 0.29344
1 217 12 12 -1388 0.38218
1 218 12 13 -1425 0.53534
1 219 12 14 -1505 1.03724
1 220 12 15 -1565 1.68670
1 221 12 16 -1600 55341.94776
1 230 13 8 -1528 1.26058
1 231 13 9 -1478 0.82450
1 232 13 10 -1433 0.56207
1 233 13 11 -1427 0.55288
1 234 13 12 -1686 4.15406
1 235 13 13 -1452 0.67741
1 236 13 14 -1439 0.60648
1 237 13 15 -1376 0.34837
1 238 13 16 -1600 1712278816.66000
1 247 14 8 -1643 3.03498
1 248 14 9 -1463 0.74833
1 249 14 10 -1457 0.70512
1 250 14 11 -1463 0.73780
1 251 14 12 -1492 0.93971
1 252 14 13 -1624 2.68025
1 253 14 14 -1501 1.01623
1 254 14 15 -1518 1.16242
1 255 14 16 -1588 101217.41747
1 264 15 8 -1564 1.65511
1 265 15 9 -1456 0.69964
1 266 15 10 -1509 1.06543
1 267 15 11 -1352 0.28259
1 268 15 12 -1454 0.69068
1 269 15 13 -1440 0.60041
1 270 15 14 -1519 1.17802
1 271 15 15 -1514 1.14082
1 272 15 16 -1568 5363.68113
1 281 16 8 -1390 0.39447
1 282 16 9 -1621 5.14142
1 283 16 10 -1440 0.61803
1 284 16 11 -1420 0.51124
1 285 16 12 -1402 0.43836
1 286 16 13 -1323 0.21481
1 287 16 14 -1474 0.81451
1 288 16 15 -1494 0.94568
1 289 16 16 -1600 2343868420.02000
1 298 17 8 -1673 3.78444
1 299 17 9 -1488 0.92616
1 300 17 10 -1557 1.56633
1 301 17 11 -1477 0.82927
1 302 17 12 -1401 0.43198
1 303 17 13 -1414 0.49227
1 304 17 14 -1375 0.34419
1 305 17 15 -1404 0.45225
1 306 17 16 -1600 221379994.71900
1 315 18 8 -1695 4.46239
1 316 18 9 -1524 1.20066
1 317 18 10 -1616 2.44712
1 318 18 11 -1393 0.40221
1 319 18 12 -1442 0.62235
1 320 18 13 -1546 1.45407
1 321 18 14 -1420 0.50695
1 322 18 15 -1607 2.34002
1 323 18 16 -1527 65.53926
1 332 19 8 -1492 0.93967
1 333 19 9 -1362 0.30841
1 334 19 10 -1409 0.47013
1 335 19 11 -1628 2.72369
1 336 19 12 -1282 0.14517
1 337 19 13 -1609 2.34413
1 338 19 14 -1392 0.40120
1 339 19 15 -1433 0.56999
1 340 19 16 -1351 0.37969
1 349 20 8 -1483 0.87271
1 350 20 9 -1588 2.02543
1 351 20 10 -1357 0.29074
1 352 20 11 -1265 0.12435
1 353 20 12 -1352 0.27936
1 354 20 13 -1476 0.82553
1 355 20 14 -1309 0.18928
1 356 20 15 -1619 2.57987
1 357 20 16 -1480 160.50607
1 366 21 8 -1458 0.70360
1 367 21 9 -1311 0.19153
1 368 21 10 -1539 1.36908
1 369 21 11 -1383 0.36667
1 370 21 12 -1331 0.22799
1 371 21 13 -1595 377.25552
1 372 21 14 -1415 0.49051
1 373 21 15 -1448 0.65653
1 374 21 16 -1600 33826.05808
1 383 22 8 -1372 0.33685
1 384 22 9 -1254 0.11123
1 385 22 10 -1448 0.64695
1 386 22 11 -1543 1.41402
1 387 22 12 -1326 0.22704
1 388 22 13 -1350 0.27861
1 389 22 14 -1455 0.67962
1 390 22 15 -1543 1.42562
1 391 22 16 -1318 0.04475
1 400 23 8 -1497 0.98982
1 401 23 9 -1488 0.89797
1 402 23 10 -1369 0.32589
1 403 23 11 -1385 0.37149
1 404 23 12 -1145 0.03709
1 405 23 13 -1401 0.43020
1 406 23 14 -1302 0.17904
1 407 23 15 -1566 1.70198
1 408 23 16 -1385 2.89837
1 417 24 8 -1381 0.36238
1 418 24 9 -1242 0.09921
1 419 24 10 -1372 0.33847
1 420 24 11 -1571 1.90240
1 421 24 12 -1385 0.37991
1 422 24 13 -1519 1.15552
1 423 24 14 -1316 0.20044
1 424 24 15 -1437 0.58575
1 425 24 16 -1600 403956140.63100
1 426 25 0 -1435 0.58845
1 427 25 1 -1558 1.61260
1 428 25 2 -1602 2.24080
1 429 25 3 -1568 1.72844
1 430 25 4 -1615 2.48975
1 431 25 5 -1472 0.78639
1 432 25 6 -1680 3.98470
1 433 25 7 -1558 1.59834
1 434 25 8 -1338 0.25215
1 435 25 9 -1531 1.28789
1 436 25 10 -1416 0.48631
1 437 25 11 -1385 0.37676
1 438 25 12 -1335 0.24079
1 439 25 13 -1217 0.07813
1 440 25 14 -1520 1.17304
1 441 25 15 -1296 0.16379
1 442 25 16 -1360 0.72662
1 443 26 0 -1577 1.84860
1 444 26 1 -1640 2.99299
1 445 26 2 -1462 0.72766
1 446 26 3 -1482 0.85857
1 447 26 4 -1349 0.27086
1 448 26 5 -1503 1.01792
1 449 26 6 -1611 5.18571
1 450 26 7 -1511 1.09464
1 451 26 8 -1371 0.33439
1 452 26 9 -1270 0.13059
1 453 26 10 -1260 0.11803
1 454 26 11 -1345 0.26254
1 455 26 12 -1337 0.24859
1 456 26 13 -1325 0.21945
1 457 26 14 -1419 0.50748
1 458 26 15 -1401 0.42770
1 459 26 16 -1451 131.47233
1 460 27 0 -1534 1.31856
1 461 27 1 -1263 0.12139
1 462 27 2 -1408 0.46206
1 463 27 3 -1516 1.11508
1 464 27 4 -1315 0.20108
1 465 27 5 -1454 0.69415
1 466 27 6 -1449 0.65490
1 467 27 7 -1392 0.40155
1 468 27 8 -1513 1.09994
1 469 27 9 -1468 0.75423
1 470 27 10 -1328 0.22867
1 471 27 11 -1187 0.05684
1 472 27 12 -1183 0.05579
1 473 27 13 -1301 0.17251
1 474 27 14 -1572 30.82467
1 475 27 15 -1473 4.97524
1 477 28 0 -1186 0.05715
1 478 28 1 -1417 0.49564
1 479 28 2 -1183 0.05449
1 480 28 3 -1336 0.24501
1 481 28 4 -1253 0.11099
1 482 28 5 -1423 0.52129
1 483 28 6 -1205 70.34774
1 484 28 7 -1145 0.03740
1 485 28 8 -1552 1.49989
1 486 28 9 -1205 0.06756
1 487 28 10 -1199 0.06522
1 488 28 11 -1262 0.12109
1 489 28 12 -1302 0.17936
1 490 28 13 -1403 0.43170
1 491 28 14 -1463 24.92590
1 494 29 0 -1464 0.75479
1 495 29 1 -1398 0.42636
1 496 29 2 -1308 0.18606
1 497 29 3 -1214 0.07469
1 498 29 4 -1390 0.39642
1 499 29 5 -1205 0.06964
1 500 29 6 -1300 0.17174
1 501 29 7 -1230 0.08730
1 502 29 8 -1344 0.26279
1 503 29 9 -1372 0.33807
1 504 29 10 -1202 0.06702
1 505 29 11 -1341 0.50681
1 506 29 12 -1377 0.35149
1 507 29 13 -1389 6.71857
1 511 30 0 -1352 0.27728
1 512 30 1 -1400 0.42115
1 513 30 2 -1193 0.05956
1 514 30 3 -1285 0.14819
1 515 30 4 -1261 0.11952
1 516 30 5 -1291 0.15825
1 517 30 6 -1283 0.15074
1 518 30 7 -1356 0.29615
1 519 30 8 -1306 0.18173
1 520 30 9 -1444 0.62786
1 521 30 10 -1267 0.12790
1 522 30 11 -1054 1.70574
1 523 30 12 -1600 0.00000
1 528 31 0 -1532 44.93412
1 529 31 1 -1260 0.11759
1 530 31 2 -1232 0.08962
1 531 31 3 -1208 0.07061
1 532 31 4 -1232 0.09098
1 533 31 5 -1417 0.49304
1 534 31 6 -1317 0.20484
1 535 31 7 -1270 0.13193
1 536 31 8 -1202 0.06747
1 537 31 9 -1417 0.48968
1 538 31 10 -1394 0.41111
1 539 31 11 -1224 0.00053
1 545 32 0 -1180 0.05336
1 546 32 1 -1451 0.66143
1 547 32 2 -1336 0.24865
1 548 32 3 -1526 1.24396
1 549 32 4 -1156 0.30119
1 550 32 5 -1292 0.42386
1 551 32 6 -1418 0.49727
1 552 32 7 -1280 0.14345
1 553 32 8 -1232 0.09049
1 554 32 9 -1275 0.13867
1 555 32 10 -1307 0.01867
1 562 33 0 -1346 0.15374
1 563 33 1 -1228 0.00074
1 564 33 2 -1369 0.29666
1 565 33 3 -1192 0.00023
1 566 33 4 -900 58.79120
1 567 33 5 -1381 1.16537
1 568 33 6 -1409 1.29241
1 569 33 7 -1326 0.26461
1 570 33 8 -1232 0.00224
1 571 33 9 -1262 0.02696
2 1 0 0 -1600 103497.95880
2 2 0 1 -1558 370375.26497
2 3 0 2 -1600 280114735.67600
2 4 0 3 -1569 93932.75892
2 5 0 4 -1600 5193969.11913
2 6 0 5 -1600 4599782.28547
2 7 0 6 -1600 261842510.50700
2 8 0 7 -1600 785564.69209
2 9 0 8 -1506 71618.48079
2 10 0 9 -1600 1141871038.01000
2 18 1 0 -1330 0.22499
2 19 1 1 -1238 0.09725
2 20 1 2 -1193 0.60834
2 21 1 3 -1255 0.11324
2 22 1 4 -1314 0.19552
2 23 1 5 -1428 0.54695
2 24 1 6 -1545 1.43213
2 25 1 7 -1345 0.26422
2 26 1 8 -1470 0.77685
2 27 1 9 -1396 0.40891
2 28 1 10 -1422 14.44363
2 35 2 0 -1600 70.61207
2 36 2 1 -1351 0.27976
2 37 2 2 -1362 1.48652
2 38 2 3 -1324 0.22168
2 39 2 4 -1249 0.10730
2 40 2 5 -1308 0.19043
2 41 2 6 -1485 0.89155
2 42 2 7 -1350 0.27241
2 43 2 8 -1360 0.30434
2 44 2 9 -1590 2.04202
2 45 2 10 -1620 4.21863
2 46 2 11 -1403 2424.64889
2 52 3 0 -1444 0.62599
2 53 3 1 -1203 0.06661
2 54 3 2 -1314 0.19682
2 55 3 3 -1204 0.06825
2 56 3 4 -1251 0.10887
2 57 3 5 -1329 0.22529
2 58 3 6 -1448 0.65562
2 59 3 7 -1404 0.44440
2 60 3 8 -1449 0.65668
2 61 3 9 -1532 1.28472
2 62 3 10 -1580 2.58568
2 63 3 11 -1368 0.32215
2 64 3 12 -1600 88157.39835
2 69 4 0 -1443 0.62003
2 70 4 1 -1343 0.26327
2 71 4 2 -1195 0.06137
2 72 4 3 -1217 0.07686
2 73 4 4 -1327 0.22682
2 74 4 5 -1263 0.12346
2 75 4 6 -1508 4.58440
2 76 4 7 -1365 0.31323
2 77 4 8 -1300 0.17483
2 78 4 9 -1424 1.33459
2 79 4 10 -1527 1.25842
2 80 4 11 -1394 0.81255
2 81 4 12 -1387 0.39324
2 82 4 13 -1470 2756.92829
2 86 5 0 -1363 0.30618
2 87 5 1 -1227 0.08294
2 88 5 2 -1268 0.12974
2 89 5 3 -1431 0.55696
2 90 5 4 -1199 0.06570
2 91 5 5 -1382 0.36882
2 92 5 6 -1193 0.06122
2 93 5 7 -1405 0.44701
2 94 5 8 -1466 0.75589
2 95 5 9 -1548 1.48015
2 96 5 10 -1448 0.65384
2 97 5 11 -1341 0.25240
2 98 5 12 -1393 0.40764
2 99 5 13 -1644 5.12858
2 100 5 14 -1600 28497.07958
2 103 6 0 -1425 0.52863
2 104 6 1 -1213 0.07364
2 105 6 2 -1249 0.10731
2 106 6 3 -1239 0.09690
2 107 6 4 -1259 0.12630
2 108 6 5 -1214 0.07718
2 109 6 6 -1289 0.15951
2 110 6 7 -1303 0.18134
2 111 6 8 -1251 0.10808
2 112 6 9 -1460 0.72414
2 113 6 10 -1411 0.46863
2 114 6 11 -1385 0.95623
2 115 6 12 -1259 0.11819
2 116 6 13 -1317 0.20597
2 117 6 14 -1188 0.05729
2 118 6 15 -1600 17338045.54810
2 120 7 0 -1288 0.15484
2 121 7 1 -1302 0.17759
2 122 7 2 -1326 0.22171
2 123 7 3 -1158 0.04209
2 124 7 4 -1156 0.04124
2 125 7 5 -1356 0.29029
2 126 7 6 -1306 0.18705
2 127 7 7 -1404 0.44662
2 128 7 8 -1553 1.54674
2 129 7 9 -1595 2.11975
2 130 7 10 -1421 0.52689
2 131 7 11 -1359 0.29192
2 132 7 12 -1539 1.39038
2 133 7 13 -1484 0.87120
2 134 7 14 -1365 0.31464
2 135 7 15 -1641 2.97447
2 136 7 16 -1600 1855669273.27000
2 137 8 0 -1315 0.20000
2 138 8 1 -1624 2.63911
2 139 8 2 -1260 0.11899
2 140 8 3 -1314 0.19573
2 141 8 4 -1343 0.26033
2 142 8 5 -1488 0.90488
2 143 8 6 -1429 555.38457
2 144 8 7 -1696 8.97652
2 145 8 8 -1310 0.18897
2 146 8 9 -1621 2.60274
2 147 8 10 -1341 0.25700
2 148 8 11 -1465 0.75571
2 149 8 12 -1562 1.65901
2 150 8 13 -1340 1.34104
2 151 8 14 -1445 0.64949
2 152 8 15 -1533 1.29746
2 153 8 16 -1600 31166.80947
2 162 9 8 -1633 2.81839
2 163 9 9 -1477 0.83495
2 164 9 10 -1313 0.19280
2 165 9 11 -1665 3.62353
2 166 9 12 -1556 1.56782
2 167 9 13 -1674 6.41514
2 168 9 14 -1481 0.85409
2 169 9 15 -1490 0.93003
2 170 9 16 -1402 8.51294
2 179 10 8 -1677 13.12670
2 180 10 9 -1422 0.52144
2 181 10 10 -1344 0.26297
2 182 10 11 -1321 0.21480
2 183 10 12 -1378 0.35164
2 184 10 13 -1433 0.57595
2 185 10 14 -1420 0.52085
2 186 10 15 -1507 1.05115
2 187 10 16 -1600 86656956.94250
2 196 11 8 -1687 4.23641
2 197 11 9 -1568 1.72579
2 198 11 10 -1459 0.71173
2 199 11 11 -1398 0.41682
2 200 11 12 -1378 0.35246
2 201 11 13 -1278 0.14043
2 202 11 14 -1535 1.32516
2 203 11 15 -1356 0.28801
2 204 11 16 -1600 2978441381.26000
2 213 12 8 -1411 0.47336
2 214 12 9 -1511 1.08609
2 215 12 10 -1317 0.19882
2 216 12 11 -1463 0.73351
2 217 12 12 -1386 0.38119
2 218 12 13 -1471 0.78119
2 219 12 14 -1441 0.61321
2 220 12 15 -1592 72.22922
2 221 12 16 -1596 2979231.50694
2 230 13 8 -1573 1.76441
2 231 13 9 -1628 2.73030
2 232 13 10 -1313 0.19981
2 233 13 11 -1330 0.23403
2 234 13 12 -1557 1.58463
2 235 13 13 -1331 0.23169
2 236 13 14 -1371 0.32870
2 237 13 15 -1639 4.45261
2 238 13 16 -1600 21495966.10720
2 247 14 8 -1604 2.25585
2 248 14 9 -1425 0.53275
2 249 14 10 -1453 0.68554
2 250 14 11 -1416 0.49715
2 251 14 12 -1405 0.44889
2 252 14 13 -1462 0.71916
2 253 14 14 -1435 0.58000
2 254 14 15 -1527 1.25644
2 255 14 16 -1600 1208988.76665
2 264 15 8 -1473 0.80340
2 265 15 9 -1363 0.31399
2 266 15 10 -1345 0.28192
2 267 15 11 -1370 0.32773
2 268 15 12 -1311 0.19423
2 269 15 13 -1391 0.39224
2 270 15 14 -1305 0.18437
2 271 15 15 -1403 0.43399
2 272 15 16 -1467 3.68072
2 281 16 8 -1541 1.39414
2 282 16 9 -1278 0.14261
2 283 16 10 -1451 0.66058
2 284 16 11 -1575 2.68300
2 285 16 12 -1282 0.14721
2 286 16 13 -1269 0.12939
2 287 16 14 -1473 0.81025
2 288 16 15 -1478 0.84453
2 289 16 16 -1492 8.73521
2 298 17 8 -1341 0.25243
2 299 17 9 -1367 0.31823
2 300 17 10 -1326 0.22391
2 301 17 11 -1378 0.34849
2 302 17 12 -1352 0.28348
2 303 17 13 -1420 0.51213
2 304 17 14 -1471 0.79499
2 305 17 15 -1408 0.45620
2 306 17 16 -1500 2.72453
2 315 18 8 -1491 0.92742
2 316 18 9 -1472 0.79475
2 317 18 10 -1466 0.75561
2 318 18 11 -1357 0.29621
2 319 18 12 -1194 0.06070
2 320 18 13 -1621 2.57436
2 321 18 14 -1485 0.88092
2 322 18 15 -1557 1.56935
2 323 18 16 -1600 322330.83402
2 332 19 8 -1373 0.34392
2 333 19 9 -1466 0.76093
2 334 19 10 -1357 0.29718
2 335 19 11 -1359 0.29449
2 336 19 12 -1324 2.59687
2 337 19 13 -1435 0.57388
2 338 19 14 -1370 0.33160
2 339 19 15 -1442 0.61810
2 340 19 16 -1600 691589.98506
2 349 20 8 -1465 0.74111
2 350 20 9 -1614 2.46424
2 351 20 10 -1382 0.37146
2 352 20 11 -1513 1.12469
2 353 20 12 -1428 0.54888
2 354 20 13 -1437 0.59487
2 355 20 14 -1311 0.19242
2 356 20 15 -1525 1.21278
2 357 20 16 -1600 1775041.54538
2 366 21 8 -1630 2.80151
2 367 21 9 -1380 0.35857
2 368 21 10 -1527 1.25893
2 369 21 11 -1245 0.10349
2 370 21 12 -1380 0.36412
2 371 21 13 -1462 0.73470
2 372 21 14 -1382 0.36069
2 373 21 15 -1379 0.36332
2 374 21 16 -1571 573.05993
2 383 22 8 -1416 0.50733
2 384 22 9 -1515 1.10889
2 385 22 10 -1370 0.32965
2 386 22 11 -1329 0.22472
2 387 22 12 -1373 0.33952
2 388 22 13 -1304 0.18103
2 389 22 14 -1337 0.24359
2 390 22 15 -1590 2.02620
2 391 22 16 -1529 12.28370
2 400 23 8 -1427 0.53708
2 401 23 9 -1419 0.51320
2 402 23 10 -1158 0.04200
2 403 23 11 -1439 0.61199
2 404 23 12 -1393 0.40878
2 405 23 13 -1391 0.39760
2 406 23 14 -1544 1.40192
2 407 23 15 -1385 0.37406
2 408 23 16 -1600 3111.30825
2 417 24 8 -1529 1.26899
2 418 24 9 -1542 1.40879
2 419 24 10 -1308 0.18406
2 420 24 11 -1414 0.48343
2 421 24 12 -1251 0.10623
2 422 24 13 -1408 0.45764
2 423 24 14 -1264 0.12303
2 424 24 15 -1415 0.48953
2 425 24 16 -1600 263119.79428
2 426 25 0 -1649 55.12882
2 427 25 1 -1652 6.65632
2 428 25 2 -1597 588.07934
2 429 25 3 -1461 0.72912
2 430 25 4 -1666 15.59024
2 431 25 5 -1511 1.07536
2 432 25 6 -1642 3.01269
2 433 25 7 -1424 0.53891
2 434 25 8 -1419 0.51259
2 435 25 9 -1362 0.31173
2 436 25 10 -1337 0.24680
2 437 25 11 -1313 0.19332
2 438 25 12 -1269 0.13196
2 439 25 13 -1372 0.33346
2 440 25 14 -1285 0.15014
2 441 25 15 -1348 0.27056
2 442 25 16 -1600 48974319.49840
2 443 26 0 -1399 0.42942
2 444 26 1 -1372 0.34307
2 445 26 2 -1305 0.17980
2 446 26 3 -1413 0.47624
2 447 26 4 -1297 0.17065
2 448 26 5 -1497 0.97990
2 449 26 6 -1271 0.13027
2 450 26 7 -1328 0.22587
2 451 26 8 -1507 1.05748
2 452 26 9 -1357 0.29038
2 453 26 10 -1302 0.17754
2 454 26 11 -1322 0.21178
2 455 26 12 -1349 0.26907
2 456 26 13 -1395 0.41988
2 457 26 14 -1345 0.26392
2 458 26 15 -1415 0.48382
2 459 26 16 -1545 22935.34896
2 460 27 0 -1403 0.44453
2 461 27 1 -1486 0.89052
2 462 27 2 -1259 0.11982
2 463 27 3 -1267 0.12599
2 464 27 4 -1250 0.10703
2 465 27 5 -1303 0.17921
2 466 27 6 -1554 1.53640
2 467 27 7 -1292 0.16080
2 468 27 8 -1204 0.06813
2 469 27 9 -1212 0.07449
2 470 27 10 -1214 0.07713
2 471 27 11 -1363 0.30841
2 472 27 12 -1177 0.05075
2 473 27 13 -1263 0.12012
2 474 27 14 -1174 0.11553
2 475 27 15 -1406 1.92626
2 477 28 0 -1452 0.67364
2 478 28 1 -1497 0.98144
2 479 28 2 -1222 0.08169
2 480 28 3 -1222 0.08153
2 481 28 4 -1275 0.13748
2 482 28 5 -1183 0.05568
2 483 28 6 -1217 0.07693
2 484 28 7 -1262 0.11936
2 485 28 8 -1264 0.12351
2 486 28 9 -1333 0.23140
2 487 28 10 -1299 0.17094
2 488 28 11 -1255 0.11318
2 489 28 12 -1253 0.10913
2 490 28 13 -1271 0.13169
2 491 28 14 -1295 0.32073
2 494 29 0 -1252 0.10939
2 495 29 1 -1414 0.48627
2 496 29 2 -1239 0.09566
2 497 29 3 -1334 0.24355
2 498 29 4 -1300 0.17164
2 499 29 5 -1418 0.58210
2 500 29 6 -1255 0.11357
2 501 29 7 -1348 0.27417
2 502 29 8 -1282 0.14399
2 503 29 9 -1261 0.11890
2 504 29 10 -1151 0.03952
2 505 29 11 -1381 0.36991
2 506 29 12 -1354 0.28667
2 507 29 13 -1292 0.32380
2 511 30 0 -1342 0.25717
2 512 30 1 -1373 0.34153
2 513 30 2 -1304 0.17934
2 514 30 3 -1229 0.08762
2 515 30 4 -1402 0.43588
2 516 30 5 -1333 0.23987
2 517 30 6 -1315 0.19955
2 518 30 7 -1224 0.08212
2 519 30 8 -1222 0.08216
2 520 30 9 -1307 0.18261
2 521 30 10 -1285 0.15198
2 522 30 11 -1342 0.25984
2 523 30 12 -1378 0.43362
2 528 31 0 -1278 0.14135
2 529 31 1 -1236 0.09306
2 530 31 2 -1213 0.07591
2 531 31 3 -1408 0.45844
2 532 31 4 -1217 0.07595
2 533 31 5 -1268 0.13010
2 534 31 6 -1330 0.23220
2 535 31 7 -1250 0.10789
2 536 31 8 -1274 0.13441
2 537 31 9 -1338 0.24214
2 538 31 10 -1384 0.36563
2 539 31 11 -1383 0.53472
2 545 32 0 -1140 0.03544
2 546 32 1 -1295 0.16876
2 547 32 2 -1226 0.08545
2 548 32 3 -1235 0.09257
2 549 32 4 -1366 0.31765
2 550 32 5 -1217 0.07859
2 551 32 6 -1222 0.08160
2 552 32 7 -1177 0.05183
2 553 32 8 -1401 0.42937
2 554 32 9 -1347 0.26615
2 555 32 10 -1375 0.56908
2 562 33 0 -1354 0.13646
2 563 33 1 -1409 0.41290
2 564 33 2 -1208 0.00287
2 565 33 3 -1309 0.21160
2 566 33 4 -1234 0.00308
2 567 33 5 -1306 0.02205
2 568 33 6 -1305 0.03653
2 569 33 7 -1398 0.33226
2 570 33 8 -1310 0.15991
2 571 33 9 -1238 0.00306
