!SETdevice 0
!setctrl 0 0
!sleep 100
!rdac E0 0xC0
!sleep 100
!rdac E2 0xC0
!sleep 100
!rdac E4 0xC0
!sleep 100
!rdac E6 0xC0
!sleep 100
!rdac E8 0xC0
!sleep 100
!rdac EA 0xC0
!sleep 100
!rdac EC 0xC0
!sleep 100
!rdac EE 0xC0
!sleep 100
!rdac F0 0xC0
!sleep 100
!rdac F2 0xC0
!sleep 100
!rdac F4 0xC0
!sleep 100
!rdac F6 0xC0
!sleep 100
!rdac F8 0xC0
!sleep 100
!rdac FA 0xC0
!sleep 100
!rdac FC 0xC0
!sleep 100
!rdac FE 0xC0
!sleep 100
!setctrl 0 1
!sleep 100
!rdac E0 0xC0
!sleep 100
!rdac E2 0xC0
!sleep 100
!rdac E4 0xC0
!sleep 100
!rdac E6 0xC0
!sleep 100
!rdac E8 0xC0
!sleep 100
!rdac EA 0xC0
!sleep 100
!rdac EC 0xC0
!sleep 100
!rdac EE 0xC0
!sleep 100
!rdac F0 0xC0
!sleep 100
!rdac F2 0xC0
!sleep 100
!rdac F4 0xC0
!sleep 100
!rdac F6 0xC0
!sleep 100
!rdac F8 0xC0
!sleep 100
!rdac FA 0xC0
!sleep 100
!rdac FC 0xC0
!sleep 100
!rdac FE 0xC0
!sleep 100
!setctrl 0 2
!sleep 100
!rdac E0 0xC0
!sleep 100
!rdac E2 0xC0
!sleep 100
!rdac E4 0xC0
!sleep 100
!rdac E6 0xC0
!sleep 100
!rdac E8 0xC0
!sleep 100
!rdac EA 0xC0
!sleep 100
!rdac EC 0xC0
!sleep 100
!rdac EE 0xC0
!sleep 100
!rdac F0 0xC0
!sleep 100
!rdac F2 0xC0
!sleep 100
!rdac F4 0xC0
!sleep 100
!rdac F6 0xC0
!sleep 100
!rdac F8 0xC0
!sleep 100
!rdac FA 0xC0
!sleep 100
!rdac FC 0xC0
!sleep 100
!rdac FE 0xC0
!sleep 100
!setctrl 0 3
!sleep 100
!rdac E0 0xC0
!sleep 100
!rdac E2 0xC0
!sleep 100
!rdac E4 0xC0
!sleep 100
!rdac E6 0xC0
!sleep 100
!rdac E8 0xC0
!sleep 100
!rdac EA 0xC0
!sleep 100
!rdac EC 0xC0
!sleep 100
!rdac EE 0xC0
!sleep 100
!rdac F0 0xC0
!sleep 100
!rdac F2 0xC0
!sleep 100
!rdac F4 0xC0
!sleep 100
!rdac F6 0xC0
!sleep 100
!rdac F8 0xC0
!sleep 100
!rdac FA 0xC0
!sleep 100
!rdac FC 0xC0
!sleep 100
!setctrl 1 0
!sleep 100
!rdac E0 0xC0
!sleep 100
!rdac E2 0xC0
!sleep 100
!rdac E4 0xC0
!sleep 100
!rdac E6 0xC0
!sleep 100
!rdac E8 0xC0
!sleep 100
!rdac EA 0xC0
!sleep 100
!rdac EC 0xC0
!sleep 100
!rdac EE 0xC0
!sleep 100
!rdac F0 0xC0
!sleep 100
!rdac F2 0xC0
!sleep 100
!rdac F4 0xC0
!sleep 100
!rdac F6 0xC0
!sleep 100
!rdac F8 0xC0
!sleep 100
!rdac FA 0xC0
!sleep 100
!rdac FC 0xC0
!sleep 100
!setctrl 1 1
!sleep 100
!rdac E0 0xC0
!sleep 100
!rdac E2 0xC0
!sleep 100
!rdac E4 0xC0
!sleep 100
!rdac E6 0xC0
!sleep 100
!rdac E8 0xC0
!sleep 100
!rdac EA 0xC0
!sleep 100
!rdac EC 0xC0
!sleep 100
!rdac EE 0xC0
!sleep 100
!rdac F0 0xC0
!sleep 100
!rdac F2 0xC0
!sleep 100
!rdac F4 0xC0
!sleep 100
!rdac F6 0xC0
!sleep 100
!rdac F8 0xC0
!sleep 100
!rdac FA 0xC0
!sleep 100
!rdac FC 0xC0
!sleep 100
!rdac FE 0xC0
!sleep 100
!setctrl 1 2
!sleep 100
!rdac E0 0xC0
!sleep 100
!rdac E2 0xC0
!sleep 100
!rdac E4 0xC0
!sleep 100
!rdac E6 0xC0
!sleep 100
!rdac E8 0xC0
!sleep 100
!rdac EA 0xC0
!sleep 100
!rdac EC 0xC0
!sleep 100
!rdac EE 0xC0
!sleep 100
!rdac F0 0xC0
!sleep 100
!rdac F2 0xC0
!sleep 100
!rdac F4 0xC0
!sleep 100
!rdac F6 0xC0
!sleep 100
!rdac F8 0xC0
!sleep 100
!rdac FA 0xC0
!sleep 100
!rdac FC 0xC0
!sleep 100
!rdac FE 0xC0
!sleep 100
!setctrl 1 3
!sleep 100
!rdac E0 0xC0
!sleep 100
!rdac E2 0xC0
!sleep 100
!rdac E4 0xC0
!sleep 100
!rdac E6 0xC0
!sleep 100
!rdac E8 0xC0
!sleep 100
!rdac EA 0xC0
!sleep 100
!rdac EC 0xC0
!sleep 100
!rdac EE 0xC0
!sleep 100
!rdac F0 0xC0
!sleep 100
!rdac F2 0xC0
!sleep 100
!rdac F4 0xC0
!sleep 100
!rdac F6 0xC0
!sleep 100
!rdac F8 0xC0
!sleep 100
!rdac FA 0xC0
!sleep 100
!rdac FC 0xC0
!sleep 100
!rdac FE 0xC0
!sleep 100
!setctrl 2 0
!sleep 100
!rdac E0 0xC0
!sleep 100
!rdac E2 0xC0
!sleep 100
!rdac E4 0xC0
!sleep 100
!rdac E6 0xC0
!sleep 100
!rdac E8 0xC0
!sleep 100
!rdac EA 0xC0
!sleep 100
!rdac EC 0xC0
!sleep 100
!rdac EE 0xC0
!sleep 100
!rdac F0 0xC0
!sleep 100
!rdac F2 0xC0
!sleep 100
!rdac F4 0xC0
!sleep 100
!rdac F6 0xC0
!sleep 100
!rdac F8 0xC0
!sleep 100
!rdac FA 0xC0
!sleep 100
!rdac FC 0xC0
!sleep 100
!rdac FE 0xC0
!sleep 100
!setctrl 2 1
!sleep 100
!rdac E0 0xC0
!sleep 100
!rdac E2 0xC0
!sleep 100
!rdac E8 0xC0
!sleep 100
!rdac EC 0xC0
!sleep 100
!rdac F0 0xC0
!sleep 100
!rdac F2 0xC0
!sleep 100
!rdac F4 0xC0
!sleep 100
!rdac F6 0xC0
!sleep 100
!rdac F8 0xC0
!sleep 100
!rdac FA 0xC0
!sleep 100
!rdac FC 0xC0
!sleep 100
!rdac FE 0xC0
!sleep 100
!setctrl 2 2
!sleep 100
!rdac E0 0xC0
!sleep 100
!rdac E2 0xC0
!sleep 100
!rdac E4 0xC0
!sleep 100
!rdac E6 0xC0
!sleep 100
!rdac E8 0xC0
!sleep 100
!rdac EA 0xC0
!sleep 100
!rdac EC 0xC0
!sleep 100
!rdac EE 0xC0
!sleep 100
!rdac F0 0xC0
!sleep 100
!rdac F2 0xC0
!sleep 100
!rdac F4 0xC0
!sleep 100
!rdac F6 0xC0
!sleep 100
!rdac F8 0xC0
!sleep 100
!rdac FA 0xC0
!sleep 100
!rdac FC 0xC0
!sleep 100
!rdac FE 0xC0
!sleep 100
!setctrl 2 3
!sleep 100
!rdac E0 0xC0
!sleep 100
!rdac E2 0xC0
!sleep 100
!rdac E4 0xC0
!sleep 100
!rdac E6 0xC0
!sleep 100
!rdac E8 0xC0
!sleep 100
!rdac EA 0xC0
!sleep 100
!rdac EC 0xC0
!sleep 100
!rdac EE 0xC0
!sleep 100
!rdac F8 0xC0
!sleep 100
!rdac FA 0xC0
!sleep 100
!rdac FC 0xC0
!sleep 100
!rdac FE 0xC0
!sleep 100
!setctrl 3 0
!sleep 100
!rdac E0 0xC0
!sleep 100
!rdac E2 0xC0
!sleep 100
!rdac E4 0xC0
!sleep 100
!rdac E6 0xC0
!sleep 100
!rdac E8 0xC0
!sleep 100
!rdac EA 0xC0
!sleep 100
!rdac EC 0xC0
!sleep 100
!rdac EE 0xC0
!sleep 100
!rdac F0 0xC0
!sleep 100
!rdac F2 0xC0
!sleep 100
!rdac F4 0xC0
!sleep 100
!rdac F6 0xC0
!sleep 100
!rdac F8 0xC0
!sleep 100
!rdac FA 0xC0
!sleep 100
!rdac FC 0xC0
!sleep 100
!rdac FE 0xC0
!sleep 100
!setctrl 3 1
!sleep 100
!rdac E4 0xC0
!sleep 100
!rdac E6 0xC0
!sleep 100
!rdac EA 0xC0
!sleep 100
!rdac EE 0xC0
!sleep 100
!rdac F0 0xC0
!sleep 100
!rdac F2 0xC0
!sleep 100
!rdac F4 0xC0
!sleep 100
!rdac F6 0xC0
!sleep 100
!rdac F8 0xC0
!sleep 100
!rdac FA 0xC0
!sleep 100
!rdac FC 0xC0
!sleep 100
!rdac FE 0xC0
!sleep 100
!setctrl 3 2
!sleep 100
!rdac E0 0xC0
!sleep 100
!rdac E2 0xC0
!sleep 100
!rdac E4 0xC0
!sleep 100
!rdac E6 0xC0
!sleep 100
!rdac E8 0xC0
!sleep 100
!rdac EA 0xC0
!sleep 100
!rdac EC 0xC0
!sleep 100
!rdac EE 0xC0
!sleep 100
!rdac F0 0xC0
!sleep 100
!rdac F2 0xC0
!sleep 100
!rdac F4 0xC0
!sleep 100
!rdac F6 0xC0
!sleep 100
!rdac F8 0xC0
!sleep 100
!rdac FA 0xC0
!sleep 100
!rdac FC 0xC0
!sleep 100
!rdac FE 0xC0
!sleep 100
!setctrl 3 3
!sleep 100
!rdac E0 0xC0
!sleep 100
!rdac E2 0xC0
!sleep 100
!rdac E4 0xC0
!sleep 100
!rdac E6 0xC0
!sleep 100
!rdac E8 0xC0
!sleep 100
!rdac EA 0xC0
!sleep 100
!rdac EC 0xC0
!sleep 100
!rdac EE 0xC0
!sleep 100
!rdac F0 0xC0
!sleep 100
!rdac F2 0xC0
!sleep 100
!rdac F4 0xC0
!sleep 100
!rdac F6 0xC0
!sleep 100
!SETdevice 1
!setctrl 0 0
!sleep 100
!rdac E0 0xC0
!sleep 100
!rdac E2 0xC0
!sleep 100
!rdac E4 0xC0
!sleep 100
!rdac E6 0xC0
!sleep 100
!rdac E8 0xC0
!sleep 100
!rdac EA 0xC0
!sleep 100
!rdac EC 0xC0
!sleep 100
!rdac EE 0xC0
!sleep 100
!rdac F0 0xC0
!sleep 100
!rdac F2 0xC0
!sleep 100
!rdac F4 0xC0
!sleep 100
!rdac F6 0xC0
!sleep 100
!rdac F8 0xC0
!sleep 100
!rdac FA 0xC0
!sleep 100
!rdac FC 0xC0
!sleep 100
!rdac FE 0xC0
!sleep 100
!setctrl 0 1
!sleep 100
!rdac E4 0xC0
!sleep 100
!rdac E6 0xC0
!sleep 100
!rdac EA 0xC0
!sleep 100
!rdac EE 0xC0
!sleep 100
!rdac F0 0xC0
!sleep 100
!rdac F2 0xC0
!sleep 100
!rdac F4 0xC0
!sleep 100
!rdac F6 0xC0
!sleep 100
!rdac F8 0xC0
!sleep 100
!rdac FA 0xC0
!sleep 100
!rdac FC 0xC0
!sleep 100
!rdac FE 0xC0
!sleep 100
!setctrl 0 2
!sleep 100
!rdac E0 0xC0
!sleep 100
!rdac E2 0xC0
!sleep 100
!rdac E4 0xC0
!sleep 100
!rdac E6 0xC0
!sleep 100
!rdac E8 0xC0
!sleep 100
!rdac EA 0xC0
!sleep 100
!rdac EC 0xC0
!sleep 100
!rdac EE 0xC0
!sleep 100
!rdac F0 0xC0
!sleep 100
!rdac F2 0xC0
!sleep 100
!rdac F4 0xC0
!sleep 100
!rdac F6 0xC0
!sleep 100
!rdac F8 0xC0
!sleep 100
!rdac FA 0xC0
!sleep 100
!rdac FC 0xC0
!sleep 100
!rdac FE 0xC0
!sleep 100
!setctrl 0 3
!sleep 100
!rdac E0 0xC0
!sleep 100
!rdac E2 0xC0
!sleep 100
!rdac E8 0xC0
!sleep 100
!rdac EC 0xC0
!sleep 100
!rdac F0 0xC0
!sleep 100
!rdac F2 0xC0
!sleep 100
!rdac F4 0xC0
!sleep 100
!rdac F6 0xC0
!sleep 100
!rdac F8 0xC0
!sleep 100
!rdac FA 0xC0
!sleep 100
!rdac FC 0xC0
!sleep 100
!rdac FE 0xC0
!sleep 100
!setctrl 1 0
!sleep 100
!rdac E0 0xC0
!sleep 100
!rdac E2 0xC0
!sleep 100
!rdac E4 0xC0
!sleep 100
!rdac E6 0xC0
!sleep 100
!rdac E8 0xC0
!sleep 100
!rdac EA 0xC0
!sleep 100
!rdac EC 0xC0
!sleep 100
!rdac EE 0xC0
!sleep 100
!rdac F8 0xC0
!sleep 100
!rdac FA 0xC0
!sleep 100
!rdac FC 0xC0
!sleep 100
!rdac FE 0xC0
!sleep 100
!setctrl 1 1
!sleep 100
!rdac E0 0xC0
!sleep 100
!rdac E2 0xC0
!sleep 100
!rdac E4 0xC0
!sleep 100
!rdac E6 0xC0
!sleep 100
!rdac E8 0xC0
!sleep 100
!rdac EA 0xC0
!sleep 100
!rdac EC 0xC0
!sleep 100
!rdac EE 0xC0
!sleep 100
!rdac F0 0xC0
!sleep 100
!rdac F2 0xC0
!sleep 100
!rdac F4 0xC0
!sleep 100
!rdac F6 0xC0
!sleep 100
!rdac F8 0xC0
!sleep 100
!rdac FA 0xC0
!sleep 100
!rdac FC 0xC0
!sleep 100
!rdac FE 0xC0
!sleep 100
!setctrl 1 2
!sleep 100
!rdac E0 0xC0
!sleep 100
!rdac E2 0xC0
!sleep 100
!rdac E4 0xC0
!sleep 100
!rdac E6 0xC0
!sleep 100
!rdac E8 0xC0
!sleep 100
!rdac EA 0xC0
!sleep 100
!rdac EC 0xC0
!sleep 100
!rdac EE 0xC0
!sleep 100
!rdac F0 0xC0
!sleep 100
!rdac F2 0xC0
!sleep 100
!rdac F4 0xC0
!sleep 100
!rdac F6 0xC0
!sleep 100
!rdac F8 0xC0
!sleep 100
!rdac FA 0xC0
!sleep 100
!rdac FC 0xC0
!sleep 100
!rdac FE 0xC0
!sleep 100
!setctrl 1 3
!sleep 100
!rdac E0 0xC0
!sleep 100
!rdac E2 0xC0
!sleep 100
!rdac E4 0xC0
!sleep 100
!rdac E6 0xC0
!sleep 100
!rdac E8 0xC0
!sleep 100
!rdac EA 0xC0
!sleep 100
!rdac EC 0xC0
!sleep 100
!rdac EE 0xC0
!sleep 100
!rdac F0 0xC0
!sleep 100
!rdac F2 0xC0
!sleep 100
!rdac F4 0xC0
!sleep 100
!rdac F6 0xC0
!sleep 100
!setctrl 2 0
!sleep 100
!rdac E0 0xC0
!sleep 100
!rdac E2 0xC0
!sleep 100
!rdac E4 0xC0
!sleep 100
!rdac E6 0xC0
!sleep 100
!rdac E8 0xC0
!sleep 100
!rdac EA 0xC0
!sleep 100
!rdac EC 0xC0
!sleep 100
!rdac EE 0xC0
!sleep 100
!rdac F0 0xC0
!sleep 100
!rdac F2 0xC0
!sleep 100
!rdac F4 0xC0
!sleep 100
!rdac F6 0xC0
!sleep 100
!rdac F8 0xC0
!sleep 100
!rdac FA 0xC0
!sleep 100
!rdac FC 0xC0
!sleep 100
!rdac FE 0xC0
!sleep 100
!setctrl 2 1
!sleep 100
!rdac E0 0xC0
!sleep 100
!rdac E2 0xC0
!sleep 100
!rdac E4 0xC0
!sleep 100
!rdac E6 0xC0
!sleep 100
!rdac E8 0xC0
!sleep 100
!rdac EA 0xC0
!sleep 100
!rdac EC 0xC0
!sleep 100
!rdac EE 0xC0
!sleep 100
!rdac F0 0xC0
!sleep 100
!rdac F2 0xC0
!sleep 100
!rdac F4 0xC0
!sleep 100
!rdac F6 0xC0
!sleep 100
!rdac F8 0xC0
!sleep 100
!rdac FA 0xC0
!sleep 100
!rdac FC 0xC0
!sleep 100
!rdac FE 0xC0
!sleep 100
!setctrl 2 2
!sleep 100
!rdac E0 0xC0
!sleep 100
!rdac E2 0xC0
!sleep 100
!rdac E4 0xC0
!sleep 100
!rdac E6 0xC0
!sleep 100
!rdac E8 0xC0
!sleep 100
!rdac EA 0xC0
!sleep 100
!rdac EC 0xC0
!sleep 100
!rdac EE 0xC0
!sleep 100
!rdac F0 0xC0
!sleep 100
!rdac F2 0xC0
!sleep 100
!rdac F4 0xC0
!sleep 100
!rdac F6 0xC0
!sleep 100
!rdac F8 0xC0
!sleep 100
!rdac FA 0xC0
!sleep 100
!rdac FC 0xC0
!sleep 100
!rdac FE 0xC0
!sleep 100
!setctrl 2 3
!sleep 100
!rdac E0 0xC0
!sleep 100
!rdac E2 0xC0
!sleep 100
!rdac E4 0xC0
!sleep 100
!rdac E8 0xC0
!sleep 100
!rdac EA 0xC0
!sleep 100
!rdac EC 0xC0
!sleep 100
!rdac EE 0xC0
!sleep 100
!rdac F0 0xC0
!sleep 100
!rdac F2 0xC0
!sleep 100
!rdac F4 0xC0
!sleep 100
!rdac F6 0xC0
!sleep 100
!rdac F8 0xC0
!sleep 100
!rdac FA 0xC0
!sleep 100
!rdac FC 0xC0
!sleep 100
!rdac FE 0xC0
!sleep 100
!setctrl 3 0
!sleep 100
!rdac E0 0xC0
!sleep 100
!rdac E2 0xC0
!sleep 100
!rdac E4 0xC0
!sleep 100
!rdac E6 0xC0
!sleep 100
!rdac E8 0xC0
!sleep 100
!rdac EA 0xC0
!sleep 100
!rdac EC 0xC0
!sleep 100
!rdac EE 0xC0
!sleep 100
!rdac F0 0xC0
!sleep 100
!rdac F2 0xC0
!sleep 100
!rdac F4 0xC0
!sleep 100
!rdac F6 0xC0
!sleep 100
!rdac F8 0xC0
!sleep 100
!rdac FA 0xC0
!sleep 100
!rdac FC 0xC0
!sleep 100
!setctrl 3 1
!sleep 100
!rdac E0 0xC0
!sleep 100
!rdac E2 0xC0
!sleep 100
!rdac E4 0xC0
!sleep 100
!rdac E6 0xC0
!sleep 100
!rdac E8 0xC0
!sleep 100
!rdac EA 0xC0
!sleep 100
!rdac EC 0xC0
!sleep 100
!rdac EE 0xC0
!sleep 100
!rdac F0 0xC0
!sleep 100
!rdac F2 0xC0
!sleep 100
!rdac F4 0xC0
!sleep 100
!rdac F6 0xC0
!sleep 100
!rdac F8 0xC0
!sleep 100
!rdac FA 0xC0
!sleep 100
!rdac FC 0xC0
!sleep 100
!rdac FE 0xC0
!sleep 100
!setctrl 3 2
!sleep 100
!rdac E0 0xC0
!sleep 100
!rdac E2 0xC0
!sleep 100
!rdac E4 0xC0
!sleep 100
!rdac E6 0xC0
!sleep 100
!rdac E8 0xC0
!sleep 100
!rdac EA 0xC0
!sleep 100
!rdac EC 0xC0
!sleep 100
!rdac EE 0xC0
!sleep 100
!rdac F0 0xC0
!sleep 100
!rdac F2 0xC0
!sleep 100
!rdac F4 0xC0
!sleep 100
!rdac F6 0xC0
!sleep 100
!rdac F8 0xC0
!sleep 100
!rdac FA 0xC0
!sleep 100
!rdac FC 0xC0
!sleep 100
!rdac FE 0xC0
!sleep 100
!setctrl 3 3
!sleep 100
!rdac E0 0xC0
!sleep 100
!rdac E2 0xC0
!sleep 100
!rdac E4 0xC0
!sleep 100
!rdac E6 0xC0
!sleep 100
!rdac E8 0xC0
!sleep 100
!rdac EA 0xC0
!sleep 100
!rdac EC 0xC0
!sleep 100
!rdac EE 0xC0
!sleep 100
!rdac F0 0xC0
!sleep 100
!rdac F2 0xC0
!sleep 100
!rdac F4 0xC0
!sleep 100
!rdac F6 0xC0
!sleep 100
!rdac F8 0xC0
!sleep 100
!rdac FA 0xC0
!sleep 100
!rdac FC 0xC0
!sleep 100
!rdac FE 0xC0
!sleep 100
