3 1 0 0 55 0.35201
3 2 0 1 7C 0.48439
3 3 0 2 38 0.27723
3 4 0 3 94 0.62048
3 5 0 4 BD 0.95453
3 6 0 5 BB 0.93090
3 7 0 6 F2 3.74223
3 8 0 7 FE 11.36478
3 9 0 8 FB 145.56769
3 10 0 9 E3 2.39638
3 11 0 10 F7 18.68942
3 12 0 11 EC 26.38370
3 13 1 0 A3 2.33065
3 14 1 1 3A 0.12417
3 15 1 2 74 0.45514
3 16 1 3 7F 0.50539
3 17 1 4 7C 0.24851
3 18 1 5 B2 0.71329
3 19 1 6 B6 0.77076
3 20 1 7 F4 8.38770
3 21 1 8 F9 5.03137
3 22 1 9 EF 16.25393
3 23 1 10 EA 16.90762
3 24 1 11 ED 12.29100
3 25 2 0 6 0.13060
3 26 2 1 63 0.38713
3 27 2 2 81 4.00346
3 28 2 3 EC 1.80212
3 29 2 4 92 0.35806
3 30 2 5 9B 0.85082
3 31 2 6 EA 6.54910
3 32 2 7 DE 38.66899
3 33 2 8 F5 3.86423
3 34 2 9 D6 1.85642
3 35 2 10 ED 13.98810
3 36 2 11 E9 24.69406
3 37 3 0 43 0.10631
3 38 3 1 1F 0.63310
3 39 3 2 CF 1.22835
3 40 3 3 BD 0.97880
3 41 3 4 39 0.08181
3 42 3 5 74 1.64718
3 43 3 6 7E 11.64317
3 44 3 7 F9 156.30962
3 45 3 8 DB 1.99742
3 46 3 9 ED 32.63730
3 47 3 10 C2 67.31939
3 48 3 11 B2 19.99004
3 49 4 0 3F 0.24372
3 50 4 1 38 0.53664
3 51 4 2 29 0.01814
3 52 4 3 E1 1.54939
3 53 4 4 94 0.38651
3 54 4 5 63 0.15323
3 55 4 6 81 0.26400
3 56 4 7 F7 36.62499
3 57 4 8 C1 1.03395
3 58 4 9 D9 3.88893
3 59 4 10 E3 3.79024
3 60 4 11 FC 25.21089
3 61 5 0 27 0.21062
3 62 5 1 2D 0.18225
3 63 5 2 87 0.53766
3 64 5 3 2A 0.50644
3 65 5 4 1C 134.31026
3 66 5 5 32 0.07178
3 67 5 6 4B 0.10547
3 68 5 7 4F 0.10819
3 69 5 8 8C 0.32772
3 70 5 9 DA 1.93756
3 71 5 10 FE 81.77036
3 72 5 11 E9 2.89412
3 73 6 0 1B 0.56454
3 74 6 1 53 0.16533
3 75 6 2 28 0.25132
3 76 6 3 47 0.15384
3 77 6 4 5 0.01973
3 78 6 5 2C 1.04163
3 79 6 6 8A 0.32185
3 80 6 7 BB 0.91684
3 81 6 8 B5 0.75175
3 82 6 9 95 0.40274
3 83 6 10 A9 0.59278
3 84 6 11 9A 0.44251
3 90 7 5 8F 0.34876
3 91 7 6 6E 0.18676
3 92 7 7 45 0.09438
3 93 7 8 BD 0.93051
3 94 7 9 8D 0.32382
3 95 7 10 EF 6.99712
3 96 7 11 B4 0.76029
3 102 8 5 96 0.61705
3 103 8 6 EE 1.81408
3 104 8 7 EA 1.74358
3 105 8 8 A7 0.75768
3 106 8 9 A2 0.70715
3 107 8 10 E1 9.54311
3 108 8 11 AA 0.79012
3 114 9 5 B1 0.84511
3 115 9 6 DE 1.51082
3 116 9 7 E9 1.74200
3 117 9 8 D3 1.26849
3 118 9 9 A1 0.71492
3 119 9 10 EC 1.78646
3 120 9 11 B7 0.88110
3 126 10 5 58 0.20672
3 127 10 6 84 0.53174
3 128 10 7 E5 426.17793
3 129 10 8 78 0.47051
3 130 10 9 C8 1.12212
3 131 10 10 5A 0.36277
3 132 10 11 EA 14.56108
3 138 11 5 22 0.23802
3 139 11 6 CB 2.35609
3 140 11 7 C0 0.99922
3 141 11 8 F2 1.99051
3 142 11 9 75 0.45988
3 143 11 10 B8 0.91789
3 144 11 11 BD 0.98003
3 150 12 5 51 0.08368
3 151 12 6 ED 59.55550
3 152 12 7 EA 13.74578
3 153 12 8 F0 61.83702
3 154 12 9 0 0.00000
3 155 12 10 2E 0.06444
3 156 12 11 DD 11.98646
3 162 13 5 F7 65.09827
3 163 13 6 F2 7.95097
3 164 13 7 D1 20.08728
3 165 13 8 F1 7.93882
3 166 13 9 44 0.15375
3 167 13 10 5F 0.09374
3 168 13 11 3 0.09649
3 174 14 5 E9 6.89788
3 175 14 6 E8 27.05175
3 176 14 7 D0 162.10060
3 177 14 8 4B 329.39885
3 178 14 9 FF 76.58711
3 179 14 10 3D 0.14081
3 180 14 11 56 0.34671
3 186 15 5 4B 0.07899
3 187 15 6 FF 155.47227
3 188 15 7 DA 11.31766
3 189 15 8 59 0.35594
3 190 15 9 33 0.03268
3 191 15 10 F9 189.43092
3 192 15 11 F2 15.87653
3 198 16 5 FF 9688.57738
3 199 16 6 FF 188.13060
3 200 16 7 F8 5.39569
3 201 16 8 BF 0.97441
3 202 16 9 CD 1.43673
3 203 16 10 0 0.00000
3 204 16 11 EA 105.65079
3 205 17 0 D3 32.70903
3 206 17 1 FF 158.48257
3 207 17 2 FA 36.49024
3 208 17 3 F1 65.09530
3 209 17 4 FF 186.11207
3 210 17 5 FF 186.18173
3 211 17 6 E7 2.94594
3 212 17 7 0 0.00000
3 213 17 8 B1 0.72096
3 214 17 9 BB 0.93329
3 215 17 10 0 0.00000
3 216 17 11 B9 0.87645
3 217 18 0 D5 91.53055
3 218 18 1 FF 643.27917
3 219 18 2 E2 3.18158
3 220 18 3 F5 69.33318
3 221 18 4 FC 175.25468
3 222 18 5 FF 185.27166
3 223 18 6 EB 3.13075
3 224 18 7 B3 0.71563
3 225 18 8 CB 1.25822
3 226 18 9 F1 17.19017
3 227 18 10 DB 4.61872
3 228 18 11 EE 3.73203
3 229 19 0 D2 173.35681
3 230 19 1 E8 6.27954
3 231 19 2 E4 3.23034
3 232 19 3 D7 87.65736
3 233 19 4 F2 61.97188
3 234 19 5 9D 0.45547
3 235 19 6 C2 1.04614
3 236 19 7 CA 1.35195
3 237 19 8 D6 1.79630
3 238 19 9 EC 115.54398
3 239 19 10 EB 25.45201
3 240 19 11 FB 7.42778
3 241 20 0 D4 614.07126
3 242 20 1 D9 13.97068
3 243 20 2 FB 4.55083
3 244 20 3 E8 40.91455
3 245 20 4 F3 8.02052
3 246 20 5 F9 96.30496
3 247 20 6 BE 0.95154
3 248 20 7 D3 1.52243
3 249 20 8 ED 6.74256
3 250 20 9 E7 2.62273
3 251 20 10 F5 8.47058
3 252 20 11 81 0.26378
3 253 21 0 FE 30.86040
3 254 21 1 DB 76.42939
3 255 21 2 F8 2.16507
3 256 21 3 F7 16.48428
3 257 21 4 C6 1.16250
3 258 21 5 DB 1.98508
3 259 21 6 FA 4.71339
3 260 21 7 F8 13.65210
3 261 21 8 FC 15.27210
3 262 21 9 FF 187.81472
3 263 21 10 FF 751.59020
3 264 21 11 F9 9.50827
3 265 22 0 F8 66.74402
3 266 22 1 F7 101.17315
3 267 22 2 A8 0.77154
3 268 22 3 E0 12.40050
3 269 22 4 C1 1.02810
3 270 22 5 B4 0.73764
3 271 22 6 FA 5.20532
3 272 22 7 FA 25.40040
3 273 22 8 F2 38.35022
3 274 22 9 E9 10.29188
3 275 22 10 F1 50.78169
3 276 22 11 E9 2.94425
3 277 23 0 D9 1.38659
3 278 23 1 FB 2.31816
3 279 23 2 C3 1.02117
3 280 23 3 DC 1.35829
3 281 23 4 B3 0.71555
3 282 23 5 F 0.05365
3 283 23 6 F0 40.12490
3 284 23 7 AC 0.63460
3 285 23 8 F4 11.32406
3 286 23 9 ED 70.76825
3 287 23 10 F7 28.42828
3 288 23 11 EB 3280.39644
4 1 0 0 26 0.24311
4 2 0 1 35 0.27171
4 3 0 2 4C 0.32851
4 4 0 3 A8 0.75750
4 5 0 4 EA 95.12484
4 6 0 5 25 0.12138
4 7 0 6 ED 43.65374
4 8 0 7 F0 8.87919
4 9 0 8 FB 143.16069
4 10 0 9 F2 105.33470
4 11 0 10 EF 169.10868
4 12 0 11 82 0.26235
4 13 1 0 15 0.22073
4 14 1 1 63 0.39055
4 15 1 2 A7 1.58778
4 16 1 3 4D 0.32566
4 17 1 4 6A 0.69128
4 18 1 5 80 2.19530
4 19 1 6 CE 2.71032
4 20 1 7 ED 3.36690
4 21 1 8 E9 5.76816
4 22 1 9 FD 18.90946
4 23 1 10 EF 14.29951
4 24 1 11 FA 6.99331
4 25 2 0 35 0.03492
4 26 2 1 4E 0.33425
4 27 2 2 56 0.34589
4 28 2 3 A7 0.74584
4 29 2 4 B0 0.63667
4 30 2 5 82 0.26253
4 31 2 6 C7 1.18086
4 32 2 7 F8 29.89886
4 33 2 8 FC 5.62453
4 34 2 9 F6 4.46807
4 35 2 10 F9 11.49266
4 36 2 11 ED 15.78442
4 37 3 0 7E 0.49760
4 38 3 1 A5 3.74905
4 39 3 2 3D 0.28961
4 40 3 3 7A 0.47888
4 41 3 4 6F 0.18936
4 42 3 5 8C 0.32123
4 43 3 6 B4 0.73778
4 44 3 7 9E 0.47235
4 45 3 8 A2 0.52446
4 46 3 9 FC 5.26701
4 47 3 10 F2 3.92740
4 48 3 11 EF 3.65719
4 49 4 0 78 0.47166
4 50 4 1 19 0.22285
4 51 4 2 CC 1.17030
4 52 4 3 66 0.40359
4 53 4 4 4C 0.10781
4 54 4 5 BE 0.93424
4 55 4 6 7E 0.25318
4 56 4 7 B6 0.75572
4 57 4 8 5A 0.52096
4 58 4 9 F6 139.63629
4 59 4 10 EA 15.19732
4 60 4 11 EC 3.23929
4 61 5 0 F5 131.40929
4 62 5 1 77 0.47039
4 63 5 2 3C 1.41442
4 64 5 3 2C 0.12556
4 65 5 4 1A 0.05071
4 66 5 5 7E 0.25699
4 67 5 6 6C 0.17412
4 68 5 7 C2 1.02148
4 69 5 8 A9 0.61358
4 70 5 9 E9 2.97942
4 71 5 10 E0 2.23808
4 72 5 11 F6 23.76380
4 73 6 0 93 0.61062
4 74 6 1 5C 0.17024
4 75 6 2 52 0.16937
4 76 6 3 58 0.27120
4 77 6 4 59 0.13170
4 78 6 5 4E 0.10988
4 79 6 6 E3 2.42283
4 80 6 7 F8 78.07350
4 81 6 8 B2 0.73368
4 82 6 9 BB 0.89314
4 83 6 10 D2 1.49469
4 84 6 11 F2 7.98480
4 90 7 5 68 0.16799
4 91 7 6 58 0.12853
4 92 7 7 F3 3.92607
4 93 7 8 B5 0.74917
4 94 7 9 CF 1.47650
4 95 7 10 DA 1.95786
4 96 7 11 DF 2.33761
4 102 8 5 F9 21.08039
4 103 8 6 BB 0.95704
4 104 8 7 F8 17.46268
4 105 8 8 DE 1.49386
4 106 8 9 6B 0.41059
4 107 8 10 94 0.61839
4 108 8 11 DE 5.15652
4 114 9 5 A7 0.74067
4 115 9 6 E6 53.55248
4 116 9 7 FD 17.14504
4 117 9 8 E0 1.52329
4 118 9 9 EC 14.93948
4 119 9 10 56 0.34634
4 120 9 11 D7 2.67631
4 126 10 5 CB 1.16773
4 127 10 6 9F 0.68357
4 128 10 7 BD 0.95104
4 129 10 8 BA 0.93908
4 130 10 9 F5 2.09851
4 131 10 10 64 0.39090
4 132 10 11 86 0.53502
4 138 11 5 BD 0.97115
4 139 11 6 78 0.46633
4 140 11 7 8C 0.56891
4 141 11 8 8E 0.56395
4 142 11 9 FC 3.46619
4 143 11 10 BD 0.93494
4 144 11 11 BA 0.93735
4 150 12 5 E4 25.41406
4 151 12 6 FE 2.35138
4 152 12 7 E0 1.55089
4 153 12 8 DB 3.02205
4 154 12 9 B1 0.84157
4 155 12 10 E7 1.73295
4 156 12 11 F2 1.97403
4 162 13 5 C9 1.09893
4 163 13 6 88 0.54797
4 164 13 7 EB 15.46914
4 165 13 8 CE 3.12911
4 166 13 9 F7 3.25251
4 167 13 10 DD 1.43585
4 168 13 11 82 0.51977
4 174 14 5 EE 4.19927
4 175 14 6 D8 27.04931
4 176 14 7 DE 10.14788
4 177 14 8 B2 0.83568
4 178 14 9 DB 4.37986
4 179 14 10 AA 0.78086
4 180 14 11 F4 4.94758
4 186 15 5 FE 2.40083
4 187 15 6 D3 32.60844
4 188 15 7 E0 4.03655
4 189 15 8 F7 16.93383
4 190 15 9 B3 0.82793
4 191 15 10 E2 1.47110
4 192 15 11 8A 0.55416
4 198 16 5 FF 182.91539
4 199 16 6 B3 0.71924
4 200 16 7 F9 1267.51088
4 201 16 8 19 0.40527
4 202 16 9 DF 2.16074
4 203 16 10 D4 1.62372
4 204 16 11 94 0.37896
4 205 17 0 EA 57.73966
4 206 17 1 D9 2223.63148
4 207 17 2 F8 98.60062
4 208 17 3 F8 27.17190
4 209 17 4 EF 222.11205
4 210 17 5 F2 19.88728
4 211 17 6 EA 98.61255
4 212 17 7 D6 1.75329
4 213 17 8 93 2.99008
4 214 17 9 AD 0.61227
4 215 17 10 A9 0.62633
4 216 17 11 C1 1.06034
4 217 18 0 5C 0.36737
4 218 18 1 E0 22.28932
4 219 18 2 F9 20114.91063
4 220 18 3 EA 29.74534
4 221 18 4 F3 126.62790
4 222 18 5 EE 3.59072
4 223 18 6 C2 1.02738
4 224 18 7 BF 1.00460
4 225 18 8 0 0.00000
4 226 18 9 EF 9.44708
4 227 18 10 F2 244.38978
4 228 18 11 EE 3.82632
4 229 19 0 E1 4.82802
4 230 19 1 D8 2.73959
4 231 19 2 DE 4.95615
4 232 19 3 D7 86.64663
4 233 19 4 B3 0.74871
4 234 19 5 A7 0.56773
4 235 19 6 0 0.00000
4 236 19 7 99 0.43718
4 237 19 8 A7 0.57748
4 238 19 9 BD 0.92651
4 239 19 10 EA 24.11198
4 240 19 11 F1 7.14684
4 241 20 0 FF 160.58752
4 242 20 1 E5 146.91013
4 243 20 2 DE 5.95353
4 244 20 3 E5 8.30635
4 245 20 4 E6 86.30094
4 246 20 5 E9 7.95367
4 247 20 6 BA 3.64208
4 248 20 7 DF 2.12878
4 249 20 8 FC 1113.96203
4 250 20 9 F6 5.91239
4 251 20 10 E9 16.59942
4 252 20 11 F9 13.66801
4 253 21 0 D1 11.14958
4 254 21 1 E4 3.23448
4 255 21 2 9D 0.66512
4 256 21 3 DC 6.96852
4 257 21 4 C2 1.06717
4 258 21 5 0 0.00000
4 259 21 6 F2 114.64349
4 260 21 7 F9 7.79799
4 261 21 8 E2 10.99702
4 262 21 9 F1 69.18931
4 263 21 10 F0 21.20138
4 264 21 11 EB 44.07008
4 265 22 0 ED 4.10416
4 266 22 1 D0 4.98566
4 267 22 2 DE 285.62318
4 268 22 3 D8 1.36315
4 269 22 4 8B 0.30468
4 270 22 5 8C 0.30916
4 271 22 6 D2 1.55059
4 272 22 7 F9 4.73747
4 273 22 8 BD 1.89656
4 274 22 9 FA 6.72598
4 275 22 10 FB 8.07405
4 276 22 11 A4 0.51470
4 277 23 0 B0 0.82469
4 278 23 1 77 0.46223
4 279 23 2 B4 0.84057
4 280 23 3 56 0.34946
4 281 23 4 A 2.54992
4 282 23 5 DE 2.06311
4 283 23 6 9E 1.95883
4 284 23 7 DE 4.21021
4 285 23 8 D8 3.89284
4 286 23 9 FB 263.57119
4 287 23 10 FB 1601.04512
4 288 23 11 15 0.04728
