1 1 0 0 -1600 69.53639
1 2 0 1 -1600 10.01640
1 3 0 2 -1600 429.75000
1 4 0 3 -1600 10.00637
1 5 0 4 -1600 9.00000
1 6 0 5 -1600 83.45396
1 7 0 6 -1600 10.32130
1 8 0 7 -1600 27.26426
1 9 0 8 -1600 9.00000
1 10 0 9 -1600 7.86238
1 18 1 0 -1559 4.63750
1 19 1 1 -1616 7.12015
1 20 1 2 -1548 4.17034
1 21 1 3 -1303 0.48623
1 22 1 4 -1531 3.31460
1 23 1 5 -1516 43.98394
1 24 1 6 -1519 20.57448
1 25 1 7 -1600 174.32352
1 26 1 8 -1600 135.70871
1 27 1 9 -1600 3.26188
1 28 1 10 -1600 8.96346
1 35 2 0 -1320 0.68246
1 36 2 1 -1523 3.92563
1 37 2 2 -1527 4.01401
1 38 2 3 -1463 2.31547
1 39 2 4 -1551 4.53819
1 40 2 5 -1502 2.95598
1 41 2 6 -1544 3.86128
1 42 2 7 -1566 4.22047
1 43 2 8 -1527 2.74799
1 44 2 9 -1551 2.83851
1 45 2 10 -1600 139.63185
1 46 2 11 -1600 12.17666
1 52 3 0 -1541 4.70710
1 53 3 1 -1417 1.68150
1 54 3 2 -1390 1.32942
1 55 3 3 -1564 5.58687
1 56 3 4 -1368 1.07411
1 57 3 5 -1496 3.17755
1 58 3 6 -1574 5.57689
1 59 3 7 -1614 7.20900
1 60 3 8 -1683 21.82191
1 61 3 9 -1502 2.39872
1 62 3 10 -1600 150.40884
1 63 3 11 -1600 62.19694
1 64 3 12 -1600 115.12408
1 69 4 0 -1556 5.05670
1 70 4 1 -1640 9.69855
1 71 4 2 -1455 2.26723
1 72 4 3 -1678 13.01600
1 73 4 4 -1625 9.00000
1 74 4 5 -1398 1.41392
1 75 4 6 -1411 1.58992
1 76 4 7 -1642 9.86100
1 77 4 8 -1651 9.93421
1 78 4 9 -1536 30.04803
1 79 4 10 -1493 2.32939
1 80 4 11 -1697 9.51281
1 81 4 12 -1690 14.57416
1 82 4 13 -1600 115.12408
1 86 5 0 -1611 6.76248
1 87 5 1 -1392 1.16583
1 88 5 2 -1453 2.02188
1 89 5 3 -1406 1.37716
1 90 5 4 -1537 4.27677
1 91 5 5 -1514 3.68642
1 92 5 6 -1638 19.53000
1 93 5 7 -1665 12.09438
1 94 5 8 -1440 2.00478
1 95 5 9 -1674 12.00990
1 96 5 10 -1541 3.97934
1 97 5 11 -1615 12.37125
1 98 5 12 -1647 13.13549
1 99 5 13 -1560 2.67924
1 100 5 14 -1600 110.43783
1 103 6 0 -1321 0.49403
1 104 6 1 -1295 0.39360
1 105 6 2 -1396 1.03269
1 106 6 3 -1282 0.38455
1 107 6 4 -1315 0.55891
1 108 6 5 -1459 2.14792
1 109 6 6 -1655 21.01208
1 110 6 7 -1615 8.19788
1 111 6 8 -1560 5.43749
1 112 6 9 -1449 2.20641
1 113 6 10 -1698 28.67384
1 114 6 11 -1543 32.37420
1 115 6 12 -1544 28.25832
1 116 6 13 -1611 4.83852
1 117 6 14 -1405 0.70583
1 118 6 15 -1600 17.57695
1 120 7 0 -1276 0.23522
1 121 7 1 -1387 0.68455
1 122 7 2 -1437 1.13296
1 123 7 3 -1537 2.83096
1 124 7 4 -1521 2.75270
1 125 7 5 -1507 2.74311
1 126 7 6 -1620 7.36065
1 127 7 7 -1468 2.38751
1 128 7 8 -1433 1.88511
1 129 7 9 -1361 1.03050
1 130 7 10 -1600 101.25000
1 131 7 11 -1681 101.25000
1 132 7 12 -1600 0.41178
1 133 7 13 -1630 104.67000
1 134 7 14 -1644 23.34338
1 135 7 15 -1600 202.50000
1 136 7 16 -1600 88.45182
1 137 8 0 -1441 0.64886
1 138 8 1 -1442 0.70455
1 139 8 2 -1367 0.41386
1 140 8 3 -1268 0.19200
1 141 8 4 -1360 0.53520
1 142 8 5 -1521 2.48769
1 143 8 6 -1474 1.95046
1 144 8 7 -1513 3.09784
1 145 8 8 -1567 5.17981
1 146 8 9 -1676 12.79544
1 147 8 10 -1534 4.43713
1 148 8 11 -1468 2.54838
1 149 8 12 -1455 2.12274
1 150 8 13 -1676 10.38713
1 151 8 14 -1575 3.97550
1 152 8 15 -1618 4.24601
1 153 8 16 -1600 107.72554
1 162 9 8 -1559 4.46556
1 163 9 9 -1598 6.76513
1 164 9 10 -1461 2.39464
1 165 9 11 -1643 20.66645
1 166 9 12 -1586 6.42397
1 167 9 13 -1679 11.59382
1 168 9 14 -1518 45.58500
1 169 9 15 -1585 30.50168
1 170 9 16 -1600 128.34490
1 179 10 8 -1578 4.53447
1 180 10 9 -1581 5.39825
1 181 10 10 -1621 16.30848
1 182 10 11 -1691 29.05671
1 183 10 12 -1578 49.54500
1 184 10 13 -1635 17.78038
1 185 10 14 -1635 7.81076
1 186 10 15 -1691 9.50224
1 187 10 16 -1600 148.16943
1 196 11 8 -1627 11.34480
1 197 11 9 -1548 3.80402
1 198 11 10 -1537 32.51375
1 199 11 11 -1681 26.38062
1 200 11 12 -1647 21.20958
1 201 11 13 -1670 24.22180
1 202 11 14 -1499 2.87950
1 203 11 15 -1686 20.11419
1 204 11 16 -1600 165.56198
1 213 12 8 -1590 3.61728
1 214 12 9 -1574 4.19868
1 215 12 10 -1623 7.34144
1 216 12 11 -1544 4.51781
1 217 12 12 -1594 7.07602
1 218 12 13 -1638 9.72801
1 219 12 14 -1618 15.25328
1 220 12 15 -1526 25.44970
1 221 12 16 -1600 45.94601
1 230 13 8 -1572 2.66019
1 231 13 9 -1613 5.09201
1 232 13 10 -1615 6.44737
1 233 13 11 -1610 7.27350
1 234 13 12 -1520 62.52574
1 235 13 13 -1560 5.38897
1 236 13 14 -1638 9.25246
1 237 13 15 -1495 2.60442
1 238 13 16 -1600 193.38912
1 247 14 8 -1606 5.96624
1 248 14 9 -1575 3.44501
1 249 14 10 -1645 7.70261
1 250 14 11 -1635 8.51800
1 251 14 12 -1674 12.56196
1 252 14 13 -1554 41.86666
1 253 14 14 -1665 11.47310
1 254 14 15 -1633 16.04883
1 255 14 16 -1600 99.04024
1 264 15 8 -1598 2.47218
1 265 15 9 -1586 3.49708
1 266 15 10 -1647 15.07753
1 267 15 11 -1563 4.82491
1 268 15 12 -1622 16.84635
1 269 15 13 -1620 17.36329
1 270 15 14 -1669 23.98321
1 271 15 15 -1678 22.68942
1 272 15 16 -1600 73.23511
1 281 16 8 -1486 0.94558
1 282 16 9 -1520 16.08536
1 283 16 10 -1594 4.92098
1 284 16 11 -1668 10.39290
1 285 16 12 -1678 12.67857
1 286 16 13 -1578 6.29337
1 287 16 14 -1636 18.81832
1 288 16 15 -1616 14.33016
1 289 16 16 -1600 202.50000
1 298 17 8 -1646 6.64152
1 299 17 9 -1615 4.22504
1 300 17 10 -1658 15.86024
1 301 17 11 -1613 13.78457
1 302 17 12 -1613 7.78100
1 303 17 13 -1628 9.13234
1 304 17 14 -1561 5.30148
1 305 17 15 -1519 3.40184
1 306 17 16 -1600 202.50000
1 315 18 8 -1668 8.37718
1 316 18 9 -1591 3.66435
1 317 18 10 -1539 26.26750
1 318 18 11 -1560 4.68705
1 319 18 12 -1620 8.34886
1 320 18 13 -1528 33.88726
1 321 18 14 -1595 6.94332
1 322 18 15 -1663 20.38042
1 323 18 16 -1600 17.03658
1 332 19 8 -1527 1.59498
1 333 19 9 -1488 1.72214
1 334 19 10 -1564 4.13509
1 335 19 11 -1536 31.72214
1 336 19 12 -1400 1.41196
1 337 19 13 -1674 25.78254
1 338 19 14 -1536 4.27619
1 339 19 15 -1610 6.73170
1 340 19 16 -1470 1.76983
1 349 20 8 -1517 1.73017
1 350 20 9 -1618 10.59136
1 351 20 10 -1489 2.40838
1 352 20 11 -1352 0.85420
1 353 20 12 -1469 2.57967
1 354 20 13 -1618 8.46074
1 355 20 14 -1391 1.24674
1 356 20 15 -1629 14.96208
1 357 20 16 -1600 14.78385
1 366 21 8 -1570 3.11545
1 367 21 9 -1436 1.36774
1 368 21 10 -1615 14.05250
1 369 21 11 -1507 3.33227
1 370 21 12 -1448 2.19060
1 371 21 13 -1627 9.00000
1 372 21 14 -1545 4.34436
1 373 21 15 -1626 6.86732
1 374 21 16 -1600 155.22064
1 383 22 8 -1357 0.61747
1 384 22 9 -1273 0.34550
1 385 22 10 -1578 5.54699
1 386 22 11 -1700 15.06616
1 387 22 12 -1506 3.52931
1 388 22 13 -1450 2.14777
1 389 22 14 -1697 13.06116
1 390 22 15 -1664 8.55788
1 391 22 16 -1428 1.01154
1 400 23 8 -1514 2.70770
1 401 23 9 -1514 3.18021
1 402 23 10 -1444 2.00537
1 403 23 11 -1445 2.11194
1 404 23 12 -1250 0.36274
1 405 23 13 -1560 5.05426
1 406 23 14 -1413 1.32307
1 407 23 15 -1654 14.52944
1 408 23 16 -1600 4.46166
1 417 24 8 -1431 1.55139
1 418 24 9 -1324 0.67770
1 419 24 10 -1545 4.78156
1 420 24 11 -1641 20.29832
1 421 24 12 -1545 4.69509
1 422 24 13 -1626 15.63880
1 423 24 14 -1419 1.26251
1 424 24 15 -1532 2.53574
1 425 24 16 -1600 128.34490
1 426 25 0 -1441 0.65409
1 427 25 1 -1630 3.13774
1 428 25 2 -1653 8.49682
1 429 25 3 -1631 4.16738
1 430 25 4 -1680 7.09930
1 431 25 5 -1583 4.02511
1 432 25 6 -1530 24.68487
1 433 25 7 -1687 11.62431
1 434 25 8 -1443 1.89940
1 435 25 9 -1621 16.94605
1 436 25 10 -1629 9.27680
1 437 25 11 -1604 7.46672
1 438 25 12 -1505 3.18914
1 439 25 13 -1372 0.89794
1 440 25 14 -1670 16.42504
1 441 25 15 -1424 0.88839
1 442 25 16 -1532 1.55538
1 443 26 0 -1593 3.53314
1 444 26 1 -1615 8.81297
1 445 26 2 -1430 1.06366
1 446 26 3 -1568 3.59812
1 447 26 4 -1425 1.24314
1 448 26 5 -1623 6.79348
1 449 26 6 -1600 100.21252
1 450 26 7 -1630 17.19635
1 451 26 8 -1481 2.79544
1 452 26 9 -1384 1.26110
1 453 26 10 -1385 1.25514
1 454 26 11 -1574 5.67246
1 455 26 12 -1535 3.72877
1 456 26 13 -1554 3.64250
1 457 26 14 -1539 2.57577
1 458 26 15 -1570 2.47738
1 459 26 16 -1600 2.74748
1 460 27 0 -1583 4.49130
1 461 27 1 -1334 0.56354
1 462 27 2 -1517 2.86438
1 463 27 3 -1647 8.28912
1 464 27 4 -1455 1.95323
1 465 27 5 -1590 6.12666
1 466 27 6 -1585 6.25133
1 467 27 7 -1499 3.28741
1 468 27 8 -1625 9.00000
1 469 27 9 -1661 11.61741
1 470 27 10 -1463 2.32884
1 471 27 11 -1331 0.66656
1 472 27 12 -1289 0.39208
1 473 27 13 -1441 1.24373
1 474 27 14 -1635 9.00000
1 475 27 15 -1557 1.77437
1 477 28 0 -1262 0.34663
1 478 28 1 -1573 5.14798
1 479 28 2 -1300 0.51767
1 480 28 3 -1482 2.64762
1 481 28 4 -1380 1.14913
1 482 28 5 -1548 4.82013
1 483 28 6 -1641 20.00000
1 484 28 7 -1256 0.38526
1 485 28 8 -1619 16.84037
1 486 28 9 -1337 0.76722
1 487 28 10 -1320 0.60150
1 488 28 11 -1407 1.15263
1 489 28 12 -1458 1.48103
1 490 28 13 -1610 3.95639
1 491 28 14 -1542 1.73173
1 494 29 0 -1517 3.69021
1 495 29 1 -1565 5.49645
1 496 29 2 -1455 2.25818
1 497 29 3 -1391 1.30125
1 498 29 4 -1579 6.28073
1 499 29 5 -1331 0.78821
1 500 29 6 -1424 1.78527
1 501 29 7 -1350 0.89341
1 502 29 8 -1465 2.28654
1 503 29 9 -1568 4.86487
1 504 29 10 -1365 0.77982
1 505 29 11 -1622 10.95523
1 506 29 12 -1688 14.28368
1 507 29 13 -1578 2.39676
1 511 30 0 -1390 1.32702
1 512 30 1 -1468 2.57886
1 513 30 2 -1361 1.01708
1 514 30 3 -1532 4.35614
1 515 30 4 -1459 2.35446
1 516 30 5 -1488 2.97489
1 517 30 6 -1427 1.68884
1 518 30 7 -1454 2.00112
1 519 30 8 -1507 2.85420
1 520 30 9 -1649 7.51186
1 521 30 10 -1389 0.78801
1 522 30 11 -1588 26.76451
1 523 30 12 -1600 17.64745
1 528 31 0 -1585 101.25000
1 529 31 1 -1354 0.93359
1 530 31 2 -1358 0.94377
1 531 31 3 -1501 3.15147
1 532 31 4 -1441 1.84855
1 533 31 5 -1524 28.19467
1 534 31 6 -1512 2.98732
1 535 31 7 -1474 1.98073
1 536 31 8 -1350 0.60986
1 537 31 9 -1608 4.41110
1 538 31 10 -1598 3.38769
1 539 31 11 -1273 0.16665
1 545 32 0 -1214 0.21762
1 546 32 1 -1469 2.22309
1 547 32 2 -1488 2.54882
1 548 32 3 -1656 18.38425
1 549 32 4 -1268 0.33223
1 550 32 5 -1602 5.38556
1 551 32 6 -1626 5.90877
1 552 32 7 -1493 1.85365
1 553 32 8 -1367 0.54341
1 554 32 9 -1388 0.54886
1 555 32 10 -1393 0.46208
1 562 33 0 -1416 1.16849
1 563 33 1 -1268 0.30195
1 564 33 2 -1476 1.85988
1 565 33 3 -1276 0.29887
1 566 33 4 -1142 0.07188
1 567 33 5 -1558 2.95488
1 568 33 6 -1583 3.19817
1 569 33 7 -1396 0.59859
1 570 33 8 -1310 0.23012
1 571 33 9 -1381 0.35876
2 1 0 0 -1600 69.40824
2 2 0 1 -1600 93.37368
2 3 0 2 -1600 202.50000
2 4 0 3 -1600 118.93033
2 5 0 4 -1600 155.14044
2 6 0 5 -1600 165.56198
2 7 0 6 -1600 148.16943
2 8 0 7 -1600 128.34490
2 9 0 8 -1600 52.49609
2 10 0 9 -1600 88.45182
2 18 1 0 -1449 1.89224
2 19 1 1 -1356 0.83930
2 20 1 2 -1377 0.99454
2 21 1 3 -1436 1.58492
2 22 1 4 -1432 1.46839
2 23 1 5 -1639 7.07946
2 24 1 6 -1697 9.98906
2 25 1 7 -1481 1.68668
2 26 1 8 -1637 4.94166
2 27 1 9 -1574 2.53807
2 28 1 10 -1600 5.03287
2 35 2 0 -1630 18.00000
2 36 2 1 -1520 3.80824
2 37 2 2 -1626 8.60305
2 38 2 3 -1533 4.11486
2 39 2 4 -1431 1.71312
2 40 2 5 -1471 2.28060
2 41 2 6 -1609 12.93732
2 42 2 7 -1546 3.56587
2 43 2 8 -1535 2.93236
2 44 2 9 -1656 12.67785
2 45 2 10 -1598 54.23985
2 46 2 11 -1600 14.18814
2 52 3 0 -1477 2.78633
2 53 3 1 -1284 0.49959
2 54 3 2 -1517 3.88413
2 55 3 3 -1412 1.60032
2 56 3 4 -1426 1.78762
2 57 3 5 -1491 3.01628
2 58 3 6 -1692 13.60734
2 59 3 7 -1630 8.12314
2 60 3 8 -1698 12.27459
2 61 3 9 -1535 24.95450
2 62 3 10 -1544 23.11980
2 63 3 11 -1598 3.60603
2 64 3 12 -1600 110.95402
2 69 4 0 -1556 5.08180
2 70 4 1 -1490 3.00583
2 71 4 2 -1371 1.09911
2 72 4 3 -1432 1.88049
2 73 4 4 -1514 3.77932
2 74 4 5 -1403 1.49255
2 75 4 6 -1689 28.38752
2 76 4 7 -1608 7.58535
2 77 4 8 -1530 3.88614
2 78 4 9 -1663 10.01832
2 79 4 10 -1674 18.82348
2 80 4 11 -1641 6.31544
2 81 4 12 -1518 1.96370
2 82 4 13 -1600 14.02260
2 86 5 0 -1463 2.10396
2 87 5 1 -1335 0.69772
2 88 5 2 -1455 2.03612
2 89 5 3 -1679 12.11046
2 90 5 4 -1323 0.68374
2 91 5 5 -1612 7.91427
2 92 5 6 -1339 0.82943
2 93 5 7 -1628 9.25835
2 94 5 8 -1675 12.74930
2 95 5 9 -1690 27.06495
2 96 5 10 -1652 9.40367
2 97 5 11 -1521 2.98318
2 98 5 12 -1584 4.06703
2 99 5 13 -1558 21.19104
2 100 5 14 -1600 9.81670
2 103 6 0 -1559 3.71869
2 104 6 1 -1317 0.48712
2 105 6 2 -1409 1.15624
2 106 6 3 -1405 1.18379
2 107 6 4 -1445 1.78463
2 108 6 5 -1370 0.99529
2 109 6 6 -1452 2.13078
2 110 6 7 -1506 3.48112
2 111 6 8 -1411 1.60319
2 112 6 9 -1651 10.80006
2 113 6 10 -1676 12.27272
2 114 6 11 -1583 5.57300
2 115 6 12 -1371 0.82325
2 116 6 13 -1562 3.33536
2 117 6 14 -1400 0.67330
2 118 6 15 -1600 100.83892
2 120 7 0 -1313 0.33604
2 121 7 1 -1366 0.56688
2 122 7 2 -1471 1.50308
2 123 7 3 -1266 0.26449
2 124 7 4 -1247 0.24405
2 125 7 5 -1491 2.40604
2 126 7 6 -1381 1.02982
2 127 7 7 -1579 5.82457
2 128 7 8 -1681 26.47884
2 129 7 9 -1531 69.48000
2 130 7 10 -1647 10.47971
2 131 7 11 -1547 4.54657
2 132 7 12 -1699 25.89796
2 133 7 13 -1616 11.74721
2 134 7 14 -1605 4.28635
2 135 7 15 -1686 11.91119
2 136 7 16 -1600 88.45182
2 137 8 0 -1355 0.30736
2 138 8 1 -1692 5.00028
2 139 8 2 -1332 0.30017
2 140 8 3 -1409 0.69746
2 141 8 4 -1377 0.62188
2 142 8 5 -1638 6.14504
2 143 8 6 -1694 10.81850
2 144 8 7 -1552 33.79194
2 145 8 8 -1451 2.03441
2 146 8 9 -1518 30.28582
2 147 8 10 -1547 4.92585
2 148 8 11 -1649 10.51965
2 149 8 12 -1568 42.25038
2 150 8 13 -1612 12.93350
2 151 8 14 -1524 21.45485
2 152 8 15 -1634 9.67147
2 153 8 16 -1600 41.51849
2 162 9 8 -1671 10.40203
2 163 9 9 -1594 6.52199
2 164 9 10 -1455 2.27520
2 165 9 11 -1544 38.47800
2 166 9 12 -1621 16.89380
2 167 9 13 -1564 77.71500
2 168 9 14 -1698 11.34604
2 169 9 15 -1665 7.02898
2 170 9 16 -1600 9.00907
2 179 10 8 -1566 32.92738
2 180 10 9 -1473 2.28240
2 181 10 10 -1502 3.22163
2 182 10 11 -1461 2.41041
2 183 10 12 -1585 6.57670
2 184 10 13 -1624 8.24928
2 185 10 14 -1598 5.89896
2 186 10 15 -1657 7.47113
2 187 10 16 -1600 148.16943
2 196 11 8 -1697 19.00886
2 197 11 9 -1659 17.60930
2 198 11 10 -1659 10.25391
2 199 11 11 -1471 2.59630
2 200 11 12 -1553 5.17447
2 201 11 13 -1393 1.30976
2 202 11 14 -1621 14.89160
2 203 11 15 -1376 0.83960
2 204 11 16 -1600 165.56198
2 213 12 8 -1542 2.51232
2 214 12 9 -1651 15.01166
2 215 12 10 -1535 3.72881
2 216 12 11 -1627 17.16833
2 217 12 12 -1609 7.98088
2 218 12 13 -1680 13.27249
2 219 12 14 -1627 8.20774
2 220 12 15 -1600 90.69079
2 221 12 16 -1600 122.31753
2 230 13 8 -1694 6.64167
2 231 13 9 -1595 35.58550
2 232 13 10 -1464 1.94224
2 233 13 11 -1537 4.10426
2 234 13 12 -1658 22.43514
2 235 13 13 -1414 1.61563
2 236 13 14 -1468 2.42605
2 237 13 15 -1695 12.18747
2 238 13 16 -1600 193.38912
2 247 14 8 -1684 10.60561
2 248 14 9 -1618 4.81040
2 249 14 10 -1625 13.21391
2 250 14 11 -1644 9.19951
2 251 14 12 -1599 7.18715
2 252 14 13 -1669 12.51251
2 253 14 14 -1600 7.03869
2 254 14 15 -1639 16.83630
2 255 14 16 -1600 189.27000
2 264 15 8 -1600 2.49533
2 265 15 9 -1516 2.02497
2 266 15 10 -1540 3.29642
2 267 15 11 -1577 5.34933
2 268 15 12 -1481 2.81086
2 269 15 13 -1545 4.82164
2 270 15 14 -1464 2.41213
2 271 15 15 -1561 4.69497
2 272 15 16 -1600 7.21488
2 281 16 8 -1670 3.98250
2 282 16 9 -1390 0.66952
2 283 16 10 -1685 9.61266
2 284 16 11 -1587 45.35136
2 285 16 12 -1462 2.35250
2 286 16 13 -1416 1.66241
2 287 16 14 -1675 12.62547
2 288 16 15 -1609 13.63540
2 289 16 16 -1600 23.88045
2 298 17 8 -1350 0.29521
2 299 17 9 -1449 1.11966
2 300 17 10 -1481 2.00200
2 301 17 11 -1530 3.64930
2 302 17 12 -1501 3.26344
2 303 17 13 -1531 4.30474
2 304 17 14 -1619 8.28062
2 305 17 15 -1559 4.63435
2 306 17 16 -1600 8.01911
2 315 18 8 -1503 1.16797
2 316 18 9 -1597 3.83478
2 317 18 10 -1617 5.95981
2 318 18 11 -1488 2.63058
2 319 18 12 -1314 0.64429
2 320 18 13 -1550 40.50000
2 321 18 14 -1568 5.60638
2 322 18 15 -1641 8.54224
2 323 18 16 -1600 94.63101
2 332 19 8 -1511 1.41500
2 333 19 9 -1538 2.59971
2 334 19 10 -1468 1.91210
2 335 19 11 -1488 2.70690
2 336 19 12 -1446 2.08964
2 337 19 13 -1589 6.85989
2 338 19 14 -1511 3.48660
2 339 19 15 -1532 3.67376
2 340 19 16 -1600 202.50000
2 349 20 8 -1436 0.87926
2 350 20 9 -1634 5.96341
2 351 20 10 -1478 2.21674
2 352 20 11 -1667 11.11251
2 353 20 12 -1591 6.77715
2 354 20 13 -1617 8.41026
2 355 20 14 -1458 2.22927
2 356 20 15 -1652 8.85997
2 357 20 16 -1600 193.38912
2 366 21 8 -1636 10.21522
2 367 21 9 -1513 2.59282
2 368 21 10 -1678 22.33512
2 369 21 11 -1410 1.48021
2 370 21 12 -1571 5.94667
2 371 21 13 -1612 16.00171
2 372 21 14 -1625 8.07716
2 373 21 15 -1544 3.66784
2 374 21 16 -1600 52.42500
2 383 22 8 -1488 1.90309
2 384 22 9 -1682 10.47795
2 385 22 10 -1535 3.98530
2 386 22 11 -1465 2.46756
2 387 22 12 -1562 5.56964
2 388 22 13 -1473 2.63270
2 389 22 14 -1496 2.80642
2 390 22 15 -1692 20.96577
2 391 22 16 -1600 13.50632
2 400 23 8 -1500 2.41907
2 401 23 9 -1573 5.07436
2 402 23 10 -1301 0.55579
2 403 23 11 -1663 11.79324
2 404 23 12 -1613 8.14635
2 405 23 13 -1602 6.94280
2 406 23 14 -1523 26.34366
2 407 23 15 -1542 3.09881
2 408 23 16 -1600 121.98588
2 417 24 8 -1672 10.43130
2 418 24 9 -1642 18.83789
2 419 24 10 -1482 2.85575
2 420 24 11 -1601 7.46620
2 421 24 12 -1466 2.47804
2 422 24 13 -1651 9.46987
2 423 24 14 -1477 2.06233
2 424 24 15 -1600 4.26987
2 425 24 16 -1600 122.53275
2 426 25 0 -1525 10.45668
2 427 25 1 -1637 6.65278
2 428 25 2 -1560 33.28860
2 429 25 3 -1457 1.04457
2 430 25 4 -1639 5.25210
2 431 25 5 -1456 1.45954
2 432 25 6 -1608 11.33362
2 433 25 7 -1512 3.07030
2 434 25 8 -1580 5.78970
2 435 25 9 -1551 4.97514
2 436 25 10 -1515 3.81334
2 437 25 11 -1548 4.88569
2 438 25 12 -1490 2.82293
2 439 25 13 -1614 6.55531
2 440 25 14 -1507 2.33134
2 441 25 15 -1530 2.15039
2 442 25 16 -1600 107.72554
2 443 26 0 -1383 0.63516
2 444 26 1 -1424 0.93769
2 445 26 2 -1371 0.63922
2 446 26 3 -1468 1.59594
2 447 26 4 -1415 1.13566
2 448 26 5 -1581 4.92319
2 449 26 6 -1370 0.93773
2 450 26 7 -1470 2.42964
2 451 26 8 -1691 14.20383
2 452 26 9 -1545 4.86984
2 453 26 10 -1521 3.94247
2 454 26 11 -1527 3.90457
2 455 26 12 -1598 6.10770
2 456 26 13 -1675 9.14812
2 457 26 14 -1595 4.01925
2 458 26 15 -1636 4.08791
2 459 26 16 -1600 5.70173
2 460 27 0 -1457 1.63564
2 461 27 1 -1536 3.19518
2 462 27 2 -1342 0.64338
2 463 27 3 -1360 0.79234
2 464 27 4 -1339 0.70540
2 465 27 5 -1448 1.94309
2 466 27 6 -1633 17.90605
2 467 27 7 -1435 1.91904
2 468 27 8 -1356 0.97685
2 469 27 9 -1379 1.18490
2 470 27 10 -1420 1.61158
2 471 27 11 -1546 4.13661
2 472 27 12 -1328 0.55817
2 473 27 13 -1482 1.73262
2 474 27 14 -1316 0.31364
2 475 27 15 -1510 1.23251
2 477 28 0 -1503 2.93124
2 478 28 1 -1614 7.08271
2 479 28 2 -1361 0.90963
2 480 28 3 -1353 0.86640
2 481 28 4 -1439 1.90389
2 482 28 5 -1320 0.68859
2 483 28 6 -1347 0.89539
2 484 28 7 -1448 2.19574
2 485 28 8 -1426 1.78268
2 486 28 9 -1494 3.00650
2 487 28 10 -1498 2.84850
2 488 28 11 -1434 1.44293
2 489 28 12 -1398 0.88353
2 490 28 13 -1380 0.59805
2 491 28 14 -1396 0.51281
2 494 29 0 -1326 0.71875
2 495 29 1 -1575 5.87892
2 496 29 2 -1398 1.39759
2 497 29 3 -1509 3.56592
2 498 29 4 -1438 2.01857
2 499 29 5 -1590 6.87821
2 500 29 6 -1398 1.40902
2 501 29 7 -1534 4.29345
2 502 29 8 -1471 2.40482
2 503 29 9 -1429 1.56072
2 504 29 10 -1286 0.37548
2 505 29 11 -1543 2.94822
2 506 29 12 -1467 1.28588
2 507 29 13 -1390 0.50472
2 511 30 0 -1414 1.64427
2 512 30 1 -1494 3.22337
2 513 30 2 -1463 2.49878
2 514 30 3 -1396 1.38415
2 515 30 4 -1605 7.59162
2 516 30 5 -1505 3.39607
2 517 30 6 -1495 2.99937
2 518 30 7 -1406 1.33756
2 519 30 8 -1395 1.10462
2 520 30 9 -1492 2.20435
2 521 30 10 -1473 1.62353
2 522 30 11 -1520 1.95785
2 523 30 12 -1431 0.72849
2 528 31 0 -1362 1.00353
2 529 31 1 -1320 0.68067
2 530 31 2 -1340 0.80183
2 531 31 3 -1596 6.73844
2 532 31 4 -1362 0.92782
2 533 31 5 -1426 1.56744
2 534 31 6 -1535 3.58620
2 535 31 7 -1444 1.56622
2 536 31 8 -1449 1.44636
2 537 31 9 -1541 2.62236
2 538 31 10 -1554 2.41049
2 539 31 11 -1497 1.21050
2 545 32 0 -1172 0.14133
2 546 32 1 -1424 1.53349
2 547 32 2 -1354 0.80301
2 548 32 3 -1389 1.06245
2 549 32 4 -1513 2.85676
2 550 32 5 -1384 0.89998
2 551 32 6 -1358 0.65424
2 552 32 7 -1325 0.43025
2 553 32 8 -1597 3.63837
2 554 32 9 -1528 1.77173
2 555 32 10 -1561 1.84862
2 562 33 0 -1395 0.97463
2 563 33 1 -1461 1.69848
2 564 33 2 -1295 0.37551
2 565 33 3 -1366 0.69319
2 566 33 4 -1317 0.41036
2 567 33 5 -1366 0.59469
2 568 33 6 -1447 1.07093
2 569 33 7 -1489 1.32179
2 570 33 8 -1376 0.41997
2 571 33 9 -1301 0.17399
