3 1 0 0 C0 1.00903
3 2 0 1 D2 2.51597
3 3 0 2 C3 1.04363
3 4 0 3 D1 1.24963
3 5 0 4 E3 2.61939
3 6 0 5 DE 2.24532
3 7 0 6 F6 8.66865
3 8 0 7 F8 74.53318
3 9 0 8 F0 831.89755
3 10 0 9 EB 5.94150
3 11 0 10 F3 63.62894
3 12 0 11 EC 51.74498
3 13 1 0 B3 2.75364
3 14 1 1 29 0.21920
3 15 1 2 AC 0.79751
3 16 1 3 C9 1.13032
3 17 1 4 B2 0.73497
3 18 1 5 F8 4.67266
3 19 1 6 F6 4.36818
3 20 1 7 F4 8.38770
3 21 1 8 FA 10.45814
3 22 1 9 ED 30.82248
3 23 1 10 EA 33.15386
3 24 1 11 EF 104.54856
3 25 2 0 0 0.25197
3 26 2 1 83 0.51631
3 27 2 2 C6 8.42517
3 28 2 3 FC 4.56991
3 29 2 4 92 0.35806
3 30 2 5 B6 1.55041
3 31 2 6 E9 12.26416
3 32 2 7 F4 145.79533
3 33 2 8 FD 10.04355
3 34 2 9 E9 6.26987
3 35 2 10 F9 39.97437
3 36 2 11 F6 72.46941
3 37 3 0 5B 0.25749
3 38 3 1 6D 1.16026
3 39 3 2 DF 1.52378
3 40 3 3 CC 1.17486
3 41 3 4 87 0.30066
3 42 3 5 A9 4.61923
3 43 3 6 B6 37.16750
3 44 3 7 FF 186.74985
3 45 3 8 FB 20.70886
3 46 3 9 F3 15.93092
3 47 3 10 EF 224.39798
3 48 3 11 E2 66.63346
3 49 4 0 CA 0.94006
3 50 4 1 D9 5.35881
3 51 4 2 0 0.22154
3 52 4 3 FC 2.31749
3 53 4 4 C0 1.01649
3 54 4 5 A2 0.50284
3 55 4 6 BA 0.87084
3 56 4 7 FE 22.88553
3 57 4 8 F0 7.35880
3 58 4 9 EC 6.62578
3 59 4 10 F8 29.38381
3 60 4 11 F0 138.93116
3 61 5 0 3B 0.48832
3 62 5 1 F 0.59551
3 63 5 2 96 0.62909
3 64 5 3 42 0.60915
3 65 5 4 87 112.61239
3 66 5 5 68 0.16779
3 67 5 6 8F 0.34996
3 68 5 7 89 0.29766
3 69 5 8 BD 0.94074
3 70 5 9 FE 5.66713
3 71 5 10 FA 143.32453
3 72 5 11 F4 8.29162
3 73 6 0 1B 0.56454
3 74 6 1 72 0.21621
3 75 6 2 38 0.28174
3 76 6 3 0 0.18775
3 77 6 4 2C 0.06652
3 78 6 5 60 2.29483
3 79 6 6 85 0.28897
3 80 6 7 C7 1.22981
3 81 6 8 CC 1.31307
3 82 6 9 B5 0.80266
3 83 6 10 CC 1.33047
3 84 6 11 EB 3.24040
3 90 7 5 86 0.29118
3 91 7 6 7E 0.25127
3 92 7 7 64 0.15530
3 93 7 8 C4 1.10649
3 94 7 9 C4 1.09445
3 95 7 10 FD 5.29739
3 96 7 11 E7 2.86536
3 102 8 5 8D 0.56731
3 103 8 6 DC 1.39617
3 104 8 7 EA 3.44262
3 105 8 8 CE 1.18801
3 106 8 9 A3 0.71761
3 107 8 10 D5 32.35684
3 108 8 11 EC 1.84645
3 114 9 5 AE 0.81569
3 115 9 6 DB 1.42847
3 116 9 7 DA 1.39501
3 117 9 8 D5 1.29688
3 118 9 9 C5 1.07814
3 119 9 10 ED 3.60430
3 120 9 11 FD 2.33974
3 126 10 5 41 0.17148
3 127 10 6 79 0.47494
3 128 10 7 EC 58.16296
3 129 10 8 87 0.54558
3 130 10 9 CC 1.19545
3 131 10 10 58 0.35323
3 132 10 11 E3 26.67915
3 138 11 5 0 0.37718
3 139 11 6 B8 0.91866
3 140 11 7 A8 0.75176
3 141 11 8 FC 2.33174
3 142 11 9 8F 0.58739
3 143 11 10 E7 1.70708
3 144 11 11 E5 1.65821
3 150 12 5 0 0.18852
3 151 12 6 FF 79.40733
3 152 12 7 DE 11.72216
3 153 12 8 E1 98.93357
3 154 12 9 0 27667.50016
3 155 12 10 0 0.19038
3 156 12 11 F3 32.94018
3 162 13 5 FE 18.16104
3 163 13 6 F9 4.45930
3 164 13 7 F1 31.25941
3 165 13 8 E9 13.99147
3 166 13 9 7E 0.50312
3 167 13 10 0 0.18650
3 168 13 11 FA 2.23915
3 174 14 5 F1 3.87168
3 175 14 6 D0 19.41430
3 176 14 7 FC 617.34244
3 177 14 8 5B 376.32492
3 178 14 9 FF 153.18404
3 179 14 10 6B 0.41143
3 180 14 11 77 1.83742
3 186 15 5 0 0.18660
3 187 15 6 EF 119.56899
3 188 15 7 E0 12.24222
3 189 15 8 C9 1.11125
3 190 15 9 0 0.18627
3 191 15 10 FB 392.92811
3 192 15 11 FA 35.91181
3 198 16 5 FF 9668.38474
3 199 16 6 FF 186.18173
3 200 16 7 EB 14.78127
3 201 16 8 BA 0.87325
3 202 16 9 E6 2.77426
3 203 16 10 0 640.00000
3 204 16 11 FF 207.41298
3 205 17 0 DF 153.65930
3 206 17 1 FF 158.42407
3 207 17 2 D2 81.09807
3 208 17 3 D5 43.39687
3 209 17 4 FF 186.11207
3 210 17 5 FF 186.18173
3 211 17 6 EF 3.64978
3 212 17 7 0 6400.00000
3 213 17 8 BE 0.97951
3 214 17 9 C6 1.23364
3 215 17 10 0 1600.00000
3 216 17 11 D8 1.95381
3 217 18 0 E7 466.58508
3 218 18 1 FF 639.22565
3 219 18 2 D5 5.31253
3 220 18 3 F1 64.82519
3 221 18 4 FF 388.97267
3 222 18 5 FF 183.84143
3 223 18 6 E9 5.82271
3 224 18 7 B1 0.68851
3 225 18 8 E0 2.22313
3 226 18 9 F7 82.10931
3 227 18 10 F2 7.52580
3 228 18 11 F6 9.20469
3 229 19 0 FF 672.70783
3 230 19 1 F6 15.52448
3 231 19 2 E7 6.75119
3 232 19 3 FF 160.48288
3 233 19 4 FF 45.97212
3 234 19 5 A0 0.49061
3 235 19 6 CB 1.29341
3 236 19 7 D3 1.71034
3 237 19 8 F2 15.92461
3 238 19 9 EB 27.38616
3 239 19 10 FF 195.90295
3 240 19 11 EE 20.40991
3 241 20 0 FF 584.82977
3 242 20 1 D9 113.26472
3 243 20 2 EC 7.27315
3 244 20 3 FC 55.51841
3 245 20 4 F3 8.03874
3 246 20 5 ED 267.25351
3 247 20 6 D1 1.48881
3 248 20 7 F5 8.07937
3 249 20 8 FB 83.04944
3 250 20 9 F4 7.88463
3 251 20 10 EE 13.44177
3 252 20 11 DF 2.28181
3 253 21 0 FD 121.73344
3 254 21 1 ED 197.12617
3 255 21 2 E1 6.13114
3 256 21 3 D5 40.82541
3 257 21 4 D9 1.91008
3 258 21 5 F7 4.37403
3 259 21 6 EC 12.39517
3 260 21 7 F5 24.76576
3 261 21 8 EE 15.11796
3 262 21 9 FF 187.48941
3 263 21 10 EF 454.20237
3 264 21 11 EC 12.53377
3 265 22 0 FF 597.33768
3 266 22 1 FF 456.25646
3 267 22 2 DE 3.01789
3 268 22 3 D4 42.19593
3 269 22 4 D0 1.52790
3 270 22 5 DB 1.96810
3 271 22 6 EC 13.27616
3 272 22 7 F8 23.93371
3 273 22 8 FE 111.94752
3 274 22 9 EE 46.77075
3 275 22 10 ED 178.55648
3 276 22 11 F3 7.95697
3 277 23 0 E0 24.46409
3 278 23 1 E7 6.79587
3 279 23 2 E6 3.29014
3 280 23 3 D0 2.34154
3 281 23 4 F0 3.58932
3 282 23 5 33 0.07277
3 283 23 6 FB 57.73144
3 284 23 7 EF 14.14972
3 285 23 8 F8 25.97489
3 286 23 9 EC 270.03204
3 287 23 10 EB 38.85360
3 288 23 11 FF 12016.10418
4 1 0 0 B4 0.86463
4 2 0 1 C1 1.01164
4 3 0 2 AA 0.78381
4 4 0 3 DD 2.91830
4 5 0 4 E9 91.37836
4 6 0 5 94 0.39108
4 7 0 6 F5 111.42465
4 8 0 7 FC 25.60424
4 9 0 8 FF 642.60154
4 10 0 9 F7 62.08456
4 11 0 10 E9 70.93566
4 12 0 11 E3 2.42391
4 13 1 0 7D 0.49690
4 14 1 1 BB 0.94671
4 15 1 2 DA 5.85939
4 16 1 3 AE 0.80837
4 17 1 4 AE 0.66538
4 18 1 5 BF 2.07402
4 19 1 6 FA 9.66189
4 20 1 7 ED 6.74901
4 21 1 8 EC 12.77269
4 22 1 9 F1 25.45686
4 23 1 10 FD 22.89487
4 24 1 11 FA 27.12968
4 25 2 0 0 0.09719
4 26 2 1 86 0.54809
4 27 2 2 A2 0.70323
4 28 2 3 EB 1.76535
4 29 2 4 D6 1.64402
4 30 2 5 BE 0.94394
4 31 2 6 EC 3.25040
4 32 2 7 F7 57.00244
4 33 2 8 ED 13.81010
4 34 2 9 F9 9.87503
4 35 2 10 F8 43.25954
4 36 2 11 E9 28.41089
4 37 3 0 70 0.44109
4 38 3 1 E9 8.84546
4 39 3 2 9B 0.66690
4 40 3 3 F9 2.21369
4 41 3 4 AB 0.61334
4 42 3 5 CD 1.38324
4 43 3 6 FA 4.95831
4 44 3 7 CE 1.44817
4 45 3 8 EC 3.27240
4 46 3 9 F0 7.19614
4 47 3 10 F2 15.75508
4 48 3 11 F8 18.99664
4 49 4 0 AB 0.78513
4 50 4 1 6D 0.42279
4 51 4 2 E0 3.09275
4 52 4 3 D0 1.22760
4 53 4 4 99 0.43287
4 54 4 5 B9 0.81741
4 55 4 6 B2 0.74071
4 56 4 7 D2 1.49894
4 57 4 8 CA 1.26510
4 58 4 9 FF 186.18173
4 59 4 10 FB 50.27220
4 60 4 11 F0 14.75690
4 61 5 0 FD 37.59517
4 62 5 1 79 0.47507
4 63 5 2 F3 18.60503
4 64 5 3 43 0.29780
4 65 5 4 66 0.16239
4 66 5 5 9F 0.49064
4 67 5 6 AA 0.59329
4 68 5 7 E7 2.73423
4 69 5 8 CF 1.48849
4 70 5 9 FD 11.14551
4 71 5 10 F1 7.45806
4 72 5 11 F7 98.77981
4 73 6 0 B2 0.85095
4 74 6 1 5E 0.34464
4 75 6 2 6C 0.42158
4 76 6 3 2D 1.56482
4 77 6 4 93 0.37608
4 78 6 5 8C 0.32356
4 79 6 6 FD 5.40029
4 80 6 7 FA 164.71204
4 81 6 8 EE 3.55720
4 82 6 9 E6 2.74190
4 83 6 10 D4 1.59449
4 84 6 11 ED 27.89837
4 90 7 5 95 0.38423
4 91 7 6 7F 0.25354
4 92 7 7 DB 1.97093
4 93 7 8 D7 1.74436
4 94 7 9 E4 2.62066
4 95 7 10 F0 3.66522
4 96 7 11 EE 7.33004
4 102 8 5 EA 33.04781
4 103 8 6 F6 4.27793
4 104 8 7 F6 34.22898
4 105 8 8 ED 3.67426
4 106 8 9 D1 1.22369
4 107 8 10 EA 1.75716
4 108 8 11 F3 14.27740
4 114 9 5 BB 0.92752
4 115 9 6 E2 50.21087
4 116 9 7 F4 29.65589
4 117 9 8 E2 3.12925
4 118 9 9 DF 97.89390
4 119 9 10 9B 0.65775
4 120 9 11 DB 5.66407
4 126 10 5 B8 0.91524
4 127 10 6 A8 0.76167
4 128 10 7 E5 1.61692
4 129 10 8 D1 1.24168
4 130 10 9 D1 1.27228
4 131 10 10 CA 1.12615
4 132 10 11 F6 4.25920
4 138 11 5 CC 1.17175
4 139 11 6 8B 0.55695
4 140 11 7 B2 0.84980
4 141 11 8 D5 1.27834
4 142 11 9 D6 7.81367
4 143 11 10 F8 2.13470
4 144 11 11 D9 2.77973
4 150 12 5 F5 16.18450
4 151 12 6 E6 1.63784
4 152 12 7 E2 1.58059
4 153 12 8 FC 4.93233
4 154 12 9 FA 2.26172
4 155 12 10 E7 3.43915
4 156 12 11 DF 2.93873
4 162 13 5 DD 1.43210
4 163 13 6 8F 0.58674
4 164 13 7 DD 25.14384
4 165 13 8 EF 5.00323
4 166 13 9 F1 5.93694
4 167 13 10 EA 3.43980
4 168 13 11 FA 2.25036
4 174 14 5 D1 22.31460
4 175 14 6 EB 35.53589
4 176 14 7 E0 21.11470
4 177 14 8 E6 1.64669
4 178 14 9 F8 6.77151
4 179 14 10 D4 1.29069
4 180 14 11 D1 6.01458
4 186 15 5 FC 4.65593
4 187 15 6 E8 21.73896
4 188 15 7 F6 10.98627
4 189 15 8 D3 20.07229
4 190 15 9 F5 2.03188
4 191 15 10 EF 3.58655
4 192 15 11 C7 1.07679
4 198 16 5 FF 182.91539
4 199 16 6 E1 2.29030
4 200 16 7 F8 1209.12928
4 201 16 8 F4 4.19533
4 202 16 9 EF 6.86586
4 203 16 10 FF 5.83324
4 204 16 11 C2 1.03475
4 205 17 0 FF 160.98361
4 206 17 1 FF 988.28066
4 207 17 2 D4 458.04237
4 208 17 3 F6 211.71715
4 209 17 4 EA 785.64638
4 210 17 5 F7 46.83589
4 211 17 6 F6 4.38278
4 212 17 7 F6 4.33196
4 213 17 8 BF 3.87387
4 214 17 9 F2 3.72085
4 215 17 10 DF 2.27726
4 216 17 11 EB 3.21000
4 217 18 0 59 0.35854
4 218 18 1 F4 59.45546
4 219 18 2 EA 1986.65784
4 220 18 3 FD 78.80633
4 221 18 4 E9 46.76445
4 222 18 5 EA 3.10915
4 223 18 6 DC 2.01700
4 224 18 7 D4 1.65140
4 225 18 8 0 8979.20000
4 226 18 9 F8 49.57685
4 227 18 10 FF 184.15663
4 228 18 11 F5 19.59422
4 229 19 0 F3 6.31072
4 230 19 1 F2 4.00769
4 231 19 2 D7 18.32860
4 232 19 3 FF 158.69346
4 233 19 4 D2 1.55555
4 234 19 5 AE 0.65224
4 235 19 6 0 640.00000
4 236 19 7 BF 1.01059
4 237 19 8 BC 0.92992
4 238 19 9 FF 5.79018
4 239 19 10 EF 108.57591
4 240 19 11 EA 46.98361
4 241 20 0 F8 71.63829
4 242 20 1 E8 76.55580
4 243 20 2 E6 6.71905
4 244 20 3 DF 15.12206
4 245 20 4 F3 30.92346
4 246 20 5 F3 86.12442
4 247 20 6 C8 1.28181
4 248 20 7 FD 5.29309
4 249 20 8 FF 603.13427
4 250 20 9 FC 29.23904
4 251 20 10 FE 63.07265
4 252 20 11 F0 81.38514
4 253 21 0 FB 41.23299
4 254 21 1 F9 4.39346
4 255 21 2 B8 0.89686
4 256 21 3 E4 7.79503
4 257 21 4 D8 1.85698
4 258 21 5 0 1.12565
4 259 21 6 F5 125.73094
4 260 21 7 F7 30.26211
4 261 21 8 F0 33.86555
4 262 21 9 FF 439.41950
4 263 21 10 F9 14.05345
4 264 21 11 EC 179.89533
4 265 22 0 F5 18.26171
4 266 22 1 F9 17.92823
4 267 22 2 D5 254.65636
4 268 22 3 F9 2.20188
4 269 22 4 E3 2.40035
4 270 22 5 EE 3.24045
4 271 22 6 FE 5.66776
4 272 22 7 F9 4.73747
4 273 22 8 E9 5.95448
4 274 22 9 F6 24.15829
4 275 22 10 F3 25.28065
4 276 22 11 F7 8.67628
4 277 23 0 F6 2.09151
4 278 23 1 E7 1.68317
4 279 23 2 E1 1.50659
4 280 23 3 D0 1.21201
4 281 23 4 EF 111.70904
4 282 23 5 ED 6.37929
4 283 23 6 FC 5.39174
4 284 23 7 FA 9.76139
4 285 23 8 EA 12.90875
4 286 23 9 F8 233.89441
4 287 23 10 F0 285.54398
4 288 23 11 54 0.23785
