!SETdevice 0
!setctrl 0 0
!sleep 100
!rdac E0 0xF6
!sleep 100
!rdac E2 0xEA
!sleep 100
!rdac E4 0xFC
!sleep 100
!rdac E6 0xFD
!sleep 100
!rdac E8 0xF8
!sleep 100
!rdac EA 0xFF
!sleep 100
!rdac EC 0xEF
!sleep 100
!rdac EE 0xF0
!sleep 100
!rdac F0 0xF0
!sleep 100
!rdac F2 0xFF
!sleep 100
!rdac F4 0xFF
!sleep 100
!rdac F6 0xFF
!sleep 100
!rdac F8 0xF0
!sleep 100
!rdac FA 0xF0
!sleep 100
!rdac FC 0xFF
!sleep 100
!rdac FE 0xFF
!sleep 100
!setctrl 0 1
!sleep 100
!rdac E0 0xEB
!sleep 100
!rdac E2 0xF1
!sleep 100
!rdac E4 0xF1
!sleep 100
!rdac E6 0x45
!sleep 100
!rdac E8 0xFF
!sleep 100
!rdac EA 0xF7
!sleep 100
!rdac EC 0xFF
!sleep 100
!rdac EE 0xFF
!sleep 100
!rdac F0 0xED
!sleep 100
!rdac F2 0xFF
!sleep 100
!rdac F4 0xFF
!sleep 100
!rdac F6 0xFF
!sleep 100
!rdac F8 0xFF
!sleep 100
!rdac FA 0xF3
!sleep 100
!rdac FC 0xF0
!sleep 100
!rdac FE 0xF6
!sleep 100
!setctrl 0 2
!sleep 100
!rdac E0 0xF0
!sleep 100
!rdac E2 0xD7
!sleep 100
!rdac E4 0x12
!sleep 100
!rdac E6 0x1F
!sleep 100
!rdac E8 0xF0
!sleep 100
!rdac EA 0x1C
!sleep 100
!rdac EC 0xF6
!sleep 100
!rdac EE 0x30
!sleep 100
!rdac F0 0xF5
!sleep 100
!rdac F2 0xB7
!sleep 100
!rdac F4 0xFF
!sleep 100
!rdac F6 0xF8
!sleep 100
!rdac F8 0xEC
!sleep 100
!rdac FA 0xEF
!sleep 100
!rdac FC 0xF1
!sleep 100
!rdac FE 0xEB
!sleep 100
!setctrl 0 3
!sleep 100
!rdac E0 0x0
!sleep 100
!rdac E2 0xEF
!sleep 100
!rdac E4 0xEF
!sleep 100
!rdac E6 0xFA
!sleep 100
!rdac E8 0x31
!sleep 100
!rdac EA 0xEA
!sleep 100
!rdac EC 0xA3
!sleep 100
!rdac EE 0xF2
!sleep 100
!rdac F0 0xE3
!sleep 100
!rdac F2 0xF9
!sleep 100
!rdac F4 0xB4
!sleep 100
!rdac F6 0xF5
!sleep 100
!rdac F8 0xF4
!sleep 100
!rdac FA 0xE2
!sleep 100
!rdac FC 0xE4
!sleep 100
!setctrl 1 0
!sleep 100
!rdac E0 0x8D
!sleep 100
!rdac E2 0xFE
!sleep 100
!rdac E4 0x0
!sleep 100
!rdac E6 0x0
!sleep 100
!rdac E8 0xE7
!sleep 100
!rdac EA 0xF9
!sleep 100
!rdac EC 0xF1
!sleep 100
!rdac EE 0x81
!sleep 100
!rdac F0 0x0
!sleep 100
!rdac F2 0xF7
!sleep 100
!rdac F4 0xFF
!sleep 100
!rdac F6 0xF6
!sleep 100
!rdac F8 0xED
!sleep 100
!rdac FA 0xF9
!sleep 100
!rdac FC 0xF9
!sleep 100
!setctrl 1 1
!sleep 100
!rdac E0 0xF1
!sleep 100
!rdac E2 0xFF
!sleep 100
!rdac E4 0xEF
!sleep 100
!rdac E6 0xF5
!sleep 100
!rdac E8 0xFF
!sleep 100
!rdac EA 0xF8
!sleep 100
!rdac EC 0xF0
!sleep 100
!rdac EE 0xC7
!sleep 100
!rdac F0 0xBB
!sleep 100
!rdac F2 0x60
!sleep 100
!rdac F4 0xAC
!sleep 100
!rdac F6 0xDC
!sleep 100
!rdac F8 0x29
!sleep 100
!rdac FA 0xFD
!sleep 100
!rdac FC 0xF7
!sleep 100
!rdac FE 0xFF
!sleep 100
!setctrl 1 2
!sleep 100
!rdac E0 0xF0
!sleep 100
!rdac E2 0xAE
!sleep 100
!rdac E4 0xFA
!sleep 100
!rdac E6 0xF0
!sleep 100
!rdac E8 0xF0
!sleep 100
!rdac EA 0xFF
!sleep 100
!rdac EC 0xF0
!sleep 100
!rdac EE 0xE9
!sleep 100
!rdac F0 0xFB
!sleep 100
!rdac F2 0xFF
!sleep 100
!rdac F4 0xED
!sleep 100
!rdac F6 0xF4
!sleep 100
!rdac F8 0xFF
!sleep 100
!rdac FA 0xFC
!sleep 100
!rdac FC 0xD1
!sleep 100
!rdac FE 0xF7
!sleep 100
!setctrl 1 3
!sleep 100
!rdac E0 0xF4
!sleep 100
!rdac E2 0xFF
!sleep 100
!rdac E4 0xFF
!sleep 100
!rdac E6 0xFC
!sleep 100
!rdac E8 0xF0
!sleep 100
!rdac EA 0xF0
!sleep 100
!rdac EC 0xF5
!sleep 100
!rdac EE 0xF8
!sleep 100
!rdac F0 0xFD
!sleep 100
!rdac F2 0xFF
!sleep 100
!rdac F4 0xF0
!sleep 100
!rdac F6 0xF5
!sleep 100
!rdac F8 0xE2
!sleep 100
!rdac FA 0xF7
!sleep 100
!rdac FC 0xFF
!sleep 100
!rdac FE 0xFF
!sleep 100
!setctrl 2 0
!sleep 100
!rdac E0 0xFD
!sleep 100
!rdac E2 0xFF
!sleep 100
!rdac E4 0xDC
!sleep 100
!rdac E6 0xDC
!sleep 100
!rdac E8 0xA6
!sleep 100
!rdac EA 0xE7
!sleep 100
!rdac EC 0xFD
!sleep 100
!rdac EE 0xFB
!sleep 100
!rdac F0 0xDE
!sleep 100
!rdac F2 0x4F
!sleep 100
!rdac F4 0x10
!sleep 100
!rdac F6 0xEA
!sleep 100
!rdac F8 0x13
!sleep 100
!rdac FA 0xF6
!sleep 100
!rdac FC 0xDA
!sleep 100
!rdac FE 0xD1
!sleep 100
!setctrl 2 1
!sleep 100
!rdac E0 0xE7
!sleep 100
!rdac E2 0xF7
!sleep 100
!rdac E8 0xFF
!sleep 100
!rdac EC 0xFF
!sleep 100
!rdac F0 0xFF
!sleep 100
!rdac F2 0xF7
!sleep 100
!rdac F4 0xFF
!sleep 100
!rdac F6 0xE9
!sleep 100
!rdac F8 0xD2
!sleep 100
!rdac FA 0xEB
!sleep 100
!rdac FC 0xD7
!sleep 100
!rdac FE 0xE3
!sleep 100
!setctrl 2 2
!sleep 100
!rdac E0 0x34
!sleep 100
!rdac E2 0x35
!sleep 100
!rdac E4 0x46
!sleep 100
!rdac E6 0x1B
!sleep 100
!rdac E8 0xD4
!sleep 100
!rdac EA 0x3
!sleep 100
!rdac EC 0xAE
!sleep 100
!rdac EE 0xF0
!sleep 100
!rdac F0 0x58
!sleep 100
!rdac F2 0xDF
!sleep 100
!rdac F4 0xFA
!sleep 100
!rdac F6 0x5C
!sleep 100
!rdac F8 0x42
!sleep 100
!rdac FA 0x12
!sleep 100
!rdac FC 0x2F
!sleep 100
!rdac FE 0x13
!sleep 100
!setctrl 2 3
!sleep 100
!rdac E0 0xB2
!sleep 100
!rdac E2 0x58
!sleep 100
!rdac E4 0xF2
!sleep 100
!rdac E6 0xD7
!sleep 100
!rdac E8 0xDE
!sleep 100
!rdac EA 0x14
!sleep 100
!rdac EC 0xA8
!sleep 100
!rdac EE 0xFF
!sleep 100
!rdac F8 0x0
!sleep 100
!rdac FA 0xD
!sleep 100
!rdac FC 0x88
!sleep 100
!rdac FE 0x5B
!sleep 100
!setctrl 3 0
!sleep 100
!rdac E0 0x14
!sleep 100
!rdac E2 0x48
!sleep 100
!rdac E4 0x25
!sleep 100
!rdac E6 0x36
!sleep 100
!rdac E8 0x0
!sleep 100
!rdac EA 0x6
!sleep 100
!rdac EC 0x24
!sleep 100
!rdac EE 0x21
!sleep 100
!rdac F0 0x0
!sleep 100
!rdac F2 0x20
!sleep 100
!rdac F4 0x27
!sleep 100
!rdac F6 0xE5
!sleep 100
!rdac F8 0x0
!sleep 100
!rdac FA 0x0
!sleep 100
!rdac FC 0x24
!sleep 100
!rdac FE 0xD4
!sleep 100
!setctrl 3 1
!sleep 100
!rdac E4 0xF1
!sleep 100
!rdac E6 0x2C
!sleep 100
!rdac EA 0x0
!sleep 100
!rdac EE 0x0
!sleep 100
!rdac F0 0x0
!sleep 100
!rdac F2 0xE
!sleep 100
!rdac F4 0x2B
!sleep 100
!rdac F6 0x35
!sleep 100
!rdac F8 0xFF
!sleep 100
!rdac FA 0x33
!sleep 100
!rdac FC 0x42
!sleep 100
!rdac FE 0xE8
!sleep 100
!setctrl 3 2
!sleep 100
!rdac E0 0xEC
!sleep 100
!rdac E2 0x0
!sleep 100
!rdac E4 0x3F
!sleep 100
!rdac E6 0x56
!sleep 100
!rdac E8 0x1D
!sleep 100
!rdac EA 0x1E
!sleep 100
!rdac EC 0x41
!sleep 100
!rdac EE 0x29
!sleep 100
!rdac F0 0x43
!sleep 100
!rdac F2 0x3C
!sleep 100
!rdac F4 0x5
!sleep 100
!rdac F6 0xE8
!sleep 100
!rdac F8 0xB2
!sleep 100
!rdac FA 0xE
!sleep 100
!rdac FC 0x3C
!sleep 100
!rdac FE 0x4A
!sleep 100
!setctrl 3 3
!sleep 100
!rdac E0 0x1E
!sleep 100
!rdac E2 0xEC
!sleep 100
!rdac E4 0xB1
!sleep 100
!rdac E6 0x79
!sleep 100
!rdac E8 0x49
!sleep 100
!rdac EA 0x4D
!sleep 100
!rdac EC 0xB9
!sleep 100
!rdac EE 0xED
!sleep 100
!rdac F0 0x24
!sleep 100
!rdac F2 0x3A
!sleep 100
!rdac F4 0x5A
!sleep 100
!rdac F6 0x4A
!sleep 100
!SETdevice 1
!setctrl 0 0
!sleep 100
!rdac E0 0x31
!sleep 100
!rdac E2 0x4E
!sleep 100
!rdac E4 0x41
!sleep 100
!rdac E6 0x92
!sleep 100
!rdac E8 0x1D
!sleep 100
!rdac EA 0x24
!sleep 100
!rdac EC 0x7C
!sleep 100
!rdac EE 0x34
!sleep 100
!rdac F0 0x0
!sleep 100
!rdac F2 0x51
!sleep 100
!rdac F4 0x46
!sleep 100
!rdac F6 0x4B
!sleep 100
!rdac F8 0x33
!sleep 100
!rdac FA 0x21
!sleep 100
!rdac FC 0x1F
!sleep 100
!rdac FE 0x2A
!sleep 100
!setctrl 0 1
!sleep 100
!rdac E4 0x55
!sleep 100
!rdac E6 0xF7
!sleep 100
!rdac EA 0x0
!sleep 100
!rdac EE 0x0
!sleep 100
!rdac F0 0x5C
!sleep 100
!rdac F2 0x0
!sleep 100
!rdac F4 0x0
!sleep 100
!rdac F6 0x0
!sleep 100
!rdac F8 0x26
!sleep 100
!rdac FA 0x0
!sleep 100
!rdac FC 0x0
!sleep 100
!rdac FE 0x10
!sleep 100
!setctrl 0 2
!sleep 100
!rdac E0 0x6A
!sleep 100
!rdac E2 0xFE
!sleep 100
!rdac E4 0xE2
!sleep 100
!rdac E6 0xFC
!sleep 100
!rdac E8 0x56
!sleep 100
!rdac EA 0xFF
!sleep 100
!rdac EC 0xD1
!sleep 100
!rdac EE 0xFF
!sleep 100
!rdac F0 0x22
!sleep 100
!rdac F2 0xFF
!sleep 100
!rdac F4 0x24
!sleep 100
!rdac F6 0xD6
!sleep 100
!rdac F8 0x2E
!sleep 100
!rdac FA 0xB
!sleep 100
!rdac FC 0xFE
!sleep 100
!rdac FE 0xD2
!sleep 100
!setctrl 0 3
!sleep 100
!rdac E0 0xF5
!sleep 100
!rdac E2 0x0
!sleep 100
!rdac E8 0xFC
!sleep 100
!rdac EC 0xFF
!sleep 100
!rdac F0 0xFB
!sleep 100
!rdac F2 0x9B
!sleep 100
!rdac F4 0xDF
!sleep 100
!rdac F6 0xFF
!sleep 100
!rdac F8 0xCD
!sleep 100
!rdac FA 0xD7
!sleep 100
!rdac FC 0xDE
!sleep 100
!rdac FE 0xE7
!sleep 100
!setctrl 1 0
!sleep 100
!rdac E0 0xE8
!sleep 100
!rdac E2 0x7E
!sleep 100
!rdac E4 0xFF
!sleep 100
!rdac E6 0xED
!sleep 100
!rdac E8 0xD8
!sleep 100
!rdac EA 0x7F
!sleep 100
!rdac EC 0x4C
!sleep 100
!rdac EE 0xE0
!sleep 100
!rdac F8 0x11
!sleep 100
!rdac FA 0xD5
!sleep 100
!rdac FC 0xF3
!sleep 100
!rdac FE 0xF6
!sleep 100
!setctrl 1 1
!sleep 100
!rdac E0 0xD1
!sleep 100
!rdac E2 0x2
!sleep 100
!rdac E4 0xF1
!sleep 100
!rdac E6 0xC1
!sleep 100
!rdac E8 0xF
!sleep 100
!rdac EA 0x0
!sleep 100
!rdac EC 0xCB
!sleep 100
!rdac EE 0xF1
!sleep 100
!rdac F0 0x98
!sleep 100
!rdac F2 0xE8
!sleep 100
!rdac F4 0xEF
!sleep 100
!rdac F6 0xD9
!sleep 100
!rdac F8 0xD7
!sleep 100
!rdac FA 0x71
!sleep 100
!rdac FC 0x5E
!sleep 100
!rdac FE 0xD5
!sleep 100
!setctrl 1 2
!sleep 100
!rdac E0 0x3E
!sleep 100
!rdac E2 0xC1
!sleep 100
!rdac E4 0xE4
!sleep 100
!rdac E6 0xE2
!sleep 100
!rdac E8 0x77
!sleep 100
!rdac EA 0x50
!sleep 100
!rdac EC 0xE
!sleep 100
!rdac EE 0x5
!sleep 100
!rdac F0 0xD0
!sleep 100
!rdac F2 0x48
!sleep 100
!rdac F4 0xF6
!sleep 100
!rdac F6 0x37
!sleep 100
!rdac F8 0x2E
!sleep 100
!rdac FA 0x58
!sleep 100
!rdac FC 0xC8
!sleep 100
!rdac FE 0xAA
!sleep 100
!setctrl 1 3
!sleep 100
!rdac E0 0x44
!sleep 100
!rdac E2 0x35
!sleep 100
!rdac E4 0xA
!sleep 100
!rdac E6 0xC6
!sleep 100
!rdac E8 0x3
!sleep 100
!rdac EA 0x17
!sleep 100
!rdac EC 0xF1
!sleep 100
!rdac EE 0x16
!sleep 100
!rdac F0 0x4
!sleep 100
!rdac F2 0x20
!sleep 100
!rdac F4 0xF0
!sleep 100
!rdac F6 0xE8
!sleep 100
!setctrl 2 0
!sleep 100
!rdac E0 0xFB
!sleep 100
!rdac E2 0x95
!sleep 100
!rdac E4 0xFA
!sleep 100
!rdac E6 0x88
!sleep 100
!rdac E8 0xF5
!sleep 100
!rdac EA 0xF2
!sleep 100
!rdac EC 0xF7
!sleep 100
!rdac EE 0xEB
!sleep 100
!rdac F0 0xEA
!sleep 100
!rdac F2 0xED
!sleep 100
!rdac F4 0xF7
!sleep 100
!rdac F6 0xF6
!sleep 100
!rdac F8 0xF0
!sleep 100
!rdac FA 0xF1
!sleep 100
!rdac FC 0x94
!sleep 100
!rdac FE 0xF3
!sleep 100
!setctrl 2 1
!sleep 100
!rdac E0 0x6E
!sleep 100
!rdac E2 0xE9
!sleep 100
!rdac E4 0x0
!sleep 100
!rdac E6 0xFF
!sleep 100
!rdac E8 0xF8
!sleep 100
!rdac EA 0xFF
!sleep 100
!rdac EC 0xFE
!sleep 100
!rdac EE 0xFF
!sleep 100
!rdac F0 0xF7
!sleep 100
!rdac F2 0xFF
!sleep 100
!rdac F4 0xF5
!sleep 100
!rdac F6 0xF3
!sleep 100
!rdac F8 0xEB
!sleep 100
!rdac FA 0xF7
!sleep 100
!rdac FC 0xF1
!sleep 100
!rdac FE 0xF2
!sleep 100
!setctrl 2 2
!sleep 100
!rdac E0 0xED
!sleep 100
!rdac E2 0xF6
!sleep 100
!rdac E4 0xCB
!sleep 100
!rdac E6 0xFF
!sleep 100
!rdac E8 0x0
!sleep 100
!rdac EA 0xF3
!sleep 100
!rdac EC 0xC3
!sleep 100
!rdac EE 0xDF
!sleep 100
!rdac F0 0xF5
!sleep 100
!rdac F2 0x0
!sleep 100
!rdac F4 0xE4
!sleep 100
!rdac F6 0xF8
!sleep 100
!rdac F8 0xFF
!sleep 100
!rdac FA 0xFF
!sleep 100
!rdac FC 0xF0
!sleep 100
!rdac FE 0xF0
!sleep 100
!setctrl 2 3
!sleep 100
!rdac E0 0xEB
!sleep 100
!rdac E2 0xF9
!sleep 100
!rdac E4 0xEE
!sleep 100
!rdac E8 0xF8
!sleep 100
!rdac EA 0xF1
!sleep 100
!rdac EC 0xF7
!sleep 100
!rdac EE 0xFF
!sleep 100
!rdac F0 0xED
!sleep 100
!rdac F2 0xD5
!sleep 100
!rdac F4 0xF6
!sleep 100
!rdac F6 0xFF
!sleep 100
!rdac F8 0xEF
!sleep 100
!rdac FA 0xFF
!sleep 100
!rdac FC 0xE9
!sleep 100
!rdac FE 0xF1
!sleep 100
!setctrl 3 0
!sleep 100
!rdac E0 0xFA
!sleep 100
!rdac E2 0xFF
!sleep 100
!rdac E4 0xF5
!sleep 100
!rdac E6 0xFF
!sleep 100
!rdac E8 0xFE
!sleep 100
!rdac EA 0xFF
!sleep 100
!rdac EC 0xEC
!sleep 100
!rdac EE 0xF1
!sleep 100
!rdac F0 0xFC
!sleep 100
!rdac F2 0xFF
!sleep 100
!rdac F4 0xFB
!sleep 100
!rdac F6 0x7
!sleep 100
!rdac F8 0xFE
!sleep 100
!rdac FA 0xF2
!sleep 100
!rdac FC 0xED
!sleep 100
!setctrl 3 1
!sleep 100
!rdac E0 0xFF
!sleep 100
!rdac E2 0xFF
!sleep 100
!rdac E4 0xFB
!sleep 100
!rdac E6 0xFE
!sleep 100
!rdac E8 0xFF
!sleep 100
!rdac EA 0xEA
!sleep 100
!rdac EC 0xFF
!sleep 100
!rdac EE 0xF7
!sleep 100
!rdac F0 0xEF
!sleep 100
!rdac F2 0xFE
!sleep 100
!rdac F4 0xEF
!sleep 100
!rdac F6 0xD5
!sleep 100
!rdac F8 0xEF
!sleep 100
!rdac FA 0xF5
!sleep 100
!rdac FC 0xF6
!sleep 100
!rdac FE 0x19
!sleep 100
!setctrl 3 2
!sleep 100
!rdac E0 0xEF
!sleep 100
!rdac E2 0xFB
!sleep 100
!rdac E4 0xF9
!sleep 100
!rdac E6 0xF8
!sleep 100
!rdac E8 0xFF
!sleep 100
!rdac EA 0xFF
!sleep 100
!rdac EC 0xF0
!sleep 100
!rdac EE 0xEA
!sleep 100
!rdac F0 0xE9
!sleep 100
!rdac F2 0xF2
!sleep 100
!rdac F4 0xF2
!sleep 100
!rdac F6 0xBF
!sleep 100
!rdac F8 0xE6
!sleep 100
!rdac FA 0xF2
!sleep 100
!rdac FC 0xF8
!sleep 100
!rdac FE 0xF1
!sleep 100
!setctrl 3 3
!sleep 100
!rdac E0 0xFF
!sleep 100
!rdac E2 0xE9
!sleep 100
!rdac E4 0xF8
!sleep 100
!rdac E6 0xF0
!sleep 100
!rdac E8 0xFF
!sleep 100
!rdac EA 0xEC
!sleep 100
!rdac EC 0xF0
!sleep 100
!rdac EE 0xE9
!sleep 100
!rdac F0 0xFE
!sleep 100
!rdac F2 0xFD
!sleep 100
!rdac F4 0xF0
!sleep 100
!rdac F6 0xFF
!sleep 100
!rdac F8 0xFF
!sleep 100
!rdac FA 0xFB
!sleep 100
!rdac FC 0xFF
!sleep 100
!rdac FE 0xE9
!sleep 100
