1 1 0 0 -1600 140505.24966
1 2 0 1 -1588 58.00059
1 3 0 2 -1600 2879428.22389
1 4 0 3 -1542 64.27800
1 5 0 4 -1600 213.16373
1 6 0 5 -1600 19587.61687
1 7 0 6 -1534 50.98702
1 8 0 7 -1600 9928.94400
1 9 0 8 -1421 1.20000
1 10 0 9 -1421 1.20000
1 18 1 0 -1597 2.13791
1 19 1 1 -1563 1.67851
1 20 1 2 -1454 0.66968
1 21 1 3 -1257 0.11729
1 22 1 4 -1514 1.11983
1 23 1 5 -1678 3.95293
1 24 1 6 -1660 3.43833
1 25 1 7 -1600 7971480.96662
1 26 1 8 -1600 340693.58822
1 27 1 9 -1527 9.85390
1 28 1 10 -1421 1.20000
1 35 2 0 -1319 0.20833
1 36 2 1 -1405 0.44434
1 37 2 2 -1378 0.35937
1 38 2 3 -1391 0.40003
1 39 2 4 -1479 0.84233
1 40 2 5 -1393 0.40212
1 41 2 6 -1476 0.83256
1 42 2 7 -1511 1.09761
1 43 2 8 -1439 0.57867
1 44 2 9 -1487 1.50868
1 45 2 10 -1600 110099499.64400
1 46 2 11 -1494 16.03338
1 52 3 0 -1516 1.11812
1 53 3 1 -1302 0.17619
1 54 3 2 -1249 0.10438
1 55 3 3 -1412 0.47363
1 56 3 4 -1303 0.18037
1 57 3 5 -1388 0.38258
1 58 3 6 -1400 0.42635
1 59 3 7 -1454 0.68087
1 60 3 8 -1608 5.02180
1 61 3 9 -1510 1.09036
1 62 3 10 -1600 11520867.44100
1 63 3 11 -1600 576.98942
1 64 3 12 -1600 109118083.19300
1 69 4 0 -1426 0.53943
1 70 4 1 -1428 0.54785
1 71 4 2 -1330 0.22588
1 72 4 3 -1448 0.65961
1 73 4 4 -1458 0.76854
1 74 4 5 -1430 0.55112
1 75 4 6 -1308 0.18803
1 76 4 7 -1525 1.32371
1 77 4 8 -1469 0.77777
1 78 4 9 -1592 2.07887
1 79 4 10 -1468 0.77265
1 80 4 11 -1513 2.20734
1 81 4 12 -1688 4.23838
1 82 4 13 -1600 4522750.82987
1 86 5 0 -1469 0.77828
1 87 5 1 -1246 0.10390
1 88 5 2 -1293 0.16229
1 89 5 3 -1280 0.14314
1 90 5 4 -1426 0.53910
1 91 5 5 -1387 0.38322
1 92 5 6 -1578 1.86007
1 93 5 7 -1483 0.87819
1 94 5 8 -1415 0.49387
1 95 5 9 -1628 2.73427
1 96 5 10 -1520 1.17649
1 97 5 11 -1642 3.04297
1 98 5 12 -1674 3.84632
1 99 5 13 -1430 3.60115
1 100 5 14 -1600 2256513413.60000
1 103 6 0 -1285 0.14762
1 104 6 1 -1204 0.06805
1 105 6 2 -1250 0.10725
1 106 6 3 -1160 0.04392
1 107 6 4 -1215 0.07599
1 108 6 5 -1332 0.23822
1 109 6 6 -1593 2.06859
1 110 6 7 -1506 1.05537
1 111 6 8 -1491 0.91297
1 112 6 9 -1433 0.57202
1 113 6 10 -1652 3.25140
1 114 6 11 -1655 3.35512
1 115 6 12 -1669 3.73875
1 116 6 13 -1559 1.58566
1 117 6 14 -1459 0.71246
1 118 6 15 -1600 10541.78082
1 120 7 0 -1267 0.25607
1 121 7 1 -1287 0.15467
1 122 7 2 -1357 0.29208
1 123 7 3 -1369 0.33001
1 124 7 4 -1398 0.41802
1 125 7 5 -1390 0.38578
1 126 7 6 -1481 0.86792
1 127 7 7 -1485 0.87674
1 128 7 8 -1376 0.34827
1 129 7 9 -1385 0.37492
1 130 7 10 -1600 2387584.77132
1 131 7 11 -1638 204.76340
1 132 7 12 -1600 0.18885
1 133 7 13 -1695 76.76726
1 134 7 14 -1651 10.31961
1 135 7 15 -1600 8779152.90375
1 136 7 16 -1600 118929040.50800
1 137 8 0 -1453 0.66811
1 138 8 1 -1457 0.69046
1 139 8 2 -1352 0.27728
1 140 8 3 -1273 0.13353
1 141 8 4 -1344 0.26031
1 142 8 5 -1473 0.80307
1 143 8 6 -1365 0.31559
1 144 8 7 -1433 0.56787
1 145 8 8 -1403 0.43721
1 146 8 9 -1556 1.58185
1 147 8 10 -1475 0.79956
1 148 8 11 -1385 0.37612
1 149 8 12 -1408 0.45581
1 150 8 13 -1579 1.89475
1 151 8 14 -1476 0.82039
1 152 8 15 -1556 1.54423
1 153 8 16 -1600 47705189.39650
1 162 9 8 -1511 1.08916
1 163 9 9 -1499 1.00480
1 164 9 10 -1406 0.45781
1 165 9 11 -1596 2.15878
1 166 9 12 -1460 0.71731
1 167 9 13 -1596 2.11908
1 168 9 14 -1688 26.01598
1 169 9 15 -1697 15.27078
1 170 9 16 -1600 786091523.22300
1 179 10 8 -1500 0.99039
1 180 10 9 -1620 2.57370
1 181 10 10 -1568 1.75061
1 182 10 11 -1630 2.74914
1 183 10 12 -1643 3.05913
1 184 10 13 -1665 7.18086
1 185 10 14 -1558 1.59654
1 186 10 15 -1568 1.70873
1 187 10 16 -1600 233670007.53600
1 196 11 8 -1636 2.89244
1 197 11 9 -1474 0.80173
1 198 11 10 -1625 2.66395
1 199 11 11 -1576 1.81783
1 200 11 12 -1568 1.72024
1 201 11 13 -1616 2.49633
1 202 11 14 -1425 0.52515
1 203 11 15 -1533 1.30974
1 204 11 16 -1600 209320159.15200
1 213 12 8 -1536 1.32881
1 214 12 9 -1432 0.56466
1 215 12 10 -1516 1.15072
1 216 12 11 -1386 0.38251
1 217 12 12 -1428 0.54152
1 218 12 13 -1479 0.84091
1 219 12 14 -1610 2.37899
1 220 12 15 -1659 3.45397
1 221 12 16 -1600 15834.94575
1 230 13 8 -1539 1.37147
1 231 13 9 -1513 1.10124
1 232 13 10 -1452 0.65584
1 233 13 11 -1460 0.72877
1 234 13 12 -1625 5.29971
1 235 13 13 -1458 0.71041
1 236 13 14 -1406 0.45486
1 237 13 15 -1462 0.73691
1 238 13 16 -1600 352157708.19300
1 247 14 8 -1642 2.99788
1 248 14 9 -1463 0.74495
1 249 14 10 -1461 0.73002
1 250 14 11 -1463 0.73775
1 251 14 12 -1569 1.74234
1 252 14 13 -1669 3.73067
1 253 14 14 -1586 1.98763
1 254 14 15 -1586 1.98638
1 255 14 16 -1600 111572.46706
1 264 15 8 -1571 1.74772
1 265 15 9 -1460 0.72156
1 266 15 10 -1550 1.48084
1 267 15 11 -1385 0.37847
1 268 15 12 -1528 1.27190
1 269 15 13 -1522 1.18628
1 270 15 14 -1596 2.16258
1 271 15 15 -1596 2.16147
1 272 15 16 -1600 4068.64705
1 281 16 8 -1419 0.50586
1 282 16 9 -1641 5.99176
1 283 16 10 -1467 0.77120
1 284 16 11 -1447 0.64983
1 285 16 12 -1485 0.89198
1 286 16 13 -1363 0.31118
1 287 16 14 -1554 1.54558
1 288 16 15 -1615 2.45722
1 289 16 16 -1600 435865814.97500
1 298 17 8 -1656 3.33430
1 299 17 9 -1503 1.04296
1 300 17 10 -1614 2.44126
1 301 17 11 -1477 0.82575
1 302 17 12 -1465 0.74694
1 303 17 13 -1458 0.70993
1 304 17 14 -1399 0.42546
1 305 17 15 -1449 0.65707
1 306 17 16 -1600 32797036.25460
1 315 18 8 -1610 4.73521
1 316 18 9 -1529 1.24796
1 317 18 10 -1626 2.62872
1 318 18 11 -1430 0.55256
1 319 18 12 -1444 0.63203
1 320 18 13 -1631 2.79998
1 321 18 14 -1480 0.83571
1 322 18 15 -1654 3.32846
1 323 18 16 -1600 116.16093
1 332 19 8 -1476 0.82309
1 333 19 9 -1382 0.36978
1 334 19 10 -1444 0.63520
1 335 19 11 -1663 3.55797
1 336 19 12 -1331 0.23084
1 337 19 13 -1658 3.38366
1 338 19 14 -1465 0.75261
1 339 19 15 -1528 1.25147
1 340 19 16 -1398 0.57538
1 349 20 8 -1502 1.02150
1 350 20 9 -1603 2.25971
1 351 20 10 -1362 0.30430
1 352 20 11 -1280 0.14298
1 353 20 12 -1390 0.39524
1 354 20 13 -1565 1.68927
1 355 20 14 -1308 0.18854
1 356 20 15 -1683 4.15228
1 357 20 16 -1586 377.12368
1 366 21 8 -1480 0.84611
1 367 21 9 -1327 0.22224
1 368 21 10 -1579 1.86694
1 369 21 11 -1382 0.36581
1 370 21 12 -1376 0.34459
1 371 21 13 -1600 389.92819
1 372 21 14 -1528 1.25778
1 373 21 15 -1531 1.30514
1 374 21 16 -1600 15376.07502
1 383 22 8 -1428 0.55107
1 384 22 9 -1271 0.13195
1 385 22 10 -1491 0.93111
1 386 22 11 -1597 2.15967
1 387 22 12 -1377 0.35783
1 388 22 13 -1416 0.49593
1 389 22 14 -1583 1.91597
1 390 22 15 -1590 2.04380
1 391 22 16 -1365 0.06856
1 400 23 8 -1443 0.63095
1 401 23 9 -1459 0.70643
1 402 23 10 -1411 0.47020
1 403 23 11 -1390 0.38913
1 404 23 12 -1171 0.04920
1 405 23 13 -1476 0.81734
1 406 23 14 -1355 0.29054
1 407 23 15 -1649 3.19734
1 408 23 16 -1451 5.12949
1 417 24 8 -1382 0.36505
1 418 24 9 -1243 0.10004
1 419 24 10 -1425 0.53850
1 420 24 11 -1563 1.78969
1 421 24 12 -1472 0.79934
1 422 24 13 -1622 2.58857
1 423 24 14 -1342 0.25519
1 424 24 15 -1557 1.56782
1 425 24 16 -1600 91227674.03590
1 426 25 0 -1475 0.82075
1 427 25 1 -1569 1.75701
1 428 25 2 -1544 1.42358
1 429 25 3 -1574 1.80776
1 430 25 4 -1655 3.34498
1 431 25 5 -1465 0.73921
1 432 25 6 -1687 4.20047
1 433 25 7 -1530 1.27533
1 434 25 8 -1363 0.31688
1 435 25 9 -1596 2.12248
1 436 25 10 -1487 0.88633
1 437 25 11 -1399 0.42416
1 438 25 12 -1425 0.53188
1 439 25 13 -1294 0.16410
1 440 25 14 -1626 2.66692
1 441 25 15 -1398 0.41553
1 442 25 16 -1412 1.14502
1 443 26 0 -1611 2.40583
1 444 26 1 -1607 2.33734
1 445 26 2 -1465 0.74419
1 446 26 3 -1482 0.86300
1 447 26 4 -1353 0.28048
1 448 26 5 -1552 1.50051
1 449 26 6 -1615 5.32339
1 450 26 7 -1539 1.37667
1 451 26 8 -1423 0.52770
1 452 26 9 -1299 0.17143
1 453 26 10 -1265 0.12375
1 454 26 11 -1418 0.50343
1 455 26 12 -1400 0.43460
1 456 26 13 -1439 0.59490
1 457 26 14 -1483 0.87102
1 458 26 15 -1444 0.62056
1 459 26 16 -1539 269.95578
1 460 27 0 -1539 1.37598
1 461 27 1 -1273 0.13282
1 462 27 2 -1447 0.64351
1 463 27 3 -1548 1.44682
1 464 27 4 -1364 0.31444
1 465 27 5 -1491 0.94243
1 466 27 6 -1476 0.81942
1 467 27 7 -1473 0.80121
1 468 27 8 -1338 0.24443
1 469 27 9 -1519 1.14300
1 470 27 10 -1405 0.45627
1 471 27 11 -1230 0.08800
1 472 27 12 -1206 0.06991
1 473 27 13 -1399 0.42225
1 474 27 14 -1600 76.39322
1 475 27 15 -1528 7.77948
1 477 28 0 -1211 0.07360
1 478 28 1 -1476 0.81718
1 479 28 2 -1209 0.07127
1 480 28 3 -1340 0.25394
1 481 28 4 -1327 0.22425
1 482 28 5 -1455 0.68842
1 483 28 6 -1600 70.34774
1 484 28 7 -1207 0.07160
1 485 28 8 -1671 3.72177
1 486 28 9 -1300 0.17082
1 487 28 10 -1264 0.12432
1 488 28 11 -1224 0.08340
1 489 28 12 -1364 0.31557
1 490 28 13 -1554 1.51310
1 491 28 14 -1510 36.70309
1 494 29 0 -1470 0.79302
1 495 29 1 -1516 1.14389
1 496 29 2 -1295 0.16580
1 497 29 3 -1252 0.10867
1 498 29 4 -1431 0.56690
1 499 29 5 -1279 0.14355
1 500 29 6 -1339 0.24717
1 501 29 7 -1274 0.13508
1 502 29 8 -1395 0.41130
1 503 29 9 -1457 0.70485
1 504 29 10 -1296 0.16854
1 505 29 11 -1402 0.87735
1 506 29 12 -1655 3.33249
1 507 29 13 -1514 19.33412
1 511 30 0 -1376 0.34745
1 512 30 1 -1463 0.71928
1 513 30 2 -1229 0.08582
1 514 30 3 -1347 0.26411
1 515 30 4 -1368 0.32289
1 516 30 5 -1356 0.28897
1 517 30 6 -1361 0.30871
1 518 30 7 -1479 0.85925
1 519 30 8 -1388 0.38407
1 520 30 9 -1535 1.33060
1 521 30 10 -1319 0.20889
1 522 30 11 -1571 14.10517
1 523 30 12 -1600 0.00000
1 528 31 0 -1600 76.57276
1 529 31 1 -1321 0.20932
1 530 31 2 -1267 0.12629
1 531 31 3 -1269 0.12877
1 532 31 4 -1403 0.44292
1 533 31 5 -1517 1.13681
1 534 31 6 -1390 0.39626
1 535 31 7 -1354 0.28767
1 536 31 8 -1297 0.17162
1 537 31 9 -1510 1.06992
1 538 31 10 -1591 2.07458
1 539 31 11 -1362 0.00196
1 545 32 0 -1237 0.09500
1 546 32 1 -1540 1.37173
1 547 32 2 -1428 0.56135
1 548 32 3 -1636 2.90923
1 549 32 4 -1142 0.25843
1 550 32 5 -1334 0.62300
1 551 32 6 -1528 1.24589
1 552 32 7 -1493 0.94116
1 553 32 8 -1326 0.22183
1 554 32 9 -1398 0.42702
1 555 32 10 -1374 0.03451
1 562 33 0 -1378 0.20515
1 563 33 1 -1272 0.00113
1 564 33 2 -1421 0.46689
1 565 33 3 -1232 0.00033
1 566 33 4 -1600 13.06471
1 567 33 5 -1445 2.01486
1 568 33 6 -1464 2.06144
1 569 33 7 -1420 0.61220
1 570 33 8 -1298 0.00426
1 571 33 9 -1334 0.05325
2 1 0 0 -1600 85563.78869
2 2 0 1 -1600 513297.98594
2 3 0 2 -1600 71713962.02630
2 4 0 3 -1600 119272.43847
2 5 0 4 -1600 3074134.93845
2 6 0 5 -1600 1714464.58072
2 7 0 6 -1600 60360191.44920
2 8 0 7 -1600 545309.26950
2 9 0 8 -1600 148212.08712
2 10 0 9 -1600 255024240.76200
2 18 1 0 -1361 0.29920
2 19 1 1 -1405 0.45508
2 20 1 2 -1273 0.13573
2 21 1 3 -1341 0.25397
2 22 1 4 -1405 0.44178
2 23 1 5 -1561 1.61400
2 24 1 6 -1594 2.08889
2 25 1 7 -1422 0.52142
2 26 1 8 -1545 1.43414
2 27 1 9 -1513 1.10134
2 28 1 10 -1600 61.46980
2 35 2 0 -1600 70.61730
2 36 2 1 -1411 0.47669
2 37 2 2 -1437 2.88065
2 38 2 3 -1373 0.34574
2 39 2 4 -1299 0.17303
2 40 2 5 -1355 0.29069
2 41 2 6 -1578 1.87754
2 42 2 7 -1430 0.54857
2 43 2 8 -1446 0.64323
2 44 2 9 -1628 5.47866
2 45 2 10 -1589 26.60730
2 46 2 11 -1600 2930.44342
2 52 3 0 -1473 0.80130
2 53 3 1 -1259 0.11565
2 54 3 2 -1360 0.29998
2 55 3 3 -1260 0.11884
2 56 3 4 -1263 0.12321
2 57 3 5 -1361 0.30315
2 58 3 6 -1442 0.62584
2 59 3 7 -1440 0.60843
2 60 3 8 -1509 1.07903
2 61 3 9 -1634 2.81728
2 62 3 10 -1633 7.68773
2 63 3 11 -1488 0.90153
2 64 3 12 -1600 42040.73262
2 69 4 0 -1437 0.58868
2 70 4 1 -1349 0.27863
2 71 4 2 -1221 0.08009
2 72 4 3 -1244 0.10000
2 73 4 4 -1351 0.27973
2 74 4 5 -1253 0.11155
2 75 4 6 -1548 6.27778
2 76 4 7 -1387 0.38262
2 77 4 8 -1375 0.34850
2 78 4 9 -1509 2.69513
2 79 4 10 -1667 3.67434
2 80 4 11 -1462 1.46008
2 81 4 12 -1508 1.08760
2 82 4 13 -1593 7346.60150
2 86 5 0 -1359 0.29754
2 87 5 1 -1242 0.09704
2 88 5 2 -1301 0.17872
2 89 5 3 -1444 0.62365
2 90 5 4 -1217 0.07867
2 91 5 5 -1404 0.44538
2 92 5 6 -1233 0.09192
2 93 5 7 -1424 0.52813
2 94 5 8 -1532 1.28823
2 95 5 9 -1678 3.94971
2 96 5 10 -1653 3.27730
2 97 5 11 -1370 0.32804
2 98 5 12 -1477 0.83863
2 99 5 13 -1687 14.07210
2 100 5 14 -1600 6332.68435
2 103 6 0 -1425 0.53030
2 104 6 1 -1224 0.08233
2 105 6 2 -1272 0.13466
2 106 6 3 -1256 0.11438
2 107 6 4 -1285 0.16269
2 108 6 5 -1236 0.09574
2 109 6 6 -1300 0.17793
2 110 6 7 -1359 0.30451
2 111 6 8 -1238 0.09516
2 112 6 9 -1530 1.27809
2 113 6 10 -1535 1.31428
2 114 6 11 -1446 1.62634
2 115 6 12 -1327 0.22398
2 116 6 13 -1489 0.91848
2 117 6 14 -1305 0.18133
2 118 6 15 -1600 8324940.49599
2 120 7 0 -1258 0.11586
2 121 7 1 -1291 0.16173
2 122 7 2 -1338 0.24879
2 123 7 3 -1164 0.04460
2 124 7 4 -1174 0.04987
2 125 7 5 -1336 0.24112
2 126 7 6 -1400 0.43527
2 127 7 7 -1386 0.38027
2 128 7 8 -1624 2.66978
2 129 7 9 -1654 3.32103
2 130 7 10 -1522 1.21095
2 131 7 11 -1466 0.73851
2 132 7 12 -1660 3.48449
2 133 7 13 -1654 3.29342
2 134 7 14 -1486 0.89186
2 135 7 15 -1627 5.37442
2 136 7 16 -1600 347552422.77000
2 137 8 0 -1334 0.23863
2 138 8 1 -1580 1.88804
2 139 8 2 -1264 0.12338
2 140 8 3 -1319 0.20531
2 141 8 4 -1335 0.24164
2 142 8 5 -1456 0.69530
2 143 8 6 -1528 1267.74948
2 144 8 7 -1681 8.03316
2 145 8 8 -1384 0.36967
2 146 8 9 -1609 2.37479
2 147 8 10 -1346 0.26829
2 148 8 11 -1491 0.93218
2 149 8 12 -1597 2.15769
2 150 8 13 -1576 1.85285
2 151 8 14 -1635 2.92534
2 152 8 15 -1607 2.32767
2 153 8 16 -1600 27972.21472
2 162 9 8 -1637 2.88253
2 163 9 9 -1495 0.97071
2 164 9 10 -1337 0.24093
2 165 9 11 -1628 5.48336
2 166 9 12 -1620 2.57537
2 167 9 13 -1675 12.87853
2 168 9 14 -1571 1.75363
2 169 9 15 -1619 2.55119
2 170 9 16 -1600 42.76032
2 179 10 8 -1648 10.62865
2 180 10 9 -1422 0.52350
2 181 10 10 -1361 0.30579
2 182 10 11 -1377 0.35705
2 183 10 12 -1443 0.61627
2 184 10 13 -1543 1.41624
2 185 10 14 -1496 0.97794
2 186 10 15 -1611 2.38205
2 187 10 16 -1600 19019359.54840
2 196 11 8 -1611 4.81972
2 197 11 9 -1592 2.07510
2 198 11 10 -1463 0.73269
2 199 11 11 -1445 0.62596
2 200 11 12 -1411 0.47218
2 201 11 13 -1330 0.22934
2 202 11 14 -1579 1.87006
2 203 11 15 -1418 0.49900
2 204 11 16 -1600 574794496.31400
2 213 12 8 -1431 0.56359
2 214 12 9 -1521 1.17392
2 215 12 10 -1336 0.23850
2 216 12 11 -1483 0.86980
2 217 12 12 -1422 0.52209
2 218 12 13 -1538 1.34905
2 219 12 14 -1518 1.16394
2 220 12 15 -1552 26.35622
2 221 12 16 -1600 2366449.09354
2 230 13 8 -1570 1.73496
2 231 13 9 -1622 2.60882
2 232 13 10 -1313 0.19890
2 233 13 11 -1362 0.31086
2 234 13 12 -1563 1.66320
2 235 13 13 -1316 0.20161
2 236 13 14 -1443 0.61691
2 237 13 15 -1666 5.45252
2 238 13 16 -1600 6680326.95840
2 247 14 8 -1606 2.28798
2 248 14 9 -1398 0.41936
2 249 14 10 -1453 0.67915
2 250 14 11 -1431 0.56556
2 251 14 12 -1463 0.73558
2 252 14 13 -1519 1.14996
2 253 14 14 -1528 1.25178
2 254 14 15 -1656 3.37583
2 255 14 16 -1600 374257.05620
2 264 15 8 -1457 0.70228
2 265 15 9 -1382 0.37247
2 266 15 10 -1344 0.28068
2 267 15 11 -1379 0.35535
2 268 15 12 -1347 0.27138
2 269 15 13 -1494 0.94556
2 270 15 14 -1377 0.35525
2 271 15 15 -1507 1.03892
2 272 15 16 -1586 9.55274
2 281 16 8 -1550 1.49824
2 282 16 9 -1267 0.12764
2 283 16 10 -1453 0.66969
2 284 16 11 -1597 3.18287
2 285 16 12 -1345 0.26461
2 286 16 13 -1318 0.20667
2 287 16 14 -1576 1.85522
2 288 16 15 -1609 2.38835
2 289 16 16 -1595 19.77255
2 298 17 8 -1332 0.23249
2 299 17 9 -1355 0.28557
2 300 17 10 -1320 0.20981
2 301 17 11 -1424 0.51946
2 302 17 12 -1389 0.39423
2 303 17 13 -1480 0.84237
2 304 17 14 -1581 1.91249
2 305 17 15 -1514 1.10777
2 306 17 16 -1537 3.67311
2 315 18 8 -1480 0.85334
2 316 18 9 -1461 0.72369
2 317 18 10 -1487 0.89543
2 318 18 11 -1363 0.31291
2 319 18 12 -1243 0.09948
2 320 18 13 -1433 0.57208
2 321 18 14 -1526 1.23880
2 322 18 15 -1690 4.27839
2 323 18 16 -1600 47752.71615
2 332 19 8 -1346 0.26913
2 333 19 9 -1469 0.77907
2 334 19 10 -1344 0.26394
2 335 19 11 -1412 0.47198
2 336 19 12 -1334 2.84276
2 337 19 13 -1476 0.81010
2 338 19 14 -1452 0.67652
2 339 19 15 -1513 1.11101
2 340 19 16 -1600 221579.72518
2 349 20 8 -1437 0.58352
2 350 20 9 -1652 3.26460
2 351 20 10 -1370 0.33182
2 352 20 11 -1545 1.45819
2 353 20 12 -1447 0.64913
2 354 20 13 -1464 0.74175
2 355 20 14 -1337 0.24435
2 356 20 15 -1570 1.73946
2 357 20 16 -1600 354884.09964
2 366 21 8 -1574 14.53966
2 367 21 9 -1387 0.38246
2 368 21 10 -1529 1.26995
2 369 21 11 -1277 0.14097
2 370 21 12 -1468 0.77529
2 371 21 13 -1524 1.22280
2 372 21 14 -1486 0.87771
2 373 21 15 -1456 0.70350
2 374 21 16 -1600 717.58876
2 383 22 8 -1405 0.45738
2 384 22 9 -1558 1.56526
2 385 22 10 -1390 0.39405
2 386 22 11 -1347 0.26631
2 387 22 12 -1464 0.74761
2 388 22 13 -1379 0.35909
2 389 22 14 -1411 0.47023
2 390 22 15 -1615 4.88888
2 391 22 16 -1600 21.46238
2 400 23 8 -1406 0.44754
2 401 23 9 -1420 0.51622
2 402 23 10 -1155 0.04116
2 403 23 11 -1463 0.74938
2 404 23 12 -1424 0.53476
2 405 23 13 -1496 0.96986
2 406 23 14 -1669 3.64164
2 407 23 15 -1505 1.04098
2 408 23 16 -1600 1280.81652
2 417 24 8 -1574 1.79789
2 418 24 9 -1566 1.69898
2 419 24 10 -1332 0.22883
2 420 24 11 -1477 0.82809
2 421 24 12 -1340 0.24797
2 422 24 13 -1508 1.06042
2 423 24 14 -1346 0.26626
2 424 24 15 -1553 1.53666
2 425 24 16 -1600 141126.05631
2 426 25 0 -1554 106.36466
2 427 25 1 -1531 10.46722
2 428 25 2 -1524 83.02759
2 429 25 3 -1467 0.76248
2 430 25 4 -1655 14.40960
2 431 25 5 -1523 1.19298
2 432 25 6 -1675 3.84463
2 433 25 7 -1457 0.71336
2 434 25 8 -1487 0.90976
2 435 25 9 -1379 0.36615
2 436 25 10 -1404 0.44854
2 437 25 11 -1385 0.37502
2 438 25 12 -1356 0.29551
2 439 25 13 -1499 0.97927
2 440 25 14 -1408 0.45993
2 441 25 15 -1456 0.69057
2 442 25 16 -1600 11848864.57350
2 443 26 0 -1417 0.50248
2 444 26 1 -1385 0.38348
2 445 26 2 -1316 0.19825
2 446 26 3 -1400 0.42452
2 447 26 4 -1290 0.16086
2 448 26 5 -1481 0.85525
2 449 26 6 -1302 0.17594
2 450 26 7 -1370 0.33079
2 451 26 8 -1518 1.15808
2 452 26 9 -1397 0.41663
2 453 26 10 -1370 0.32995
2 454 26 11 -1389 0.38449
2 455 26 12 -1397 0.41231
2 456 26 13 -1532 1.30942
2 457 26 14 -1478 0.83858
2 458 26 15 -1548 1.45000
2 459 26 16 -1600 35307.26002
2 460 27 0 -1389 0.39429
2 461 27 1 -1499 0.99156
2 462 27 2 -1265 0.12572
2 463 27 3 -1280 0.14271
2 464 27 4 -1267 0.12662
2 465 27 5 -1348 0.27338
2 466 27 6 -1573 1.78683
2 467 27 7 -1305 0.18129
2 468 27 8 -1227 0.08546
2 469 27 9 -1273 0.13504
2 470 27 10 -1260 0.12079
2 471 27 11 -1437 0.58867
2 472 27 12 -1224 0.08292
2 473 27 13 -1361 0.29919
2 474 27 14 -1314 0.46200
2 475 27 15 -1522 5.09566
2 477 28 0 -1442 0.61466
2 478 28 1 -1517 1.15475
2 479 28 2 -1244 0.10200
2 480 28 3 -1242 0.09885
2 481 28 4 -1309 0.18963
2 482 28 5 -1223 0.08292
2 483 28 6 -1236 0.09294
2 484 28 7 -1290 0.15744
2 485 28 8 -1326 0.22095
2 486 28 9 -1399 0.41918
2 487 28 10 -1423 0.52135
2 488 28 11 -1318 0.20571
2 489 28 12 -1370 0.32467
2 490 28 13 -1384 0.37198
2 491 28 14 -1416 0.95978
2 494 29 0 -1277 0.13928
2 495 29 1 -1486 0.89161
2 496 29 2 -1253 0.10940
2 497 29 3 -1347 0.27370
2 498 29 4 -1347 0.26550
2 499 29 5 -1436 0.67954
2 500 29 6 -1252 0.11061
2 501 29 7 -1397 0.42312
2 502 29 8 -1326 0.21769
2 503 29 9 -1296 0.16639
2 504 29 10 -1230 0.09005
2 505 29 11 -1397 0.42530
2 506 29 12 -1472 0.79394
2 507 29 13 -1370 0.66506
2 511 30 0 -1375 0.34441
2 512 30 1 -1361 0.30663
2 513 30 2 -1308 0.18665
2 514 30 3 -1264 0.12315
2 515 30 4 -1433 0.56770
2 516 30 5 -1380 0.36440
2 517 30 6 -1416 0.49197
2 518 30 7 -1294 0.16370
2 519 30 8 -1304 0.18157
2 520 30 9 -1403 0.43290
2 521 30 10 -1385 0.37885
2 522 30 11 -1498 0.99936
2 523 30 12 -1411 0.58121
2 528 31 0 -1345 0.26474
2 529 31 1 -1255 0.11173
2 530 31 2 -1245 0.10405
2 531 31 3 -1472 0.79129
2 532 31 4 -1274 0.13363
2 533 31 5 -1278 0.14237
2 534 31 6 -1442 0.62469
2 535 31 7 -1321 0.21217
2 536 31 8 -1343 0.25742
2 537 31 9 -1444 0.61345
2 538 31 10 -1484 0.86128
2 539 31 11 -1460 1.03761
2 545 32 0 -1202 0.06751
2 546 32 1 -1353 0.28790
2 547 32 2 -1247 0.10416
2 548 32 3 -1332 0.23183
2 549 32 4 -1398 0.42312
2 550 32 5 -1306 0.18476
2 551 32 6 -1295 0.16576
2 552 32 7 -1282 0.14740
2 553 32 8 -1495 0.94861
2 554 32 9 -1449 0.64778
2 555 32 10 -1483 1.43099
2 562 33 0 -1346 0.12585
2 563 33 1 -1441 0.54484
2 564 33 2 -1297 0.00688
2 565 33 3 -1354 0.31897
2 566 33 4 -1330 0.00770
2 567 33 5 -1302 0.02122
2 568 33 6 -1378 0.07125
2 569 33 7 -1466 0.59932
2 570 33 8 -1380 0.30243
2 571 33 9 -1310 0.00606
