3 1 0 0 B5 0.88996
3 2 0 1 C1 1.01142
3 3 0 2 83 0.52077
3 4 0 3 B5 0.88974
3 5 0 4 D2 1.64236
3 6 0 5 D2 1.63235
3 7 0 6 FB 10.09031
3 8 0 7 EC 51.27883
3 9 0 8 FE 318.61676
3 10 0 9 F6 8.30028
3 11 0 10 F9 38.55914
3 12 0 11 F7 72.96042
3 13 1 0 BA 2.99321
3 14 1 1 C 0.18018
3 15 1 2 67 0.40673
3 16 1 3 86 0.53916
3 17 1 4 8B 0.32633
3 18 1 5 CB 1.30367
3 19 1 6 F0 3.59064
3 20 1 7 F4 8.38770
3 21 1 8 EF 14.78781
3 22 1 9 EC 30.32932
3 23 1 10 FD 29.40747
3 24 1 11 F3 29.58724
3 25 2 0 0 0.25197
3 26 2 1 4E 0.32579
3 27 2 2 86 4.19573
3 28 2 3 E8 1.68630
3 29 2 4 92 0.35806
3 30 2 5 B1 1.38297
3 31 2 6 FA 10.43680
3 32 2 7 FD 97.82867
3 33 2 8 EC 12.03217
3 34 2 9 FC 5.69304
3 35 2 10 EB 52.32645
3 36 2 11 EC 53.98971
3 37 3 0 1B 0.15939
3 38 3 1 4A 0.86555
3 39 3 2 B7 0.90970
3 40 3 3 91 0.60035
3 41 3 4 64 0.16115
3 42 3 5 8D 2.60986
3 43 3 6 9B 20.62796
3 44 3 7 FF 186.74985
3 45 3 8 F4 4.14177
3 46 3 9 EF 28.61193
3 47 3 10 C2 67.31939
3 48 3 11 B2 19.99004
3 49 4 0 10 0.17391
3 50 4 1 FC 2.25606
3 51 4 2 0 0.22154
3 52 4 3 9F 0.68829
3 53 4 4 BA 0.89045
3 54 4 5 89 0.30170
3 55 4 6 A1 0.50335
3 56 4 7 F5 68.65659
3 57 4 8 DA 1.98688
3 58 4 9 ED 6.91731
3 59 4 10 F1 23.38951
3 60 4 11 F1 72.10527
3 61 5 0 0 0.32569
3 62 5 1 0 0.54069
3 63 5 2 6E 0.43030
3 64 5 3 1 0.38681
3 65 5 4 0 46.77193
3 66 5 5 43 0.09161
3 67 5 6 66 0.16448
3 68 5 7 70 0.18663
3 69 5 8 A3 0.52776
3 70 5 9 F8 4.60738
3 71 5 10 FB 149.91746
3 72 5 11 F1 7.49562
3 73 6 0 1B 0.56454
3 74 6 1 16 0.10616
3 75 6 2 13 0.21722
3 76 6 3 0 0.18775
3 77 6 4 11 0.04610
3 78 6 5 2D 1.04874
3 79 6 6 7A 0.23609
3 80 6 7 B9 0.88054
3 81 6 8 B9 0.82986
3 82 6 9 A2 0.52895
3 83 6 10 C5 1.12159
3 84 6 11 C4 1.12766
3 90 7 5 83 0.27720
3 91 7 6 77 0.22112
3 92 7 7 5D 0.13899
3 93 7 8 C3 1.06776
3 94 7 9 AF 0.66324
3 95 7 10 F7 4.37035
3 96 7 11 DE 2.20919
3 102 8 5 7F 0.49356
3 103 8 6 D7 1.31100
3 104 8 7 D4 2.51656
3 105 8 8 D4 1.28661
3 106 8 9 B1 0.83889
3 107 8 10 F1 24.13820
3 108 8 11 E9 1.75782
3 114 9 5 93 0.61095
3 115 9 6 DA 1.41704
3 116 9 7 D4 1.28899
3 117 9 8 E8 1.69632
3 118 9 9 C5 1.07814
3 119 9 10 D6 5.18298
3 120 9 11 DF 2.95743
3 126 10 5 0 0.10931
3 127 10 6 61 0.38565
3 128 10 7 F1 62.99049
3 129 10 8 9A 0.65797
3 130 10 9 DD 1.49431
3 131 10 10 73 0.44648
3 132 10 11 D2 21.07653
3 138 11 5 0 0.37718
3 139 11 6 B8 0.92233
3 140 11 7 B6 0.87956
3 141 11 8 FE 2.42734
3 142 11 9 95 0.62675
3 143 11 10 D7 1.36054
3 144 11 11 DD 1.47249
3 150 12 5 0 0.18852
3 151 12 6 FF 79.40733
3 152 12 7 E2 24.63998
3 153 12 8 E1 98.93357
3 154 12 9 0 885360.00512
3 155 12 10 0 0.19038
3 156 12 11 E4 26.35214
3 162 13 5 EC 54.48312
3 163 13 6 E6 13.37790
3 164 13 7 E3 3.18846
3 165 13 8 DF 12.08863
3 166 13 9 7D 0.49859
3 167 13 10 0 0.18650
3 168 13 11 BB 0.94268
3 174 14 5 EC 7.21294
3 175 14 6 FF 77.26706
3 176 14 7 FF 648.40238
3 177 14 8 0 195.11351
3 178 14 9 DD 91.91042
3 179 14 10 77 0.45710
3 180 14 11 59 1.42216
3 186 15 5 0 0.18660
3 187 15 6 FF 153.97363
3 188 15 7 E3 25.53727
3 189 15 8 AB 0.77899
3 190 15 9 0 0.18627
3 191 15 10 FD 405.50181
3 192 15 11 E7 53.72407
3 198 16 5 FF 9668.38474
3 199 16 6 FF 186.18173
3 200 16 7 F5 20.16165
3 201 16 8 C3 1.08196
3 202 16 9 E2 2.48851
3 203 16 10 0 640.00000
3 204 16 11 FF 207.41298
3 205 17 0 FE 122.92744
3 206 17 1 FF 158.42407
3 207 17 2 E9 27.89774
3 208 17 3 D5 43.39687
3 209 17 4 FF 186.11207
3 210 17 5 FF 186.18173
3 211 17 6 EF 3.70453
3 212 17 7 0 6400.00000
3 213 17 8 BD 0.95208
3 214 17 9 C5 1.19046
3 215 17 10 0 1600.00000
3 216 17 11 DB 2.12379
3 217 18 0 E4 223.02767
3 218 18 1 EB 235.23504
3 219 18 2 DD 11.86819
3 220 18 3 F8 72.28009
3 221 18 4 F8 311.17814
3 222 18 5 F8 147.07314
3 223 18 6 FC 5.27538
3 224 18 7 C1 1.01004
3 225 18 8 D8 1.79407
3 226 18 9 F1 68.47916
3 227 18 10 F3 7.70642
3 228 18 11 F9 10.27243
3 229 19 0 FF 672.70783
3 230 19 1 F0 28.27008
3 231 19 2 DE 5.97480
3 232 19 3 FF 160.48288
3 233 19 4 F0 58.15473
3 234 19 5 BC 0.91548
3 235 19 6 D0 1.45250
3 236 19 7 D2 1.67613
3 237 19 8 F5 4.42704
3 238 19 9 F8 82.15848
3 239 19 10 F8 154.37152
3 240 19 11 EF 20.77729
3 241 20 0 FF 584.82977
3 242 20 1 D5 26.84374
3 243 20 2 FA 8.96779
3 244 20 3 F9 53.18664
3 245 20 4 F8 9.42944
3 246 20 5 FF 468.68517
3 247 20 6 C8 1.19105
3 248 20 7 E7 2.63387
3 249 20 8 F4 16.60989
3 250 20 9 F0 7.00944
3 251 20 10 EE 13.44177
3 252 20 11 A5 0.54992
3 253 21 0 FC 120.39437
3 254 21 1 D0 131.68028
3 255 21 2 F3 4.02203
3 256 21 3 E8 53.07303
3 257 21 4 DD 2.10491
3 258 21 5 FA 4.85955
3 259 21 6 FD 10.36236
3 260 21 7 F9 27.91101
3 261 21 8 EB 13.80270
3 262 21 9 FF 187.48941
3 263 21 10 FF 750.28839
3 264 21 11 EB 12.23296
3 265 22 0 DB 348.84521
3 266 22 1 FF 456.25646
3 267 22 2 D4 2.62255
3 268 22 3 DE 12.02584
3 269 22 4 C9 1.27274
3 270 22 5 D6 1.70831
3 271 22 6 FC 11.03249
3 272 22 7 F9 24.98679
3 273 22 8 FC 106.01430
3 274 22 9 EB 43.02909
3 275 22 10 FC 141.95240
3 276 22 11 F4 8.25933
3 277 23 0 DF 5.99370
3 278 23 1 D5 5.26000
3 279 23 2 DD 2.88545
3 280 23 3 E6 3.14703
3 281 23 4 CD 1.35676
3 282 23 5 34 0.07335
3 283 23 6 F6 98.02799
3 284 23 7 EF 7.03241
3 285 23 8 ED 37.27397
3 286 23 9 FB 216.83573
3 287 23 10 EB 38.38736
3 288 23 11 E9 6008.05209
4 1 0 0 97 0.63377
4 2 0 1 9E 0.68286
4 3 0 2 94 0.62313
4 4 0 3 FD 2.36674
4 5 0 4 F4 31.70829
4 6 0 5 A8 0.59014
4 7 0 6 F1 98.72224
4 8 0 7 F8 22.73657
4 9 0 8 F0 201.77688
4 10 0 9 EE 186.25368
4 11 0 10 F7 108.53156
4 12 0 11 EE 3.37651
4 13 1 0 7A 0.48547
4 14 1 1 A6 0.74601
4 15 1 2 E9 3.63282
4 16 1 3 87 0.54080
4 17 1 4 A0 0.49039
4 18 1 5 B0 1.46633
4 19 1 6 FF 5.59423
4 20 1 7 FB 5.22373
4 21 1 8 EA 11.87860
4 22 1 9 EF 24.05673
4 23 1 10 FD 22.91776
4 24 1 11 F6 24.25393
4 25 2 0 16 0.11225
4 26 2 1 75 0.46642
4 27 2 2 7A 0.47187
4 28 2 3 C9 1.11041
4 29 2 4 C4 1.04231
4 30 2 5 B5 0.76082
4 31 2 6 E8 2.87010
4 32 2 7 FD 69.82799
4 33 2 8 FC 11.03427
4 34 2 9 F6 9.09490
4 35 2 10 F4 38.54425
4 36 2 11 EA 28.83705
4 37 3 0 97 0.63870
4 38 3 1 64 1.00838
4 39 3 2 83 0.52618
4 40 3 3 C6 1.07364
4 41 3 4 8A 0.30974
4 42 3 5 B4 0.75387
4 43 3 6 CD 1.36354
4 44 3 7 C7 1.20198
4 45 3 8 DD 2.15324
4 46 3 9 FA 4.87179
4 47 3 10 EC 13.23427
4 48 3 11 FA 20.21242
4 49 4 0 9D 0.67678
4 50 4 1 4A 0.31667
4 51 4 2 D9 1.39792
4 52 4 3 96 0.63221
4 53 4 4 6E 0.19090
4 54 4 5 96 0.38418
4 55 4 6 91 0.36443
4 56 4 7 BB 0.85589
4 57 4 8 B0 0.67556
4 58 4 9 FF 186.18173
4 59 4 10 F2 38.20687
4 60 4 11 FC 10.68400
4 61 5 0 D9 43.83597
4 62 5 1 84 0.52828
4 63 5 2 27 3.72101
4 64 5 3 0 0.18694
4 65 5 4 2D 0.06642
4 66 5 5 92 0.37436
4 67 5 6 8B 0.31029
4 68 5 7 DE 2.12723
4 69 5 8 C3 1.11488
4 70 5 9 F2 7.86873
4 71 5 10 F2 7.76384
4 72 5 11 F2 84.95064
4 73 6 0 0 0.18958
4 74 6 1 0 0.17428
4 75 6 2 0 0.18909
4 76 6 3 0 1.15636
4 77 6 4 44 0.09515
4 78 6 5 55 0.12134
4 79 6 6 C4 1.08006
4 80 6 7 EB 104.09801
4 81 6 8 E1 2.42601
4 82 6 9 D6 1.76578
4 83 6 10 C0 0.96467
4 84 6 11 FA 20.50530
4 90 7 5 71 0.19596
4 91 7 6 7E 0.25050
4 92 7 7 D9 1.85465
4 93 7 8 C6 1.12686
4 94 7 9 DD 2.14894
4 95 7 10 E4 2.60231
4 96 7 11 F9 5.07239
4 102 8 5 DE 27.85930
4 103 8 6 CB 1.16787
4 104 8 7 FF 19.68166
4 105 8 8 F5 2.07228
4 106 8 9 BC 0.94224
4 107 8 10 B6 0.89264
4 108 8 11 DB 10.00846
4 114 9 5 A4 0.71605
4 115 9 6 DE 47.65012
4 116 9 7 E8 24.85164
4 117 9 8 F1 1.93701
4 118 9 9 EF 62.16263
4 119 9 10 7A 0.47490
4 120 9 11 F2 3.95918
4 126 10 5 A0 0.70382
4 127 10 6 84 0.52555
4 128 10 7 D9 1.37277
4 129 10 8 C6 1.08399
4 130 10 9 CD 1.20485
4 131 10 10 9E 0.67794
4 132 10 11 F5 4.16976
4 138 11 5 D1 1.24909
4 139 11 6 8B 0.55806
4 140 11 7 AF 0.81836
4 141 11 8 B6 0.86671
4 142 11 9 E1 4.55537
4 143 11 10 F6 2.07279
4 144 11 11 F5 2.08202
4 150 12 5 D2 19.68035
4 151 12 6 EC 1.77706
4 152 12 7 F2 2.01051
4 153 12 8 EF 4.03465
4 154 12 9 CE 1.19871
4 155 12 10 D9 2.81666
4 156 12 11 E3 3.12387
4 162 13 5 E3 1.55812
4 163 13 6 8B 0.56268
4 164 13 7 FE 20.66824
4 165 13 8 EF 4.99823
4 166 13 9 DC 4.35178
4 167 13 10 F9 2.15675
4 168 13 11 FB 2.28637
4 174 14 5 F1 17.56159
4 175 14 6 ED 36.42429
4 176 14 7 D1 17.22960
4 177 14 8 C0 0.99625
4 178 14 9 F0 5.93861
4 179 14 10 D0 1.22228
4 180 14 11 FB 5.53943
4 186 15 5 E8 3.41745
4 187 15 6 E8 21.73896
4 188 15 7 F0 10.05244
4 189 15 8 F0 60.21687
4 190 15 9 EB 1.73523
4 191 15 10 EA 3.32115
4 192 15 11 D0 1.21354
4 198 16 5 FF 182.91539
4 199 16 6 E3 2.40252
4 200 16 7 DC 268.42670
4 201 16 8 BE 0.96493
4 202 16 9 EB 6.05569
4 203 16 10 F4 4.07160
4 204 16 11 B9 0.82780
4 205 17 0 FF 160.98361
4 206 17 1 FF 988.28066
4 207 17 2 D4 458.04237
4 208 17 3 F6 211.71715
4 209 17 4 F6 282.04705
4 210 17 5 F9 49.59921
4 211 17 6 FD 43.82780
4 212 17 7 EE 3.40059
4 213 17 8 A1 1.98342
4 214 17 9 DE 2.05763
4 215 17 10 D7 1.85597
4 216 17 11 ED 3.42828
4 217 18 0 6B 0.41949
4 218 18 1 EF 55.11521
4 219 18 2 D6 5959.97352
4 220 18 3 E2 104.81242
4 221 18 4 F6 140.29335
4 222 18 5 F7 4.66683
4 223 18 6 DC 2.02103
4 224 18 7 DA 1.96021
4 225 18 8 0 8979.20000
4 226 18 9 F0 38.47164
4 227 18 10 FA 157.45392
4 228 18 11 F1 17.16454
4 229 19 0 F3 3.15536
4 230 19 1 E4 6.50047
4 231 19 2 F6 14.27798
4 232 19 3 FF 158.69346
4 233 19 4 D6 1.73910
4 234 19 5 B6 0.77812
4 235 19 6 0 640.00000
4 236 19 7 B9 0.87113
4 237 19 8 BC 0.92992
4 238 19 9 FE 5.54120
4 239 19 10 F4 127.68527
4 240 19 11 FE 43.97666
4 241 20 0 F8 71.63829
4 242 20 1 FF 218.81163
4 243 20 2 EB 7.22970
4 244 20 3 F3 20.41478
4 245 20 4 E9 92.77038
4 246 20 5 F1 20.49761
4 247 20 6 CD 1.44075
4 248 20 7 F6 4.19213
4 249 20 8 F7 474.06354
4 250 20 9 EF 19.23929
4 251 20 10 FD 60.80203
4 252 20 11 EC 72.67693
4 253 21 0 F5 37.23339
4 254 21 1 F9 4.42861
4 255 21 2 B8 0.89686
4 256 21 3 E4 7.79503
4 257 21 4 CE 1.43916
4 258 21 5 0 36.02080
4 259 21 6 F2 114.79235
4 260 21 7 EB 20.75981
4 261 21 8 FE 26.07647
4 262 21 9 F8 174.88896
4 263 21 10 F9 14.05345
4 264 21 11 F0 101.46097
4 265 22 0 EF 16.72773
4 266 22 1 E0 12.33462
4 267 22 2 FF 474.44136
4 268 22 3 F1 1.95747
4 269 22 4 CE 1.37780
4 270 22 5 B6 0.75178
4 271 22 6 FC 5.32203
4 272 22 7 F9 4.73747
4 273 22 8 F4 4.14432
4 274 22 9 F5 23.43354
4 275 22 10 F8 29.12331
4 276 22 11 F1 14.46336
4 277 23 0 F7 2.11243
4 278 23 1 E8 1.70000
4 279 23 2 E6 1.60753
4 280 23 3 BB 0.93810
4 281 23 4 C4 34.51809
4 282 23 5 F1 7.24049
4 283 23 6 F2 7.93125
4 284 23 7 F5 8.43384
4 285 23 8 F3 4.25989
4 286 23 9 F5 423.58278
4 287 23 10 F7 177.89390
4 288 23 11 C 0.08444
