1433191403 1   1 
1433191403 2   0 
1433191403 3   0 
1433191403 4   0 
1433191403 5   0 
1433191403 6   0 
1433191403 7   0 
1433191403 8   0 
1433191403 9   0 
1433191403 10   0 
1433191403 11   0 
1433191403 12   0 
1433191403 13   0 
1433191403 14   0 
1433191403 15   0 
1433191403 16   0 
1433191403 17   0 
1433191403 18   0 
1433191403 19   0 
1433191403 20   0 
1433191403 21   0 
1433191403 22   0 
1433191403 23   0 
1433191403 24   0 
1433191403 25   0 
1433191403 26   0 
1433191403 27   0 
1433191403 28   0 
1433191403 29   0 
1433191403 30   0 
1433191403 31   0 
1433191403 32   0 
1433191403 33   0 
1433191403 34   0 
1433191403 35   0 
1433191403 36   0 
1433191403 37   0 
1433191403 38   0 
1433191403 39   0 
1433191403 40   0 
1433191403 41   0 
1433191403 42   0 
1433191403 43   0 
1433191403 44   0 
1433191403 45   0 
1433191403 46   0 
1433191403 47   0 
1433191403 48   0 
1433191403 49   0 
1433191403 50   0 
1433191403 51   0 
1433191403 52   0 
1433191403 53   0 
1433191403 54   0 
1433191403 55   0 
1433191403 56   0 
1433191403 57   0 
1433191403 58   0 
1433191403 59   0 
1433191403 60   0 
1433191403 61   -1 
1433191403 62   0 
1433191403 63   0 
1433191403 64   0 
1433191403 65   0 
1433191403 66   0 
1433191403 67   0 
1433191403 68   0 
1433191403 69   0 
1433191403 70   0 
1433191403 71   0 
1433191403 72   0 
1433191403 73   0 
1433191403 74   0 
1433191403 75   0 
1433191403 76   0 
1433191403 77   0 
1433191403 78   0 
1433191403 79   0 
1433191403 80   0 
1433191403 81   0 
1433191403 82   0 
1433191403 83   0 
1433191403 84   0 
1433191403 85   0 
1433191403 86   0 
1433191403 87   0 
1433191403 88   0 
1433191403 89   0 
1433191403 90   0 
1433191403 91   0 
1433191403 92   0 
1433191403 93   0 
1433191403 94   0 
1433191403 95   0 
1433191403 96   0 
1433191403 97   0 
1433191403 98   0 
1433191403 99   0 
1433191403 100   0 
1433191403 101   0 
1433191403 102   0 
1433191403 103   0 
1433191403 104   0 
1433191403 105   0 
1433191403 106   0 
1433191403 107   0 
1433191403 108   0 
1433191403 109   0 
1433191403 110   0 
1433191403 111   0 
1433191403 112   0 
1433191403 113   0 
1433191403 114   0 
1433191403 115   0 
1433191403 116   0 
1433191403 117   0 
1433191403 118   0 
1433191403 119   0 
1433191403 120   0 
1433191403 121   1 
1433191403 122   0 
1433191403 123   0 
1433191403 124   0 
1433191403 125   0 
1433191403 126   0 
1433191403 127   0 
1433191403 128   0 
1433191403 129   0 
1433191403 130   0 
1433191403 131   0 
1433191403 132   0 
1433191403 133   0 
1433191403 134   0 
1433191403 135   0 
1433191403 136   0 
1433191403 137   0 
1433191403 138   0 
1433191403 139   0 
1433191403 140   0 
1433191403 141   0 
1433191403 142   0 
1433191403 143   0 
1433191403 144   0 
1433191403 145   0 
1433191403 146   0 
1433191403 147   0 
1433191403 148   0 
1433191403 149   0 
1433191403 150   0 
1433191403 151   0 
1433191403 152   0 
1433191403 153   0 
1433191403 154   0 
1433191403 155   0 
1433191403 156   0 
1433191403 157   0 
1433191403 158   0 
1433191403 159   0 
1433191403 160   0 
1433191403 161   0 
1433191403 162   0 
1433191403 163   0 
1433191403 164   0 
1433191403 165   0 
1433191403 166   0 
1433191403 167   0 
1433191403 168   0 
1433191403 169   0 
1433191403 170   0 
1433191403 171   0 
1433191403 172   0 
1433191403 173   0 
1433191403 174   0 
1433191403 175   0 
1433191403 176   0 
1433191403 177   0 
1433191403 178   0 
1433191403 179   0 
1433191403 180   0 
1433191403 181   -1 
1433191403 182   0 
1433191403 183   0 
1433191403 184   0 
1433191403 185   0 
1433191403 186   0 
1433191403 187   0 
1433191403 188   0 
1433191403 189   0 
1433191403 190   0 
1433191403 191   0 
1433191403 192   0 
1433191403 193   0 
1433191403 194   0 
1433191403 195   0 
1433191403 196   0 
1433191403 197   0 
1433191403 198   0 
1433191403 199   0 
1433191403 200   0 
1433191403 201   0 
1433191403 202   0 
1433191403 203   0 
1433191403 204   0 
1433191403 205   0 
1433191403 206   0 
1433191403 207   0 
1433191403 208   0 
1433191403 209   0 
1433191403 210   0 
1433191403 211   0 
1433191403 212   0 
1433191403 213   0 
1433191403 214   0 
1433191403 215   0 
1433191403 216   0 
1433191403 217   0 
1433191403 218   0 
1433191403 219   0 
1433191403 220   0 
1433191403 221   0 
1433191403 222   0 
1433191403 223   0 
1433191403 224   0 
1433191403 225   0 
1433191403 226   0 
1433191403 227   0 
1433191403 228   0 
1433191403 229   0 
1433191403 230   0 
1433191403 231   0 
1433191403 232   0 
1433191403 233   0 
1433191403 234   0 
1433191403 235   0 
1433191403 236   0 
1433191403 237   0 
1433191403 238   0 
1433191403 239   0 
1433191403 240   0 
1433191403 241   1 
1433191403 242   0 
1433191403 243   0 
1433191403 244   0 
1433191403 245   0 
1433191403 246   0 
1433191403 247   0 
1433191403 248   0 
1433191403 249   0 
1433191403 250   0 
1433191403 251   0 
1433191403 252   0 
1433191403 253   0 
1433191403 254   0 
1433191403 255   0 
1433191403 256   0 
1433191403 257   0 
1433191403 258   0 
1433191403 259   0 
1433191403 260   0 
1433191403 261   0 
1433191403 262   0 
1433191403 263   0 
1433191403 264   0 
1433191403 265   0 
1433191403 266   0 
1433191403 267   0 
1433191403 268   0 
1433191403 269   0 
1433191403 270   0 
1433191403 271   0 
1433191403 272   0 
1433191403 273   0 
1433191403 274   0 
1433191403 275   0 
1433191403 276   0 
1433191403 277   0 
1433191403 278   0 
1433191403 279   0 
1433191403 280   0 
1433191403 281   0 
1433191403 282   0 
1433191403 283   0 
1433191403 284   0 
1433191403 285   0 
1433191403 286   0 
1433191403 287   0 
1433191403 288   0 
1433191403 289   0 
1433191403 290   0 
1433191403 291   0 
1433191403 292   0 
1433191403 293   0 
1433191403 294   0 
1433191403 295   0 
1433191403 296   0 
1433191403 297   0 
1433191403 298   0 
1433191403 299   0 
1433191403 300   0 
1433191403 301   -1 
1433191403 302   0 
1433191403 303   0 
1433191403 304   0 
1433191403 305   0 
1433191403 306   0 
1433191403 307   0 
1433191403 308   0 
1433191403 309   0 
1433191403 310   0 
1433191403 311   0 
1433191403 312   0 
1433191403 313   0 
1433191403 314   0 
1433191403 315   0 
1433191403 316   0 
1433191403 317   0 
1433191403 318   0 
1433191403 319   0 
1433191403 320   0 
1433191403 321   0 
1433191403 322   0 
1433191403 323   0 
1433191403 324   0 
1433191403 325   0 
1433191403 326   0 
1433191403 327   0 
1433191403 328   0 
1433191403 329   0 
1433191403 330   0 
1433191403 331   0 
1433191403 332   0 
1433191403 333   0 
1433191403 334   0 
1433191403 335   0 
1433191403 336   0 
1433191403 337   0 
1433191403 338   0 
1433191403 339   0 
1433191403 340   0 
1433191403 341   0 
1433191403 342   0 
1433191403 343   0 
1433191403 344   0 
1433191403 345   0 
1433191403 346   0 
1433191403 347   0 
1433191403 348   0 
1433191403 349   0 
1433191403 350   0 
1433191403 351   0 
1433191403 352   0 
1433191403 353   0 
1433191403 354   0 
1433191403 355   0 
1433191403 356   0 
1433191403 357   0 
1433191403 358   0 
1433191403 359   0 
1433191403 360   0 
