1430540800 1   1 
1430540800 2   0 
1430540800 3   0 
1430540800 4   0 
1430540800 5   0 
1430540800 6   0 
1430540800 7   0 
1430540800 8   0 
1430540800 9   0 
1430540800 10   0 
1430540800 11   0 
1430540800 12   0 
1430540800 13   0 
1430540800 14   0 
1430540800 15   0 
1430540800 16   0 
1430540800 17   0 
1430540800 18   0 
1430540800 19   0 
1430540800 20   0 
1430540800 21   0 
1430540800 22   0 
1430540800 23   0 
1430540800 24   0 
1430540800 25   0 
1430540800 26   0 
1430540800 27   0 
1430540800 28   0 
1430540800 29   0 
1430540800 30   0 
1430540800 31   0 
1430540800 32   0 
1430540800 33   0 
1430540800 34   0 
1430540800 35   0 
1430540800 36   0 
1430540800 37   0 
1430540800 38   0 
1430540800 39   0 
1430540800 40   0 
1430540800 41   0 
1430540800 42   0 
1430540800 43   0 
1430540800 44   0 
1430540800 45   0 
1430540800 46   0 
1430540800 47   0 
1430540800 48   0 
1430540800 49   0 
1430540800 50   0 
1430540800 51   0 
1430540800 52   0 
1430540800 53   0 
1430540800 54   0 
1430540800 55   0 
1430540800 56   0 
1430540800 57   0 
1430540800 58   0 
1430540800 59   0 
1430540800 60   0 
1430540800 61   -1 
1430540800 62   0 
1430540800 63   0 
1430540800 64   0 
1430540800 65   0 
1430540800 66   0 
1430540800 67   0 
1430540800 68   0 
1430540800 69   0 
1430540800 70   0 
1430540800 71   0 
1430540800 72   0 
1430540800 73   0 
1430540800 74   0 
1430540800 75   0 
1430540800 76   0 
1430540800 77   0 
1430540800 78   0 
1430540800 79   0 
1430540800 80   0 
1430540800 81   0 
1430540800 82   0 
1430540800 83   0 
1430540800 84   0 
1430540800 85   0 
1430540800 86   0 
1430540800 87   0 
1430540800 88   0 
1430540800 89   0 
1430540800 90   0 
1430540800 91   0 
1430540800 92   0 
1430540800 93   0 
1430540800 94   0 
1430540800 95   0 
1430540800 96   0 
1430540800 97   0 
1430540800 98   0 
1430540800 99   0 
1430540800 100   0 
1430540800 101   0 
1430540800 102   0 
1430540800 103   0 
1430540800 104   0 
1430540800 105   0 
1430540800 106   0 
1430540800 107   0 
1430540800 108   0 
1430540800 109   0 
1430540800 110   0 
1430540800 111   0 
1430540800 112   0 
1430540800 113   0 
1430540800 114   0 
1430540800 115   0 
1430540800 116   0 
1430540800 117   0 
1430540800 118   0 
1430540800 119   0 
1430540800 120   0 
1430540800 121   1 
1430540800 122   0 
1430540800 123   0 
1430540800 124   0 
1430540800 125   0 
1430540800 126   0 
1430540800 127   0 
1430540800 128   0 
1430540800 129   0 
1430540800 130   0 
1430540800 131   0 
1430540800 132   0 
1430540800 133   0 
1430540800 134   0 
1430540800 135   0 
1430540800 136   0 
1430540800 137   0 
1430540800 138   0 
1430540800 139   0 
1430540800 140   0 
1430540800 141   0 
1430540800 142   0 
1430540800 143   0 
1430540800 144   0 
1430540800 145   0 
1430540800 146   0 
1430540800 147   0 
1430540800 148   0 
1430540800 149   0 
1430540800 150   0 
1430540800 151   0 
1430540800 152   0 
1430540800 153   0 
1430540800 154   0 
1430540800 155   0 
1430540800 156   0 
1430540800 157   0 
1430540800 158   0 
1430540800 159   0 
1430540800 160   0 
1430540800 161   0 
1430540800 162   0 
1430540800 163   0 
1430540800 164   0 
1430540800 165   0 
1430540800 166   0 
1430540800 167   0 
1430540800 168   0 
1430540800 169   0 
1430540800 170   0 
1430540800 171   0 
1430540800 172   0 
1430540800 173   0 
1430540800 174   0 
1430540800 175   0 
1430540800 176   0 
1430540800 177   0 
1430540800 178   0 
1430540800 179   0 
1430540800 180   0 
1430540800 181   -1 
1430540800 182   0 
1430540800 183   0 
1430540800 184   0 
1430540800 185   0 
1430540800 186   0 
1430540800 187   0 
1430540800 188   0 
1430540800 189   0 
1430540800 190   0 
1430540800 191   0 
1430540800 192   0 
1430540800 193   0 
1430540800 194   0 
1430540800 195   0 
1430540800 196   0 
1430540800 197   0 
1430540800 198   0 
1430540800 199   0 
1430540800 200   0 
1430540800 201   0 
1430540800 202   0 
1430540800 203   0 
1430540800 204   0 
1430540800 205   0 
1430540800 206   0 
1430540800 207   0 
1430540800 208   0 
1430540800 209   0 
1430540800 210   0 
1430540800 211   0 
1430540800 212   0 
1430540800 213   0 
1430540800 214   0 
1430540800 215   0 
1430540800 216   0 
1430540800 217   0 
1430540800 218   0 
1430540800 219   0 
1430540800 220   0 
1430540800 221   0 
1430540800 222   0 
1430540800 223   0 
1430540800 224   0 
1430540800 225   0 
1430540800 226   0 
1430540800 227   0 
1430540800 228   0 
1430540800 229   0 
1430540800 230   0 
1430540800 231   0 
1430540800 232   0 
1430540800 233   0 
1430540800 234   0 
1430540800 235   0 
1430540800 236   0 
1430540800 237   0 
1430540800 238   0 
1430540800 239   0 
1430540800 240   0 
1430540800 241   1 
1430540800 242   0 
1430540800 243   0 
1430540800 244   0 
1430540800 245   0 
1430540800 246   0 
1430540800 247   0 
1430540800 248   0 
1430540800 249   0 
1430540800 250   0 
1430540800 251   0 
1430540800 252   0 
1430540800 253   0 
1430540800 254   0 
1430540800 255   0 
1430540800 256   0 
1430540800 257   0 
1430540800 258   0 
1430540800 259   0 
1430540800 260   0 
1430540800 261   0 
1430540800 262   0 
1430540800 263   0 
1430540800 264   0 
1430540800 265   0 
1430540800 266   0 
1430540800 267   0 
1430540800 268   0 
1430540800 269   0 
1430540800 270   0 
1430540800 271   0 
1430540800 272   0 
1430540800 273   0 
1430540800 274   0 
1430540800 275   0 
1430540800 276   0 
1430540800 277   0 
1430540800 278   0 
1430540800 279   0 
1430540800 280   0 
1430540800 281   0 
1430540800 282   0 
1430540800 283   0 
1430540800 284   0 
1430540800 285   0 
1430540800 286   0 
1430540800 287   0 
1430540800 288   0 
1430540800 289   0 
1430540800 290   0 
1430540800 291   0 
1430540800 292   0 
1430540800 293   0 
1430540800 294   0 
1430540800 295   0 
1430540800 296   0 
1430540800 297   0 
1430540800 298   0 
1430540800 299   0 
1430540800 300   0 
1430540800 301   -1 
1430540800 302   0 
1430540800 303   0 
1430540800 304   0 
1430540800 305   0 
1430540800 306   0 
1430540800 307   0 
1430540800 308   0 
1430540800 309   0 
1430540800 310   0 
1430540800 311   0 
1430540800 312   0 
1430540800 313   0 
1430540800 314   0 
1430540800 315   0 
1430540800 316   0 
1430540800 317   0 
1430540800 318   0 
1430540800 319   0 
1430540800 320   0 
1430540800 321   0 
1430540800 322   0 
1430540800 323   0 
1430540800 324   0 
1430540800 325   0 
1430540800 326   0 
1430540800 327   0 
1430540800 328   0 
1430540800 329   0 
1430540800 330   0 
1430540800 331   0 
1430540800 332   0 
1430540800 333   0 
1430540800 334   0 
1430540800 335   0 
1430540800 336   0 
1430540800 337   0 
1430540800 338   0 
1430540800 339   0 
1430540800 340   0 
1430540800 341   0 
1430540800 342   0 
1430540800 343   0 
1430540800 344   0 
1430540800 345   0 
1430540800 346   0 
1430540800 347   0 
1430540800 348   0 
1430540800 349   0 
1430540800 350   0 
1430540800 351   0 
1430540800 352   0 
1430540800 353   0 
1430540800 354   0 
1430540800 355   0 
1430540800 356   0 
1430540800 357   0 
1430540800 358   0 
1430540800 359   0 
1430540800 360   0 
