1434318927 1   1 
1434318927 2   0 
1434318927 3   0 
1434318927 4   -1 
1434318927 5   0 
1434318927 6   0 
1434318927 7   1 
1434318927 8   0 
1434318927 9   0 
1434318927 10   -1 
1434318927 11   0 
1434318927 12   0 
1434318927 13   1 
1434318927 14   0 
1434318927 15   0 
1434318927 16   -1 
1434318927 17   0 
1434318927 18   0 
1434318927 19   1 
1434318927 20   0 
1434318927 21   0 
1434318927 22   -1 
1434318927 23   0 
1434318927 24   0 
1434318927 25   1 
1434318927 26   0 
1434318927 27   0 
1434318927 28   -1 
1434318927 29   0 
1434318927 30   0 
1434318927 31   1 
1434318927 32   0 
1434318927 33   0 
1434318927 34   -1 
1434318927 35   0 
1434318927 36   0 
1434318927 37   0 
1434318927 38   0 
1434318927 39   0 
1434318927 40   0 
1434318927 41   0 
1434318927 42   0 
1434318927 43   0 
1434318927 44   0 
1434318927 45   0 
1434318927 46   0 
1434318927 47   0 
1434318927 48   0 
1434318927 49   0 
1434318927 50   0 
1434318927 51   0 
1434318927 52   0 
1434318927 53   0 
1434318927 54   0 
1434318927 55   0 
1434318927 56   0 
1434318927 57   0 
1434318927 58   0 
1434318927 59   0 
1434318927 60   0 
1434318927 61   0 
1434318927 62   0 
1434318927 63   0 
1434318927 64   0 
1434318927 65   0 
1434318927 66   0 
1434318927 67   0 
1434318927 68   0 
1434318927 69   0 
1434318927 70   0 
1434318927 71   0 
1434318927 72   0 
1434318927 73   0 
1434318927 74   0 
1434318927 75   0 
1434318927 76   0 
1434318927 77   0 
1434318927 78   0 
1434318927 79   0 
1434318927 80   0 
1434318927 81   0 
1434318927 82   0 
1434318927 83   0 
1434318927 84   0 
1434318927 85   0 
1434318927 86   0 
1434318927 87   0 
1434318927 88   0 
1434318927 89   0 
1434318927 90   0 
1434318927 91   0 
1434318927 92   0 
1434318927 93   0 
1434318927 94   0 
1434318927 95   0 
1434318927 96   0 
1434318927 97   0 
1434318927 98   0 
1434318927 99   0 
1434318927 100   0 
1434318927 101   0 
1434318927 102   0 
1434318927 103   0 
1434318927 104   0 
1434318927 105   0 
1434318927 106   0 
1434318927 107   0 
1434318927 108   0 
1434318927 109   0 
1434318927 110   0 
1434318927 111   0 
1434318927 112   0 
1434318927 113   0 
1434318927 114   0 
1434318927 115   0 
1434318927 116   0 
1434318927 117   0 
1434318927 118   0 
1434318927 119   0 
1434318927 120   0 
1434318927 121   0 
1434318927 122   0 
1434318927 123   0 
1434318927 124   0 
1434318927 125   0 
1434318927 126   0 
1434318927 127   0 
1434318927 128   0 
1434318927 129   0 
1434318927 130   0 
1434318927 131   0 
1434318927 132   0 
1434318927 133   0 
1434318927 134   0 
1434318927 135   0 
1434318927 136   0 
1434318927 137   0 
1434318927 138   0 
1434318927 139   0 
1434318927 140   0 
1434318927 141   0 
1434318927 142   0 
1434318927 143   0 
1434318927 144   0 
1434318927 145   0 
1434318927 146   0 
1434318927 147   0 
1434318927 148   0 
1434318927 149   0 
1434318927 150   0 
1434318927 151   0 
1434318927 152   0 
1434318927 153   0 
1434318927 154   0 
1434318927 155   0 
1434318927 156   0 
1434318927 157   0 
1434318927 158   0 
1434318927 159   0 
1434318927 160   0 
1434318927 161   0 
1434318927 162   0 
1434318927 163   0 
1434318927 164   0 
1434318927 165   0 
1434318927 166   0 
1434318927 167   0 
1434318927 168   0 
1434318927 169   0 
1434318927 170   0 
1434318927 171   0 
1434318927 172   0 
1434318927 173   0 
1434318927 174   0 
1434318927 175   0 
1434318927 176   0 
1434318927 177   0 
1434318927 178   0 
1434318927 179   0 
1434318927 180   0 
1434318927 181   0 
1434318927 182   0 
1434318927 183   0 
1434318927 184   0 
1434318927 185   0 
1434318927 186   0 
1434318927 187   0 
1434318927 188   0 
1434318927 189   0 
1434318927 190   0 
1434318927 191   0 
1434318927 192   0 
1434318927 193   0 
1434318927 194   0 
1434318927 195   0 
1434318927 196   0 
1434318927 197   0 
1434318927 198   0 
1434318927 199   0 
1434318927 200   0 
1434318927 201   0 
1434318927 202   0 
1434318927 203   0 
1434318927 204   0 
1434318927 205   0 
1434318927 206   0 
1434318927 207   0 
1434318927 208   0 
1434318927 209   0 
1434318927 210   0 
1434318927 211   0 
1434318927 212   0 
1434318927 213   0 
1434318927 214   0 
1434318927 215   0 
1434318927 216   0 
1434318927 217   0 
1434318927 218   0 
1434318927 219   0 
1434318927 220   0 
1434318927 221   0 
1434318927 222   0 
1434318927 223   0 
1434318927 224   0 
1434318927 225   0 
1434318927 226   0 
1434318927 227   0 
1434318927 228   0 
1434318927 229   0 
1434318927 230   0 
1434318927 231   0 
1434318927 232   0 
1434318927 233   0 
1434318927 234   0 
1434318927 235   0 
1434318927 236   0 
1434318927 237   0 
1434318927 238   0 
1434318927 239   0 
1434318927 240   0 
1434318927 241   0 
1434318927 242   0 
1434318927 243   0 
1434318927 244   0 
1434318927 245   0 
1434318927 246   0 
1434318927 247   0 
1434318927 248   0 
1434318927 249   0 
1434318927 250   0 
1434318927 251   0 
1434318927 252   0 
1434318927 253   0 
1434318927 254   0 
1434318927 255   0 
1434318927 256   0 
1434318927 257   0 
1434318927 258   0 
1434318927 259   0 
1434318927 260   0 
1434318927 261   0 
1434318927 262   0 
1434318927 263   0 
1434318927 264   0 
1434318927 265   0 
1434318927 266   0 
1434318927 267   0 
1434318927 268   0 
1434318927 269   0 
1434318927 270   0 
1434318927 271   0 
1434318927 272   0 
1434318927 273   0 
1434318927 274   0 
1434318927 275   0 
1434318927 276   0 
1434318927 277   0 
1434318927 278   0 
1434318927 279   0 
1434318927 280   0 
1434318927 281   0 
1434318927 282   0 
1434318927 283   0 
1434318927 284   0 
1434318927 285   0 
1434318927 286   0 
1434318927 287   0 
1434318927 288   0 
1434318927 289   0 
1434318927 290   0 
1434318927 291   0 
1434318927 292   0 
1434318927 293   0 
1434318927 294   0 
1434318927 295   0 
1434318927 296   0 
1434318927 297   0 
1434318927 298   0 
1434318927 299   0 
1434318927 300   0 
1434318927 301   0 
1434318927 302   0 
1434318927 303   0 
1434318927 304   0 
1434318927 305   0 
1434318927 306   0 
1434318927 307   0 
1434318927 308   0 
1434318927 309   0 
1434318927 310   0 
1434318927 311   0 
1434318927 312   0 
1434318927 313   0 
1434318927 314   0 
1434318927 315   0 
1434318927 316   0 
1434318927 317   0 
1434318927 318   0 
1434318927 319   0 
1434318927 320   0 
1434318927 321   0 
1434318927 322   0 
1434318927 323   0 
1434318927 324   0 
1434318927 325   0 
1434318927 326   0 
1434318927 327   0 
1434318927 328   0 
1434318927 329   0 
1434318927 330   0 
1434318927 331   0 
1434318927 332   0 
1434318927 333   0 
1434318927 334   0 
1434318927 335   0 
1434318927 336   0 
1434318927 337   0 
1434318927 338   0 
1434318927 339   0 
1434318927 340   0 
1434318927 341   0 
1434318927 342   0 
1434318927 343   0 
1434318927 344   0 
1434318927 345   0 
1434318927 346   0 
1434318927 347   0 
1434318927 348   0 
1434318927 349   0 
1434318927 350   0 
1434318927 351   0 
1434318927 352   0 
1434318927 353   0 
1434318927 354   0 
1434318927 355   0 
1434318927 356   0 
1434318927 357   0 
1434318927 358   0 
1434318927 359   0 
1434318927 360   0 
