1432682277 1   -1 
1432682277 2   0 
1432682277 3   0 
1432682277 4   -1 
1432682277 5   0 
1432682277 6   0 
1432682277 7   1 
1432682277 8   0 
1432682277 9   0 
1432682277 10   1 
1432682277 11   0 
1432682277 12   0 
1432682277 13   -1 
1432682277 14   0 
1432682277 15   0 
1432682277 16   -1 
1432682277 17   0 
1432682277 18   0 
1432682277 19   1 
1432682277 20   0 
1432682277 21   0 
1432682277 22   1 
1432682277 23   0 
1432682277 24   0 
1432682277 25   -1 
1432682277 26   0 
1432682277 27   0 
1432682277 28   -1 
1432682277 29   0 
1432682277 30   0 
1432682277 31   1 
1432682277 32   0 
1432682277 33   0 
1432682277 34   1 
1432682277 35   0 
1432682277 36   0 
1432682277 37   -1 
1432682277 38   0 
1432682277 39   0 
1432682277 40   -1 
1432682277 41   0 
1432682277 42   0 
1432682277 43   1 
1432682277 44   0 
1432682277 45   0 
1432682277 46   1 
1432682277 47   0 
1432682277 48   0 
1432682277 49   -1 
1432682277 50   0 
1432682277 51   0 
1432682277 52   -1 
1432682277 53   0 
1432682277 54   0 
1432682277 55   1 
1432682277 56   0 
1432682277 57   0 
1432682277 58   1 
1432682277 59   0 
1432682277 60   0 
1432682277 61   -1 
1432682277 62   0 
1432682277 63   0 
1432682277 64   -1 
1432682277 65   0 
1432682277 66   0 
1432682277 67   1 
1432682277 68   0 
1432682277 69   0 
1432682277 70   1 
1432682277 71   0 
1432682277 72   0 
1432682277 73   -1 
1432682277 74   0 
1432682277 75   0 
1432682277 76   -1 
1432682277 77   0 
1432682277 78   0 
1432682277 79   1 
1432682277 80   0 
1432682277 81   0 
1432682277 82   1 
1432682277 83   0 
1432682277 84   0 
1432682277 85   -1 
1432682277 86   0 
1432682277 87   0 
1432682277 88   -1 
1432682277 89   0 
1432682277 90   0 
1432682277 91   1 
1432682277 92   0 
1432682277 93   0 
1432682277 94   1 
1432682277 95   0 
1432682277 96   0 
1432682277 97   -1 
1432682277 98   0 
1432682277 99   0 
1432682277 100   -1 
1432682277 101   0 
1432682277 102   0 
1432682277 103   1 
1432682277 104   0 
1432682277 105   0 
1432682277 106   1 
1432682277 107   0 
1432682277 108   0 
1432682277 109   -1 
1432682277 110   0 
1432682277 111   0 
1432682277 112   -1 
1432682277 113   0 
1432682277 114   0 
1432682277 115   1 
1432682277 116   0 
1432682277 117   0 
1432682277 118   1 
1432682277 119   0 
1432682277 120   0 
1432682277 121   -1 
1432682277 122   0 
1432682277 123   0 
1432682277 124   -1 
1432682277 125   0 
1432682277 126   0 
1432682277 127   1 
1432682277 128   0 
1432682277 129   0 
1432682277 130   1 
1432682277 131   0 
1432682277 132   0 
1432682277 133   -1 
1432682277 134   0 
1432682277 135   0 
1432682277 136   -1 
1432682277 137   0 
1432682277 138   0 
1432682277 139   1 
1432682277 140   0 
1432682277 141   0 
1432682277 142   1 
1432682277 143   0 
1432682277 144   0 
1432682277 145   -1 
1432682277 146   0 
1432682277 147   0 
1432682277 148   -1 
1432682277 149   0 
1432682277 150   0 
1432682277 151   1 
1432682277 152   0 
1432682277 153   0 
1432682277 154   1 
1432682277 155   0 
1432682277 156   0 
1432682277 157   -1 
1432682277 158   0 
1432682277 159   0 
1432682277 160   -1 
1432682277 161   0 
1432682277 162   0 
1432682277 163   1 
1432682277 164   0 
1432682277 165   0 
1432682277 166   1 
1432682277 167   0 
1432682277 168   0 
1432682277 169   -1 
1432682277 170   0 
1432682277 171   0 
1432682277 172   -1 
1432682277 173   0 
1432682277 174   0 
1432682277 175   1 
1432682277 176   0 
1432682277 177   0 
1432682277 178   1 
1432682277 179   0 
1432682277 180   0 
1432682277 181   -1 
1432682277 182   0 
1432682277 183   0 
1432682277 184   -1 
1432682277 185   0 
1432682277 186   0 
1432682277 187   1 
1432682277 188   0 
1432682277 189   0 
1432682277 190   1 
1432682277 191   0 
1432682277 192   0 
1432682277 193   -1 
1432682277 194   0 
1432682277 195   0 
1432682277 196   -1 
1432682277 197   0 
1432682277 198   0 
1432682277 199   1 
1432682277 200   0 
1432682277 201   0 
1432682277 202   1 
1432682277 203   0 
1432682277 204   0 
1432682277 205   -1 
1432682277 206   0 
1432682277 207   0 
1432682277 208   -1 
1432682277 209   0 
1432682277 210   0 
1432682277 211   1 
1432682277 212   0 
1432682277 213   0 
1432682277 214   1 
1432682277 215   0 
1432682277 216   0 
1432682277 217   -1 
1432682277 218   0 
1432682277 219   0 
1432682277 220   -1 
1432682277 221   0 
1432682277 222   0 
1432682277 223   1 
1432682277 224   0 
1432682277 225   0 
1432682277 226   1 
1432682277 227   0 
1432682277 228   0 
1432682277 229   -1 
1432682277 230   0 
1432682277 231   0 
1432682277 232   -1 
1432682277 233   0 
1432682277 234   0 
1432682277 235   1 
1432682277 236   0 
1432682277 237   0 
1432682277 238   1 
1432682277 239   0 
1432682277 240   0 
1432682277 241   -1 
1432682277 242   0 
1432682277 243   0 
1432682277 244   -1 
1432682277 245   0 
1432682277 246   0 
1432682277 247   1 
1432682277 248   0 
1432682277 249   0 
1432682277 250   1 
1432682277 251   0 
1432682277 252   0 
1432682277 253   -1 
1432682277 254   0 
1432682277 255   0 
1432682277 256   -1 
1432682277 257   0 
1432682277 258   0 
1432682277 259   1 
1432682277 260   0 
1432682277 261   0 
1432682277 262   1 
1432682277 263   0 
1432682277 264   0 
1432682277 265   -1 
1432682277 266   0 
1432682277 267   0 
1432682277 268   -1 
1432682277 269   0 
1432682277 270   0 
1432682277 271   1 
1432682277 272   0 
1432682277 273   0 
1432682277 274   1 
1432682277 275   0 
1432682277 276   0 
1432682277 277   -1 
1432682277 278   0 
1432682277 279   0 
1432682277 280   -1 
1432682277 281   0 
1432682277 282   0 
1432682277 283   1 
1432682277 284   0 
1432682277 285   0 
1432682277 286   1 
1432682277 287   0 
1432682277 288   0 
1432682277 289   -1 
1432682277 290   0 
1432682277 291   0 
1432682277 292   -1 
1432682277 293   0 
1432682277 294   0 
1432682277 295   1 
1432682277 296   0 
1432682277 297   0 
1432682277 298   1 
1432682277 299   0 
1432682277 300   0 
1432682277 301   -1 
1432682277 302   0 
1432682277 303   0 
1432682277 304   -1 
1432682277 305   0 
1432682277 306   0 
1432682277 307   1 
1432682277 308   0 
1432682277 309   0 
1432682277 310   1 
1432682277 311   0 
1432682277 312   0 
1432682277 313   -1 
1432682277 314   0 
1432682277 315   0 
1432682277 316   -1 
1432682277 317   0 
1432682277 318   0 
1432682277 319   1 
1432682277 320   0 
1432682277 321   0 
1432682277 322   1 
1432682277 323   0 
1432682277 324   0 
1432682277 325   -1 
1432682277 326   0 
1432682277 327   0 
1432682277 328   -1 
1432682277 329   0 
1432682277 330   0 
1432682277 331   1 
1432682277 332   0 
1432682277 333   0 
1432682277 334   0 
1432682277 335   0 
1432682277 336   0 
1432682277 337   0 
1432682277 338   0 
1432682277 339   0 
1432682277 340   0 
1432682277 341   0 
1432682277 342   0 
1432682277 343   0 
1432682277 344   0 
1432682277 345   0 
1432682277 346   0 
1432682277 347   0 
1432682277 348   0 
1432682277 349   0 
1432682277 350   0 
1432682277 351   0 
1432682277 352   0 
1432682277 353   0 
1432682277 354   0 
1432682277 355   0 
1432682277 356   0 
1432682277 357   0 
1432682277 358   0 
1432682277 359   0 
1432682277 360   0 
