0 0 0    12.64     1.12 
0 0 1   415.05     0.14 
0 0 2   101.36     0.14 
0 0 3   110.75     0.14 
0 0 4   396.48     0.05 
0 0 5   397.35     0.06 
0 0 6    24.34     0.08 
0 0 7    23.94     0.05 
0 0 8   237.78     0.41 
0 0 9   177.66     0.05 
0 1 0    69.49     0.08 
0 1 2    68.57     0.14 
0 1 3    82.43     0.59 
0 1 4    67.08     0.05 
0 1 5   328.84     0.03 
0 1 6   580.37     0.36 
0 1 7    43.74     0.10 
0 1 8    74.87     0.03 
0 1 9    80.53     0.05 
0 1 10   167.52     0.05 
0 2 0    56.63     0.51 
0 2 1    14.56     0.08 
0 2 2    64.32     0.04 
0 2 3    48.37     0.13 
0 2 4   306.75     0.05 
0 2 5   351.36     0.18 
0 2 6   135.90     0.22 
0 2 7   186.89     0.05 
0 2 8   106.46     0.09 
0 2 9    39.99     0.11 
0 2 10    45.26     0.18 
0 2 11    57.19     0.04 
0 3 0    83.21     0.05 
0 3 1    55.69     0.05 
0 3 2   127.39     0.05 
0 3 3   346.06     0.34 
0 3 4    60.08     0.06 
0 3 5   201.09     0.06 
0 3 6    86.26     0.05 
0 3 7    95.58     0.10 
0 3 8    25.04     0.08 
0 3 9    37.90     0.08 
0 3 10    30.03     0.05 
0 3 11    19.60     0.06 
0 3 12   172.71     0.03 
0 4 0    30.40     0.09 
0 4 1    37.93     0.06 
0 4 2    23.65     0.05 
0 4 3    44.98     0.04 
0 4 5    27.87     0.46 
0 4 6    29.48     0.04 
0 4 7    61.84     0.20 
0 4 8    40.39     0.05 
0 4 9    59.73     0.04 
0 4 10    60.74     0.03 
0 4 11    41.15     0.03 
0 4 12    60.30     0.04 
0 4 13   194.75     0.05 
0 5 0    26.15     0.38 
0 5 1    59.84     0.22 
0 5 2    47.45     0.05 
0 5 3    59.48     0.08 
0 5 4   153.57     0.05 
0 5 5   274.12     0.05 
0 5 6    61.26     0.18 
0 5 7    40.58     0.14 
0 5 8    94.95     0.16 
0 5 9   117.35     0.07 
0 5 10    80.32     0.09 
0 5 11    31.90     0.05 
0 5 12    46.66     0.07 
0 5 13     4.74     1.64 
0 5 14   425.10     0.04 
0 6 0    60.08     0.14 
0 6 1    51.04     0.05 
0 6 2    25.51     0.05 
0 6 3    77.07     0.21 
0 6 4    38.85     0.42 
0 6 5    69.70     0.09 
0 6 6    15.52     0.19 
0 6 7    33.25     0.07 
0 6 8    45.35     0.06 
0 6 9    12.99     0.08 
0 6 10    62.29     0.06 
0 6 11    79.10     0.05 
0 6 12   192.28     0.05 
0 6 13   400.42     0.06 
0 6 14   110.43     0.08 
0 6 15   143.82     0.07 
0 7 0    63.66     0.06 
0 7 1    20.80     0.08 
0 7 2    18.85     0.09 
0 7 3    79.91     0.27 
0 7 4    47.84     0.08 
0 7 5    57.99     0.06 
0 7 6    56.26     0.05 
0 7 7    35.97     0.16 
0 7 8    93.85     0.04 
0 7 9    19.25     0.94 
0 7 10    32.71     0.05 
0 7 11    81.70     0.30 
0 7 12    83.33     0.04 
0 7 13   154.56     0.07 
0 7 14   113.43     0.03 
0 7 15   123.50     0.06 
0 7 16    12.13     0.11 
0 8 0    23.43     0.07 
0 8 1    25.57     0.10 
0 8 2    24.15     0.08 
0 8 3    36.82     0.08 
0 8 4    16.45     0.09 
0 8 5    20.98     0.07 
0 8 6    43.48     0.09 
0 8 7     5.07     0.15 
0 8 8    28.02     0.12 
0 8 9    18.07     0.07 
0 8 10   129.07     0.09 
0 8 11   372.53     0.04 
0 8 12    92.56     0.04 
0 8 13   131.88     0.16 
0 8 14    13.15     0.62 
0 8 15    68.65     0.07 
0 8 16    83.17     0.07 
0 9 8    81.14     0.07 
0 9 9    48.37     0.13 
0 9 11    50.10     0.06 
0 9 12    70.30     0.05 
0 9 13    46.54     0.16 
0 9 14   127.84     0.08 
0 9 15   105.40     0.05 
0 9 16    69.75     0.04 
0 10 8    32.46     0.27 
0 10 9    38.05     0.19 
0 10 10    10.92     0.09 
0 10 11    28.36     0.84 
0 10 12    35.63     0.06 
0 10 13    74.42     0.09 
0 10 14    21.39     0.26 
0 10 15    53.77     0.05 
0 11 8     1.83    -1.00 
0 11 9    18.84     0.14 
0 11 10    56.53     0.07 
0 11 11    39.14     0.19 
0 11 12   107.63     0.12 
0 11 13    79.77     0.03 
0 11 14    75.28     0.06 
0 11 15   370.65     0.04 
0 11 16   125.43     0.07 
0 12 8    39.93     0.19 
0 12 9    20.16     0.06 
0 12 10    27.25     0.36 
0 12 12   178.56     0.28 
0 12 13    15.96     0.07 
0 12 14    72.29     0.09 
0 12 15    32.07     0.05 
0 12 16    62.11     0.38 
0 13 8     3.24     0.13 
0 13 9     5.15     0.11 
0 13 11    40.74     0.15 
0 13 12    17.73     0.06 
0 13 13    55.11     0.22 
0 13 14    14.14     0.22 
0 13 15   340.10     0.06 
0 13 16    73.37     0.04 
0 14 8     9.95     0.14 
0 14 9     7.69     0.10 
0 14 10     1.08    -1.00 
0 14 11    55.08     0.05 
0 14 12   101.22     0.09 
0 14 13    21.73     0.22 
0 14 14    82.08     0.07 
0 14 15    36.37     0.21 
0 14 16   235.39     0.07 
0 15 8     8.90     0.07 
0 15 9     7.80     0.38 
0 15 10    31.41     0.08 
0 15 11    75.58     0.05 
0 15 12    15.59     0.07 
0 15 14    52.84     0.05 
0 15 15    78.67     0.28 
0 15 16   218.96     0.05 
0 16 8    11.57     0.09 
0 16 9    18.98     0.08 
0 16 10    46.88     0.14 
0 16 11   257.33     0.65 
0 16 12    31.37     0.05 
0 16 13    58.81     0.08 
0 16 14    91.37     0.06 
0 16 15   129.22     0.03 
0 16 16   283.57     0.04 
0 17 8     9.64     0.20 
0 17 9    83.15     0.09 
0 17 10   114.63     0.06 
0 17 11    55.72     0.04 
0 17 12   253.18     0.05 
0 17 13    52.47     0.04 
0 17 14   177.32     0.05 
0 17 15    25.65     0.28 
0 17 16    38.73     0.04 
0 18 8   107.97     0.10 
0 18 9   113.15     0.06 
0 18 10   111.03     0.17 
0 18 11    97.99     0.07 
0 18 12    89.79     0.19 
0 18 13   157.75     0.04 
0 18 14    91.02     0.04 
0 18 15   727.44     0.10 
0 18 16   297.24     0.04 
0 19 8   101.88     0.12 
0 19 9   136.59     0.37 
0 19 10   112.93     0.07 
0 19 11   112.35     0.04 
0 19 12   383.07     0.03 
0 19 13    56.81     0.03 
0 19 14    86.40     0.04 
0 19 15    76.89     0.03 
0 19 16    61.87     0.03 
0 20 8     3.64     0.39 
0 20 9    53.98     0.05 
0 20 10   133.01     0.08 
0 20 11   354.29     0.05 
0 20 12   295.07     0.04 
0 20 13    50.98     0.60 
0 20 14   500.77     0.03 
0 20 15   289.44     0.04 
0 20 16  1161.62     0.03 
0 21 8    26.06     0.83 
0 21 9    34.73     0.06 
0 21 10    31.54     0.07 
0 21 11    35.84     0.06 
0 21 12   171.26     0.02 
0 21 13   101.51     0.03 
0 21 14   489.40     0.16 
0 21 15    28.71     0.04 
0 21 16   951.02     0.04 
0 22 8    40.44     0.29 
0 22 9   206.71     0.07 
0 22 10    27.18     0.21 
0 22 11   142.25     0.03 
0 22 12   758.01     0.40 
0 22 13   128.68     0.03 
0 22 14   478.70     0.03 
0 22 15     4.03     0.49 
0 22 16   252.52     0.03 
0 23 8   110.80     0.04 
0 23 9    57.25     0.23 
0 23 10   127.41     0.10 
0 23 11    30.34     0.45 
0 23 12   188.49     0.14 
0 23 13   352.89     0.04 
0 23 14   344.07     0.03 
0 23 15   158.97     0.04 
0 23 16   212.86     0.06 
0 24 8   113.58     0.13 
0 24 9    46.98     0.53 
0 24 10    36.09     0.60 
0 24 11    24.62     0.05 
0 24 12   307.99     0.06 
0 24 13   283.74     0.03 
0 24 14    97.66     0.03 
0 24 15   497.64     0.03 
0 24 16   154.51     0.03 
0 25 0    40.13     0.15 
0 25 1    14.09     0.06 
0 25 2    11.78     0.73 
0 25 3     4.57     0.11 
0 25 4    47.55     0.06 
0 25 5    15.40     0.25 
0 25 6    84.67     0.06 
0 25 7    99.09     0.05 
0 25 8    46.89     0.21 
0 25 9    47.14     0.04 
0 25 10   509.15     0.03 
0 25 11   127.62     0.07 
0 25 12    29.65     0.04 
0 25 13   293.31     0.04 
0 25 14   313.61     0.04 
0 25 15   139.31     0.13 
0 25 16   254.10     0.03 
0 26 0    42.53     0.05 
0 26 1    37.48     0.24 
0 26 2   314.77     0.08 
0 26 3    26.31     0.05 
0 26 4    21.40     0.04 
0 26 5   112.27     0.09 
0 26 6    23.60     0.06 
0 26 7   151.84     0.05 
0 26 8    19.35     0.48 
0 26 10   160.26     0.02 
0 26 11   505.68     0.04 
0 26 12   224.34     0.03 
0 26 13   195.67     0.10 
0 26 14   209.47     0.03 
0 26 15    85.81     0.05 
0 26 16   431.51     0.04 
0 27 0   164.91     0.04 
0 27 1   152.65     0.28 
0 27 2   157.55     0.07 
0 27 3   266.83     0.09 
0 27 4  1326.64     0.09 
0 27 5   199.10     0.06 
0 27 6   178.10     0.50 
0 27 7   132.38     0.13 
0 27 8   149.38     0.58 
0 27 9   646.14     0.04 
0 27 10   905.45     0.04 
0 27 11   168.17     0.04 
0 27 12   269.56     0.16 
0 27 13   207.73     0.04 
0 27 14   249.12     0.04 
0 27 15   726.88     0.04 
0 28 0   154.43     0.12 
0 28 1   113.04     0.03 
0 28 2    97.98     0.05 
0 28 3   450.40     0.05 
0 28 4   293.16     0.11 
0 28 5   302.41     0.04 
0 28 7    21.62     0.05 
0 28 8   141.91     0.03 
0 28 9   179.67     0.03 
0 28 10   138.79     0.04 
0 28 11   326.53     0.02 
0 28 12   235.45     0.04 
0 28 13   357.08     0.03 
0 28 14   300.49     0.03 
0 29 0    82.41     0.04 
0 29 1   134.92     0.05 
0 29 2   101.92     0.03 
0 29 3   106.24     0.03 
0 29 4   176.25     0.05 
0 29 5    90.61     0.04 
0 29 6   158.37     0.34 
0 29 7    29.02     0.05 
0 29 8   524.45     0.14 
0 29 9    60.82     0.04 
0 29 10   295.56     0.05 
0 29 11   184.02     0.05 
0 29 12   513.82     0.03 
0 29 13   375.28     0.04 
0 30 0   245.54     0.04 
0 30 1   437.89     0.04 
0 30 2   460.12     0.07 
0 30 3   803.79     0.06 
0 30 4   172.80     0.15 
0 30 5   341.28     0.06 
0 30 6   242.16     0.03 
0 30 7   103.32     0.15 
0 30 8   335.00     0.04 
0 30 9   445.51     0.04 
0 30 10   384.61     0.04 
0 30 11   443.75     0.03 
0 30 12   365.94     0.04 
0 31 0   228.11     0.10 
0 31 1   201.54     0.04 
0 31 2   189.41     0.06 
0 31 3   142.69     0.14 
0 31 4   283.87     0.03 
0 31 5   314.68     0.04 
0 31 6   290.50     0.03 
0 31 7   236.64     0.07 
0 31 8   581.84     0.05 
0 31 9   856.66     0.06 
0 31 10   197.08     0.03 
0 31 11   177.53     0.03 
0 32 0   152.49     0.03 
0 32 1   185.66     0.10 
0 32 2   344.81     0.04 
0 32 3   114.28     0.04 
0 32 4   162.11     0.03 
0 32 5   647.97     0.05 
0 32 6   384.36     0.03 
0 32 7   199.97     0.03 
0 32 8   113.71     0.04 
0 32 9   291.57     0.06 
0 32 10   240.55     0.05 
0 33 0  1573.12     0.02 
0 33 1   399.25     0.04 
0 33 2    27.10     0.04 
0 33 3   255.83     0.70 
0 33 4    46.79     0.56 
0 33 5   156.35     0.03 
0 33 6    25.31     0.05 
0 33 7   223.51     0.03 
0 33 8   181.83     0.05 
0 33 9   195.84     0.05 
1 0 0   610.67     0.03 
1 0 1   459.68     0.03 
1 0 2   251.09     0.04 
1 0 3   392.43     0.06 
1 0 4   330.25     0.10 
1 0 5   188.44     0.03 
1 0 6   708.38     0.08 
1 0 7   362.25     0.03 
1 0 8  1364.67     0.04 
1 0 9   209.18     0.03 
1 1 0    96.53     0.06 
1 1 1   194.07     0.03 
1 1 2   230.29     0.06 
1 1 3   248.40     0.04 
1 1 4   582.19     0.03 
1 1 5   199.04     0.03 
1 1 6    95.83     0.44 
1 1 7   190.61     0.16 
1 1 8   445.65     0.12 
1 1 9   317.26     0.12 
1 1 10   302.37     0.11 
1 2 1   206.50     0.05 
1 2 2   190.66     0.04 
1 2 3   340.18     0.08 
1 2 4   385.71     0.14 
1 2 5   239.09     0.03 
1 2 6   415.49     0.18 
1 2 7    35.57     0.03 
1 2 8   158.33     0.13 
1 2 9  2376.51     0.13 
1 2 10   343.03     0.13 
1 2 11   186.54     0.29 
1 3 0   118.41     0.03 
1 3 1   120.22     0.08 
1 3 2   101.65     0.04 
1 3 3   146.30     0.03 
1 3 4   492.95     0.05 
1 3 5   729.04     0.02 
1 3 6   119.18     0.24 
1 3 7   677.08     0.23 
1 3 8   381.61     0.12 
1 3 9   101.53     0.10 
1 3 10   104.21     0.14 
1 3 11   231.11     0.11 
1 3 12   493.24     0.02 
1 4 0   396.88     0.06 
1 4 1   734.80     0.15 
1 4 2   288.96     0.23 
1 4 3   614.87     0.03 
1 4 4  1271.70     0.03 
1 4 5   700.80     0.05 
1 4 6  1056.45     0.02 
1 4 7   677.08     0.07 
1 4 8   914.44     0.17 
1 4 9   104.88     0.53 
1 4 10    41.97     0.15 
1 4 11   884.85     0.21 
1 4 12  2564.26     0.09 
1 4 13  2411.75     0.03 
1 5 0   273.56     0.04 
1 5 1   359.08     0.05 
1 5 2   281.58     0.06 
1 5 3    98.47     0.03 
1 5 4    99.76     0.07 
1 5 5   104.32     0.07 
1 5 6   438.18     0.11 
1 5 7   153.50     0.38 
1 5 8     4.21     0.20 
1 5 9   666.65     0.34 
1 5 10   109.43     0.16 
1 5 11  1656.33     0.06 
1 5 12   536.29     0.28 
1 5 13   505.11     0.25 
1 5 14   453.80     0.02 
1 6 0   185.33     0.06 
1 6 1   237.23     0.13 
1 6 2   398.50     0.05 
1 6 3   254.06     0.06 
1 6 4    48.31     0.03 
1 6 5   134.50     0.04 
1 6 6   762.52     0.03 
1 6 7   386.77     0.03 
1 6 8   369.19     0.03 
1 6 9   546.03     0.56 
1 6 10  1294.80     0.07 
1 6 11   677.52     0.05 
1 6 12  1172.95     0.41 
1 6 13   105.40     0.04 
1 6 14   791.56     0.06 
1 6 15   147.42     0.03 
1 7 0   142.42     0.08 
1 7 1   214.43     0.04 
1 7 2   117.15     0.05 
1 7 3   377.07     0.14 
1 7 4   174.19     0.11 
1 7 5   248.90     0.18 
1 7 6    48.94     0.15 
1 7 7    74.20     0.03 
1 7 8    89.09     0.03 
1 7 9   133.14     0.07 
1 7 10   695.75     0.05 
1 7 11   262.91     0.27 
1 7 12   307.94     0.05 
1 7 13   963.39     0.03 
1 7 14   215.48     0.03 
1 7 15   308.37     0.03 
1 7 16   917.98     0.03 
1 8 0    52.96     0.18 
1 8 1    43.39     0.13 
1 8 2   116.85     0.05 
1 8 3   366.72     0.31 
1 8 4   174.07     0.05 
1 8 5   153.04     0.04 
1 8 6   214.87     0.05 
1 8 7    98.31     0.03 
1 8 8   181.18     0.04 
1 8 9    84.87     0.05 
1 8 10   306.76     0.03 
1 8 11   492.45     0.25 
1 8 12   901.70     0.10 
1 8 13   353.45     0.25 
1 8 14   583.49     0.05 
1 8 15  1080.38     0.06 
1 8 16  1290.27     0.07 
1 9 8   130.75     0.03 
1 9 9   244.65     0.51 
1 9 10   257.41     0.25 
1 9 11   278.26     0.48 
1 9 12   121.10     0.13 
1 9 13   236.81     0.03 
1 9 14   972.52     0.04 
1 9 15    16.99     0.15 
1 9 16   708.24     0.03 
1 10 8   372.93     0.08 
1 10 9   267.85     0.05 
1 10 10   122.12     0.59 
1 10 11   663.21     0.13 
1 10 12   741.06     0.13 
1 10 13   381.38     0.05 
1 10 14   372.56     0.04 
1 10 15   117.55     0.05 
1 10 16   616.37     0.03 
1 11 8   145.81     0.11 
1 11 9   307.81     0.13 
1 11 10    75.65     0.30 
1 11 11   602.65     0.18 
1 11 12   213.41     0.05 
1 11 13   426.26     0.64 
1 11 15    63.56     0.05 
1 11 16   660.81     0.03 
1 12 8   360.05     0.13 
1 12 9    68.88     0.08 
1 12 10   475.20     0.03 
1 12 11   223.96     0.04 
1 12 12    13.28     1.09 
1 12 13   287.74     0.10 
1 12 14  1393.99     0.50 
1 12 15   555.02     0.39 
1 12 16  1818.64     0.03 
1 13 8    78.56     0.12 
1 13 9   304.07     0.05 
1 13 10   141.42     0.06 
1 13 11   292.33     0.27 
1 13 12    81.90     0.07 
1 13 13   133.34     0.05 
1 13 14   246.29     0.06 
1 13 15   475.11     0.12 
1 13 16   987.43     0.05 
1 14 8   158.74     0.06 
1 14 9   134.90     0.04 
1 14 10    46.91     0.12 
1 14 11   178.65     0.12 
1 14 12   145.68     0.54 
1 14 13    53.59     0.24 
1 14 14   179.47     0.03 
1 14 16  1044.10     0.04 
1 15 8    36.21     0.62 
1 15 9   174.36     0.17 
1 15 10    56.29     0.32 
1 15 11   110.31     0.13 
1 15 12   284.89     0.05 
1 15 13   114.95     0.17 
1 15 14   164.14     0.13 
1 15 15   190.08     0.04 
1 15 16   879.77     0.05 
1 16 8   178.23     0.10 
1 16 9    82.88     0.06 
1 16 10   114.25     0.18 
1 16 11    15.95     0.28 
1 16 12   783.44     0.23 
1 16 13   481.22     0.66 
1 16 14   530.95     0.13 
1 16 15   333.52     0.04 
1 16 16  1332.28     0.16 
1 17 8   127.36     0.07 
1 17 9    62.93     0.22 
1 17 10    99.70     0.49 
1 17 11   637.53     0.05 
1 17 12   267.72     0.03 
1 17 13    56.25     0.36 
1 17 14    80.55     0.09 
1 17 15   650.38     0.10 
1 17 16   658.51     0.02 
1 18 8    52.78     0.16 
1 18 9    89.95     0.09 
1 18 10   401.31     0.68 
1 18 11   696.58     0.16 
1 18 12   297.81     0.51 
1 18 13    80.97     0.20 
1 18 14   599.65     0.13 
1 18 15   502.24     0.06 
1 18 16   686.88     0.06 
1 19 8   112.44     0.36 
1 19 9    88.96     0.05 
1 19 10   460.40     0.03 
1 19 11   340.70     0.05 
1 19 12    29.50     0.53 
1 19 13   349.19     0.05 
1 19 14   935.89     0.06 
1 19 15   807.37     0.23 
1 19 16  1431.25     0.03 
1 20 8    87.95     0.08 
1 20 9   227.18     0.15 
1 20 10   246.84     0.36 
1 20 11    48.59     0.42 
1 20 12     4.55     0.15 
1 20 13   159.84     0.05 
1 20 14   281.34     0.31 
1 20 15   573.22     0.37 
1 20 16   530.96     0.04 
1 21 8    65.43     0.54 
1 21 9    51.65     0.19 
1 21 10   239.47     0.09 
1 21 11   106.93     0.38 
1 21 12   329.97     0.08 
1 21 13   531.45     0.04 
1 21 14   475.95     0.18 
1 21 15  1133.27     0.06 
1 21 16  1825.14     0.49 
1 22 9   312.11     0.07 
1 22 10   693.24     0.08 
1 22 11   396.82     0.12 
1 22 12   656.86     0.11 
1 22 13   717.90     0.04 
1 22 14   731.79     0.08 
1 22 15  1573.80     0.39 
1 22 16  1820.40     0.04 
1 23 8   210.60     0.18 
1 23 9   131.72     0.05 
1 23 10   486.98     0.22 
1 23 11    77.60     0.31 
1 23 12   727.33     0.03 
1 23 13   185.43     0.30 
1 23 14   473.06     0.03 
1 23 15  1925.19     0.06 
1 23 16  1858.83     0.05 
1 24 8   218.90     0.08 
1 24 9   378.61     0.43 
1 24 10   275.97     0.27 
1 24 11   218.86     0.16 
1 24 12   429.20     0.11 
1 24 13   159.68     0.38 
1 24 14   500.10     0.06 
1 24 15   843.29     0.04 
1 25 0    44.24     0.09 
1 25 1    11.95     0.18 
1 25 2    16.14     0.11 
1 25 3    60.88     0.40 
1 25 4    68.75     0.07 
1 25 5   106.93     0.05 
1 25 6   178.67     0.06 
1 25 7   254.28     0.15 
1 25 8   345.63     0.08 
1 25 9   237.39     0.09 
1 25 10   577.23     0.07 
1 25 11    65.25     0.04 
1 25 12   455.99     0.07 
1 25 13   157.90     0.27 
1 25 14   306.70     0.28 
1 25 15   637.80     0.04 
1 25 16  1516.06     0.03 
1 26 0    63.00     0.06 
1 26 1    67.02     0.05 
1 26 2    97.81     0.26 
1 26 3   249.01     0.07 
1 26 4   192.25     0.23 
1 26 5   428.82     0.31 
1 26 7   282.92     0.04 
1 26 8   886.95     0.03 
1 26 10   439.81     0.06 
1 26 11   934.96     0.40 
1 26 12  1002.55     0.09 
1 26 13   808.19     0.05 
1 26 14   844.56     0.05 
1 26 15   114.27     0.03 
1 26 16  4006.11     0.01 
1 27 0   160.73     0.05 
1 27 1    54.90     0.08 
1 27 2   216.37     0.04 
1 27 3    65.21     0.08 
1 27 4   603.93     0.08 
1 27 5    92.29     0.05 
1 27 6   310.61     0.18 
1 27 7   168.44     0.12 
1 27 8   558.19     0.04 
1 27 9     8.03     0.08 
1 27 10   882.74     0.04 
1 27 11   421.63     0.06 
1 27 12  1096.63     0.06 
1 27 13   663.26     0.22 
1 27 14   999.54     0.05 
1 27 15   787.01     0.04 
1 28 0   212.82     0.08 
1 28 1   147.90     0.04 
1 28 2   686.53     0.20 
1 28 3   163.20     0.30 
1 28 4   604.66     0.05 
1 28 5   427.24     0.07 
1 28 6   310.95     0.03 
1 28 7   244.36     0.75 
1 28 8   626.23     0.12 
1 28 9   396.87     0.07 
1 28 10   928.76     0.03 
1 28 11   476.09     0.54 
1 28 12   649.03     0.03 
1 28 13  1012.26     0.09 
1 28 14   474.81     0.03 
1 29 0   573.77     0.05 
1 29 1   313.87     0.03 
1 29 2   483.10     0.03 
1 29 3   167.65     0.18 
1 29 4   418.04     0.25 
1 29 5   150.64     0.29 
1 29 6   626.19     0.24 
1 29 7  1220.10     0.25 
1 29 8  1425.66     0.28 
1 29 9   594.38     0.08 
1 29 11    37.41     0.04 
1 29 12   630.17     0.03 
1 29 13   275.99     0.27 
1 30 0   548.40     0.03 
1 30 1   340.79     0.03 
1 30 2   655.02     0.13 
1 30 3   310.87     0.03 
1 30 4   676.27     0.03 
1 30 5  1080.77     0.03 
1 30 6  1564.86     0.05 
1 30 7   326.26     0.03 
1 30 8  2101.90     0.08 
1 30 9  1329.64     0.03 
1 30 10  1251.36     0.03 
1 30 11   740.42     0.16 
1 30 12  3065.45     0.03 
1 31 0   993.50     0.04 
1 31 1   446.77     0.03 
1 31 2   265.06     0.04 
1 31 3   343.23     0.04 
1 31 4   364.90     0.03 
1 31 5   287.43     0.02 
1 31 6   397.85     0.09 
1 31 7    36.32     0.75 
1 31 8  2610.77     0.02 
1 31 9   911.49     0.05 
1 31 10  2053.33     0.03 
1 31 11   923.78     0.03 
1 32 0  1482.58     0.03 
1 32 1   294.96     0.03 
1 32 2   692.23     0.11 
1 32 3   296.32     0.03 
1 32 4   495.86     0.09 
1 32 5   554.36     0.04 
1 32 6   240.45     0.03 
1 32 7   965.04     0.19 
1 32 8   640.54     0.05 
1 32 9   861.37     0.09 
1 32 10   955.13     0.23 
1 33 0  1217.12     0.03 
1 33 1  2331.68     0.03 
1 33 2  1638.99     0.03 
1 33 3  1354.78     0.29 
1 33 4  1376.33     0.03 
1 33 5   856.18     0.02 
1 33 6  2204.38     0.03 
1 33 7  2725.09     0.03 
1 33 8  2023.99     0.33 
1 33 9   409.29     0.07 
2 0 0    16.42     0.11 
2 0 1    46.48     0.09 
2 0 2    27.42     0.08 
2 0 3    27.30     0.09 
2 0 4    41.68     0.03 
2 0 5    57.35     0.03 
2 0 6    35.23     0.03 
2 0 7    56.35     0.03 
2 0 8    44.33     0.05 
2 0 9    85.80     0.05 
2 0 10     1.92    -1.00 
2 0 11    25.44     0.06 
2 1 0     9.48     0.12 
2 1 1     5.04     0.14 
2 1 2     7.33     0.14 
2 1 3    42.90     0.08 
2 1 4    23.58     0.04 
2 1 5    10.92     0.08 
2 1 6     3.62     0.06 
2 1 7    60.31     0.05 
2 1 8    42.56     0.05 
2 1 9    28.95     0.04 
2 1 10    45.58     0.05 
2 1 11    45.24     0.05 
2 2 0     4.21     0.15 
2 2 1     8.27     0.14 
2 2 2     8.22     0.16 
2 2 3    53.17     0.09 
2 2 5     6.34     0.12 
2 2 6     3.29     0.11 
2 2 7    12.46     0.09 
2 2 8    45.66     0.06 
2 2 9    19.56     0.06 
2 2 10    42.52     0.05 
2 2 11    55.93     0.04 
2 3 0    19.25     0.13 
2 3 1    17.43     0.13 
2 3 2     8.97     0.13 
2 3 3     2.20     0.20 
2 3 4    12.24     0.42 
2 3 5     1.40    -1.00 
2 3 6     2.22     0.18 
2 3 7    36.15     0.06 
2 3 8    17.66     0.07 
2 3 9    23.82     0.06 
2 3 10    12.90     0.06 
2 3 11     4.13     0.14 
2 4 0     2.79     0.15 
2 4 1     1.14    -1.00 
2 4 2     5.02     0.16 
2 4 3     4.25     0.20 
2 4 4    33.15     0.04 
2 4 5     8.11     0.14 
2 4 6    20.39     0.10 
2 4 7    16.42     0.09 
2 4 8    21.95     0.08 
2 4 9    44.89     0.08 
2 4 10    39.54     0.06 
2 4 11    37.39     0.05 
2 5 0     8.51     0.05 
2 5 1    22.05     0.04 
2 5 2     6.07     0.14 
2 5 3    33.15     0.04 
2 5 4    28.35     0.04 
2 5 5     1.24    -1.00 
2 5 7     8.95     0.08 
2 5 8    17.08     0.05 
2 5 9    24.05     0.03 
2 5 10    21.56     0.06 
2 5 11    48.18     0.05 
2 6 0    27.73     0.04 
2 6 1    17.06     0.09 
2 6 2     1.86    -1.00 
2 6 3    10.80     0.06 
2 6 4     1.00    -1.00 
2 6 5    30.89     0.03 
2 6 6     2.74     0.47 
2 6 7     2.09     0.00 
2 6 8    12.77     0.09 
2 6 9    17.28     0.08 
2 6 10    23.28     0.08 
2 6 11    51.81     0.06 
2 7 7    27.18     0.11 
2 7 8     5.77     0.13 
2 7 9    22.22     0.09 
2 7 10    16.48     0.08 
2 7 11    29.96     0.05 
2 8 5     8.90     0.06 
2 8 6    10.15     0.06 
2 8 7     8.52     0.06 
2 8 8     4.13     0.17 
2 8 9     4.34     0.16 
2 8 10    87.81     0.11 
2 8 11    30.57     0.07 
2 9 5    11.95     0.04 
2 9 6    10.42     0.07 
2 9 7    17.24     0.05 
2 9 8    12.03     0.13 
2 9 9    17.62     0.10 
2 9 10     6.93     0.11 
2 10 5     8.59     0.07 
2 10 6    13.45     0.05 
2 10 7     4.27     0.04 
2 10 8     5.57     0.16 
2 10 9    22.03     0.09 
2 10 10    16.18     0.09 
2 10 11     1.27    -1.00 
2 11 5    28.06     0.04 
2 11 6     3.96     0.13 
2 11 7     8.91     0.06 
2 11 8     7.21     0.15 
2 11 9    29.37     0.10 
2 11 10    18.71     0.09 
2 11 11    45.04     0.07 
2 12 5     9.89     0.05 
2 12 6    45.61     0.02 
2 12 7     6.75     0.08 
2 12 8    17.58     0.10 
2 12 9    33.97     0.08 
2 12 11    23.75     0.25 
2 13 5     4.78     0.14 
2 13 6    50.14     0.03 
2 13 7    39.98     0.04 
2 13 8    19.03     0.09 
2 13 9    32.02     0.08 
2 13 10    17.99     0.07 
2 13 11    59.74     0.05 
2 14 5    12.04     0.05 
2 14 6    13.15     0.04 
2 14 7    91.39     0.02 
2 14 8     9.49     0.11 
2 14 9    39.67     0.07 
2 14 11    80.12     0.10 
2 15 5    35.63     0.10 
2 15 6    39.03     0.06 
2 15 7    12.24     0.13 
2 15 8    36.30     0.08 
2 15 9    16.69     0.09 
2 15 10    61.13     0.06 
2 15 11    65.82     0.06 
2 16 5     1.47    -1.00 
2 16 6    37.81     0.03 
2 16 7     5.43     0.16 
2 16 8    52.25     0.08 
2 16 9     5.33     0.12 
2 16 10    26.35     0.32 
2 16 11    29.21     0.10 
2 17 0    50.43     0.07 
2 17 1    10.01     0.09 
2 17 2     4.85     0.14 
2 17 3    38.27     0.11 
2 17 6    24.81     0.12 
2 17 7     1.25    -1.00 
2 17 8    98.20     0.07 
2 17 9    44.30     0.06 
2 17 10    89.54     0.05 
2 17 11    35.82     0.05 
2 18 0    83.72     0.06 
2 18 1    91.23     0.08 
2 18 2    55.13     0.06 
2 18 3    83.86     0.08 
2 18 4    29.42     0.15 
2 18 5    31.88     0.16 
2 18 6   122.77     0.08 
2 18 7    15.46     0.09 
2 18 8    25.74     0.08 
2 18 9   140.02     0.06 
2 18 10    29.53     0.05 
2 18 11    46.22     0.05 
2 19 0    26.42     0.11 
2 19 1    37.95     0.10 
2 19 2    39.96     0.14 
2 19 4    30.67     0.10 
2 19 5    28.59     0.09 
2 19 6    46.37     0.07 
2 19 7    89.53     0.06 
2 19 8    17.19     0.06 
2 19 9    49.80     0.05 
2 19 10   108.06     0.04 
2 19 11    61.40     0.05 
2 20 0    31.05     0.12 
2 20 1     9.46     0.16 
2 20 2     7.70     0.18 
2 20 3     8.32     0.15 
2 20 4     9.24     0.10 
2 20 5     8.08     0.10 
2 20 6    67.00     0.06 
2 20 7    15.58     0.06 
2 20 8    62.88     0.05 
2 20 9    24.85     0.06 
2 20 10    66.43     0.05 
2 20 11    60.00     0.04 
2 21 0    42.67     0.09 
2 21 1    20.70     0.11 
2 21 2    61.08     0.07 
2 21 3     4.67     0.14 
2 21 4    66.33     0.07 
2 21 5    35.49     0.07 
2 21 6    42.94     0.07 
2 21 7    28.15     0.05 
2 21 8    70.38     0.05 
2 21 9    80.54     0.04 
2 21 10    62.34     0.05 
2 21 11   137.09     0.04 
2 22 0     3.19     0.19 
2 22 1   138.00     0.37 
2 22 2    26.70     0.07 
2 22 3    24.72     0.09 
2 22 4     6.24     0.06 
2 22 5    71.04     0.05 
2 22 6    18.42     0.05 
2 22 7   240.34     0.05 
2 22 8    80.47     0.04 
2 22 9    74.10     0.04 
2 22 10    89.03     0.04 
2 22 11   102.30     0.04 
2 23 0    42.65     0.06 
2 23 1    39.00     0.06 
2 23 2    42.06     0.11 
2 23 3   108.25     0.05 
2 23 4    31.73     0.37 
2 23 5    29.03     0.36 
2 23 6    80.55     0.36 
2 23 7   113.37     0.04 
2 23 8   184.70     0.20 
2 23 9    88.27     0.04 
2 23 10     1.41    -1.00 
2 23 11   107.83     0.11 
3 0 0    39.56     0.07 
3 0 1    76.85     0.06 
3 0 2   263.64     0.06 
3 0 3    96.77     0.06 
3 0 4    64.83     0.06 
3 0 5   203.65     0.35 
3 0 6     1.13    -1.00 
3 0 7   130.14     0.36 
3 0 8   120.49     0.02 
3 0 9   294.46     0.04 
3 0 10   120.64     0.03 
3 0 11    58.08     0.07 
3 1 0    44.16     0.08 
3 1 1    52.80     0.08 
3 1 2    70.26     0.07 
3 1 3    29.29     0.08 
3 1 4    71.41     0.07 
3 1 5    70.81     0.05 
3 1 6    57.75     0.05 
3 1 7    83.78     0.04 
3 1 8   100.79     0.04 
3 1 9    19.03     0.05 
3 1 10   127.12     0.05 
3 1 11   294.57     0.03 
3 2 0    13.39     0.06 
3 2 1    73.00     0.08 
3 2 2    17.44     0.09 
3 2 3    28.68     0.07 
3 2 4    39.64     0.07 
3 2 5    21.28     0.08 
3 2 6    75.39     0.06 
3 2 7    49.37     0.05 
3 2 8    13.24     0.06 
3 2 9   119.08     0.05 
3 2 10    48.14     0.04 
3 2 11    79.55     0.04 
3 3 0    20.59     0.12 
3 3 1     7.46     0.12 
3 3 2     1.57    -1.00 
3 3 3    29.07     0.13 
3 3 4     9.61     0.10 
3 3 5    24.99     0.07 
3 3 6    49.88     0.07 
3 3 7    51.72     0.05 
3 3 8    32.45     0.06 
3 3 9    86.40     0.04 
3 3 10   135.29     0.03 
3 3 11   112.23     0.04 
3 4 0    14.25     0.19 
3 4 1     9.19     0.14 
3 4 2    15.71     0.12 
3 4 3    11.54     0.14 
3 4 4    14.01     0.10 
3 4 5    19.76     0.10 
3 4 6    39.69     0.08 
3 4 7    55.35     0.06 
3 4 8    26.61     0.05 
3 4 10   108.66     0.04 
3 4 11   156.22     0.04 
3 5 0    41.80     0.03 
3 5 1    29.06     0.02 
3 5 2    37.85     0.02 
3 5 3    59.40     0.02 
3 5 4    24.39     0.42 
3 5 5    55.27     0.10 
3 5 6    33.11     0.09 
3 5 7    34.09     0.08 
3 5 8    93.79     0.06 
3 5 9   596.09     0.07 
3 5 10   128.82     0.04 
3 5 11    12.73     0.05 
3 6 0     9.23     0.05 
3 6 1    15.86     0.04 
3 6 2    18.47     0.03 
3 6 3    29.51     0.02 
3 6 4    98.36     0.03 
3 6 5    45.82     0.11 
3 6 6     9.79     0.11 
3 6 7     1.53    -1.00 
3 6 8    39.68     0.07 
3 6 9    58.38     0.05 
3 6 10    61.85     0.05 
3 6 11    44.87     0.05 
3 7 5   183.88     0.03 
3 7 6    18.79     0.13 
3 7 7    23.09     0.40 
3 7 8    60.12     0.08 
3 7 9    18.24     0.13 
3 7 10    64.51     0.05 
3 7 11   455.10     0.06 
3 8 5    29.78     0.08 
3 8 6    43.29     0.02 
3 8 7    12.48     0.12 
3 8 8     2.63     0.11 
3 8 9    22.63     0.06 
3 8 10    41.67     0.06 
3 8 11   113.67     0.04 
3 9 5    30.39     0.03 
3 9 6    41.33     0.03 
3 9 7    12.26     0.18 
3 9 8    44.51     0.09 
3 9 9    52.10     0.07 
3 9 10    50.55     0.06 
3 9 11    57.73     0.05 
3 10 5    22.51     0.03 
3 10 6    14.03     0.05 
3 10 7    33.52     0.11 
3 10 8    21.24     0.08 
3 10 9    31.58     0.07 
3 10 10    30.97     0.05 
3 10 11    86.48     0.06 
3 11 5    30.23     0.03 
3 11 6    61.77     0.03 
3 11 7    10.24     0.15 
3 11 8    36.82     0.08 
3 11 9    51.08     0.07 
3 11 10    73.52     0.06 
3 11 11   101.13     0.05 
3 12 5     5.17     0.15 
3 12 6    48.89     0.03 
3 12 7     8.10     0.20 
3 12 8    18.48     0.12 
3 12 9    12.97     0.11 
3 12 10    44.13     0.07 
3 12 11    95.89     0.05 
3 13 5    31.04     0.04 
3 13 6    58.58     0.03 
3 13 7    11.40     0.13 
3 13 8    26.83     0.08 
3 13 9    67.93     0.07 
3 13 10    53.16     0.06 
3 13 11   148.95     0.05 
3 14 5    40.86     0.04 
3 14 6    70.25     0.03 
3 14 7    18.12     0.12 
3 14 8    34.48     0.09 
3 14 9    45.40     0.07 
3 14 10    72.16     0.06 
3 14 11    98.19     0.05 
3 15 5    77.69     0.03 
3 15 6    38.37     0.03 
3 15 7    88.17     0.08 
3 15 8    29.53     0.09 
3 15 9    38.58     0.06 
3 15 10   116.50     0.05 
3 15 11    75.69     0.04 
3 16 6    18.92     0.11 
3 16 7    44.90     0.10 
3 16 8   181.84     0.08 
3 16 9    36.97     0.06 
3 16 10    30.62     0.05 
3 16 11   229.96     0.08 
3 17 1    67.38     0.04 
3 17 2    27.29     0.05 
3 17 3     4.84     0.10 
3 17 4   350.64     0.34 
3 17 5    22.05     0.44 
3 17 6    35.33     0.10 
3 17 7   184.72     0.08 
3 17 8   131.32     0.07 
3 17 9    83.62     0.06 
3 17 10    74.71     0.05 
3 17 11   250.60     0.05 
3 18 0    68.31     0.04 
3 18 1    71.10     0.05 
3 18 2    29.19     0.04 
3 18 3    40.15     0.11 
3 18 4    93.72     0.12 
3 18 5    62.74     0.22 
3 18 6   116.65     0.07 
3 18 7    96.49     0.07 
3 18 8   229.44     0.06 
3 18 9    65.64     0.06 
3 18 10   127.81     0.05 
3 18 11   693.13     0.05 
3 19 0    47.69     0.20 
3 19 1    19.35     0.14 
3 19 2    27.95     0.10 
3 19 4    15.07     0.13 
3 19 5    67.05     0.08 
3 19 6   285.32     0.07 
3 19 7   162.17     0.06 
3 19 8   238.93     0.06 
3 19 9    73.70     0.06 
3 19 10   356.70     0.05 
3 19 11     8.51     0.07 
3 20 0     1.01    -1.00 
3 20 1     5.73     0.12 
3 20 2    28.50     0.09 
3 20 3    63.23     0.08 
3 20 4    46.78     0.13 
3 20 5    35.95     0.08 
3 20 6   109.76     0.07 
3 20 7   112.48     0.06 
3 20 8   498.39     0.03 
3 20 9   160.77     0.05 
3 20 10    54.18     0.05 
3 21 0    73.01     0.06 
3 21 1    77.99     0.18 
3 21 2    90.43     0.07 
3 21 3   129.62     0.38 
3 21 4    99.77     0.06 
3 21 5    80.59     0.06 
3 21 6   251.71     0.06 
3 21 7   106.60     0.05 
3 21 8   167.03     0.05 
3 21 9   513.17     0.06 
3 21 10   199.13     0.03 
3 21 11    79.62     0.04 
3 22 0    86.12     0.05 
3 22 1    50.73     0.07 
3 22 2    66.79     0.06 
3 22 3    34.83     0.06 
3 22 4   281.99     0.06 
3 22 5   203.67     0.06 
3 22 6   374.22     0.04 
3 22 7   305.95     0.04 
3 22 8  1298.53     0.05 
3 22 9   114.03     0.04 
3 22 10   320.11     0.04 
3 22 11   254.42     0.04 
3 23 0   123.88     0.05 
3 23 1    80.67     0.10 
3 23 2    78.36     0.06 
3 23 3    66.04     0.06 
3 23 4   847.58     0.36 
3 23 5   204.11     0.05 
3 23 6    68.68     0.06 
3 23 7   140.79     0.04 
3 23 8   187.82     0.04 
3 23 9  1824.03     0.04 
3 23 10   191.65     0.04 
3 23 11   299.99     0.06 
