1432156761 1   1 
1432156761 2   0 
1432156761 3   0 
1432156761 4   0 
1432156761 5   0 
1432156761 6   0 
1432156761 7   0 
1432156761 8   0 
1432156761 9   0 
1432156761 10   0 
1432156761 11   0 
1432156761 12   0 
1432156761 13   0 
1432156761 14   0 
1432156761 15   0 
1432156761 16   0 
1432156761 17   0 
1432156761 18   0 
1432156761 19   0 
1432156761 20   0 
1432156761 21   0 
1432156761 22   0 
1432156761 23   0 
1432156761 24   0 
1432156761 25   0 
1432156761 26   0 
1432156761 27   0 
1432156761 28   0 
1432156761 29   0 
1432156761 30   0 
1432156761 31   -1 
1432156761 32   0 
1432156761 33   0 
1432156761 34   0 
1432156761 35   0 
1432156761 36   0 
1432156761 37   0 
1432156761 38   0 
1432156761 39   0 
1432156761 40   0 
1432156761 41   0 
1432156761 42   0 
1432156761 43   0 
1432156761 44   0 
1432156761 45   0 
1432156761 46   0 
1432156761 47   0 
1432156761 48   0 
1432156761 49   0 
1432156761 50   0 
1432156761 51   0 
1432156761 52   0 
1432156761 53   0 
1432156761 54   0 
1432156761 55   0 
1432156761 56   0 
1432156761 57   0 
1432156761 58   0 
1432156761 59   0 
1432156761 60   0 
1432156761 61   1 
1432156761 62   0 
1432156761 63   0 
1432156761 64   0 
1432156761 65   0 
1432156761 66   0 
1432156761 67   0 
1432156761 68   0 
1432156761 69   0 
1432156761 70   0 
1432156761 71   0 
1432156761 72   0 
1432156761 73   0 
1432156761 74   0 
1432156761 75   0 
1432156761 76   0 
1432156761 77   0 
1432156761 78   0 
1432156761 79   0 
1432156761 80   0 
1432156761 81   0 
1432156761 82   0 
1432156761 83   0 
1432156761 84   0 
1432156761 85   0 
1432156761 86   0 
1432156761 87   0 
1432156761 88   0 
1432156761 89   0 
1432156761 90   0 
1432156761 91   -1 
1432156761 92   0 
1432156761 93   0 
1432156761 94   0 
1432156761 95   0 
1432156761 96   0 
1432156761 97   0 
1432156761 98   0 
1432156761 99   0 
1432156761 100   0 
1432156761 101   0 
1432156761 102   0 
1432156761 103   0 
1432156761 104   0 
1432156761 105   0 
1432156761 106   0 
1432156761 107   0 
1432156761 108   0 
1432156761 109   0 
1432156761 110   0 
1432156761 111   0 
1432156761 112   0 
1432156761 113   0 
1432156761 114   0 
1432156761 115   0 
1432156761 116   0 
1432156761 117   0 
1432156761 118   0 
1432156761 119   0 
1432156761 120   0 
1432156761 121   1 
1432156761 122   0 
1432156761 123   0 
1432156761 124   0 
1432156761 125   0 
1432156761 126   0 
1432156761 127   0 
1432156761 128   0 
1432156761 129   0 
1432156761 130   0 
1432156761 131   0 
1432156761 132   0 
1432156761 133   0 
1432156761 134   0 
1432156761 135   0 
1432156761 136   0 
1432156761 137   0 
1432156761 138   0 
1432156761 139   0 
1432156761 140   0 
1432156761 141   0 
1432156761 142   0 
1432156761 143   0 
1432156761 144   0 
1432156761 145   0 
1432156761 146   0 
1432156761 147   0 
1432156761 148   0 
1432156761 149   0 
1432156761 150   0 
1432156761 151   -1 
1432156761 152   0 
1432156761 153   0 
1432156761 154   0 
1432156761 155   0 
1432156761 156   0 
1432156761 157   0 
1432156761 158   0 
1432156761 159   0 
1432156761 160   0 
1432156761 161   0 
1432156761 162   0 
1432156761 163   0 
1432156761 164   0 
1432156761 165   0 
1432156761 166   0 
1432156761 167   0 
1432156761 168   0 
1432156761 169   0 
1432156761 170   0 
1432156761 171   0 
1432156761 172   0 
1432156761 173   0 
1432156761 174   0 
1432156761 175   0 
1432156761 176   0 
1432156761 177   0 
1432156761 178   0 
1432156761 179   0 
1432156761 180   0 
1432156761 181   1 
1432156761 182   0 
1432156761 183   0 
1432156761 184   0 
1432156761 185   0 
1432156761 186   0 
1432156761 187   0 
1432156761 188   0 
1432156761 189   0 
1432156761 190   0 
1432156761 191   0 
1432156761 192   0 
1432156761 193   0 
1432156761 194   0 
1432156761 195   0 
1432156761 196   0 
1432156761 197   0 
1432156761 198   0 
1432156761 199   0 
1432156761 200   0 
1432156761 201   0 
1432156761 202   0 
1432156761 203   0 
1432156761 204   0 
1432156761 205   0 
1432156761 206   0 
1432156761 207   0 
1432156761 208   0 
1432156761 209   0 
1432156761 210   0 
1432156761 211   -1 
1432156761 212   0 
1432156761 213   0 
1432156761 214   0 
1432156761 215   0 
1432156761 216   0 
1432156761 217   0 
1432156761 218   0 
1432156761 219   0 
1432156761 220   0 
1432156761 221   0 
1432156761 222   0 
1432156761 223   0 
1432156761 224   0 
1432156761 225   0 
1432156761 226   0 
1432156761 227   0 
1432156761 228   0 
1432156761 229   0 
1432156761 230   0 
1432156761 231   0 
1432156761 232   0 
1432156761 233   0 
1432156761 234   0 
1432156761 235   0 
1432156761 236   0 
1432156761 237   0 
1432156761 238   0 
1432156761 239   0 
1432156761 240   0 
1432156761 241   1 
1432156761 242   0 
1432156761 243   0 
1432156761 244   0 
1432156761 245   0 
1432156761 246   0 
1432156761 247   0 
1432156761 248   0 
1432156761 249   0 
1432156761 250   0 
1432156761 251   0 
1432156761 252   0 
1432156761 253   0 
1432156761 254   0 
1432156761 255   0 
1432156761 256   0 
1432156761 257   0 
1432156761 258   0 
1432156761 259   0 
1432156761 260   0 
1432156761 261   0 
1432156761 262   0 
1432156761 263   0 
1432156761 264   0 
1432156761 265   0 
1432156761 266   0 
1432156761 267   0 
1432156761 268   0 
1432156761 269   0 
1432156761 270   0 
1432156761 271   -1 
1432156761 272   0 
1432156761 273   0 
1432156761 274   0 
1432156761 275   0 
1432156761 276   0 
1432156761 277   0 
1432156761 278   0 
1432156761 279   0 
1432156761 280   0 
1432156761 281   0 
1432156761 282   0 
1432156761 283   0 
1432156761 284   0 
1432156761 285   0 
1432156761 286   0 
1432156761 287   0 
1432156761 288   0 
1432156761 289   0 
1432156761 290   0 
1432156761 291   0 
1432156761 292   0 
1432156761 293   0 
1432156761 294   0 
1432156761 295   0 
1432156761 296   0 
1432156761 297   0 
1432156761 298   0 
1432156761 299   0 
1432156761 300   0 
1432156761 301   1 
1432156761 302   0 
1432156761 303   0 
1432156761 304   0 
1432156761 305   0 
1432156761 306   0 
1432156761 307   0 
1432156761 308   0 
1432156761 309   0 
1432156761 310   0 
1432156761 311   0 
1432156761 312   0 
1432156761 313   0 
1432156761 314   0 
1432156761 315   0 
1432156761 316   0 
1432156761 317   0 
1432156761 318   0 
1432156761 319   0 
1432156761 320   0 
1432156761 321   0 
1432156761 322   0 
1432156761 323   0 
1432156761 324   0 
1432156761 325   0 
1432156761 326   0 
1432156761 327   0 
1432156761 328   0 
1432156761 329   0 
1432156761 330   0 
1432156761 331   -1 
1432156761 332   0 
1432156761 333   0 
1432156761 334   0 
1432156761 335   0 
1432156761 336   0 
1432156761 337   0 
1432156761 338   0 
1432156761 339   0 
1432156761 340   0 
1432156761 341   0 
1432156761 342   0 
1432156761 343   0 
1432156761 344   0 
1432156761 345   0 
1432156761 346   0 
1432156761 347   0 
1432156761 348   0 
1432156761 349   0 
1432156761 350   0 
1432156761 351   0 
1432156761 352   0 
1432156761 353   0 
1432156761 354   0 
1432156761 355   0 
1432156761 356   0 
1432156761 357   0 
1432156761 358   0 
1432156761 359   0 
1432156761 360   0 
