1 1 1 0.000 
1 1 2 0.000 
1 1 3 0.000 
1 1 4 0.000 
1 1 5 0.000 
1 1 6 0.000 
1 1 7 0.000 
1 1 8 0.000 
1 1 9 0.000 
1 1 10 0.000 
1 1 11 0.000 
1 1 12 0.000 
1 1 13 0.000 
1 1 14 0.000 
1 1 15 0.000 
1 1 16 0.000 
1 1 17 0.000 
1 1 18 0.000 
1 1 19 0.000 
1 1 20 0.000 
1 1 21 0.000 
1 1 22 0.000 
1 1 23 0.000 
1 1 24 0.000 
1 1 25 0.000 
1 1 26 0.000 
1 1 27 0.000 
1 1 28 0.000 
1 1 29 0.000 
1 1 30 0.000 
1 1 31 0.000 
1 1 32 0.000 
1 1 33 0.000 
1 1 34 0.000 
1 1 35 0.000 
1 1 36 0.000 
1 1 37 0.000 
1 1 38 0.000 
1 1 39 0.000 
1 1 40 0.000 
1 1 41 0.000 
1 1 42 0.000 
1 1 43 0.000 
1 1 44 0.000 
1 1 45 0.000 
1 1 46 0.000 
1 1 47 0.000 
1 1 48 0.000 
1 1 49 0.000 
1 2 1 0.000 
1 2 2 0.000 
1 2 3 0.000 
1 2 4 0.000 
1 2 5 0.000 
1 2 6 0.000 
1 2 7 0.000 
1 2 8 0.000 
1 2 9 0.000 
1 2 10 0.000 
1 2 11 0.000 
1 2 12 0.000 
1 2 13 0.000 
1 2 14 0.000 
1 2 15 0.000 
1 2 16 0.000 
1 2 17 0.000 
1 2 18 0.000 
1 2 19 0.000 
1 2 20 0.000 
1 2 21 0.000 
1 2 22 0.000 
1 2 23 0.000 
1 2 24 0.000 
1 2 25 0.000 
1 2 26 0.000 
1 2 27 0.000 
1 2 28 0.000 
1 2 29 0.000 
1 2 30 0.000 
1 2 31 0.000 
1 2 32 0.000 
1 2 33 0.000 
1 2 34 0.000 
1 2 35 0.000 
1 2 36 0.000 
1 2 37 0.000 
1 2 38 0.000 
1 2 39 0.000 
1 2 40 0.000 
1 2 41 0.000 
1 2 42 0.000 
1 2 43 0.000 
1 2 44 0.000 
1 2 45 0.000 
1 2 46 0.000 
1 2 47 0.000 
1 2 48 0.000 
1 2 49 0.000 
1 3 1 0.000 
1 3 2 0.000 
1 3 3 0.000 
1 3 4 0.000 
1 3 5 0.000 
1 3 6 0.000 
1 3 7 0.000 
1 3 8 0.000 
1 3 9 0.000 
1 3 10 0.000 
1 3 11 0.000 
1 3 12 0.000 
1 3 13 0.000 
1 3 14 0.000 
1 3 15 0.000 
1 3 16 0.000 
1 3 17 0.000 
1 3 18 0.000 
1 3 19 0.000 
1 3 20 0.000 
1 3 21 0.000 
1 3 22 0.000 
1 3 23 0.000 
1 3 24 0.000 
1 3 25 0.000 
1 4 1 0.000 
1 4 2 0.000 
1 4 3 0.000 
1 4 4 0.000 
1 4 5 0.000 
1 4 6 0.000 
1 4 7 0.000 
1 4 8 0.000 
1 4 9 0.000 
1 4 10 0.000 
1 4 11 0.000 
1 4 12 0.000 
1 4 13 0.000 
1 4 14 0.000 
1 4 15 0.000 
1 4 16 0.000 
1 4 17 0.000 
1 4 18 0.000 
1 4 19 0.000 
1 4 20 0.000 
1 4 21 0.000 
1 4 22 0.000 
1 4 23 0.000 
1 4 24 0.000 
1 4 25 0.000 
1 5 1 0.000 
1 5 2 0.000 
1 5 3 0.000 
1 5 4 0.000 
1 5 5 0.000 
1 5 6 0.000 
1 5 7 0.000 
1 6 1 0.000 
1 6 2 0.000 
1 6 3 0.000 
1 6 4 0.000 
1 6 5 0.000 
1 6 6 0.000 
1 6 7 0.000 
2 1 1 1.100 
2 1 2 1.000 
2 1 3 1.200 
2 1 4 0.900 
2 1 5 0.600 
2 1 6 1.000 
2 1 7 0.900 
2 1 8 1.000 
2 1 9 1.000 
2 1 10 1.000 
2 1 11 0.000 
2 1 12 0.000 
2 1 13 0.000 
2 1 14 0.000 
2 1 15 0.000 
2 1 16 0.000 
2 1 17 0.000 
2 1 18 1.193 
2 1 19 1.396 
2 1 20 0.928 
2 1 21 1.456 
2 1 22 3.000 
2 1 23 0.970 
2 1 24 1.053 
2 1 25 2.598 
2 1 26 2.084 
2 1 27 0.921 
2 1 28 1.000 
2 1 29 0.000 
2 1 30 0.000 
2 1 31 0.000 
2 1 32 0.000 
2 1 33 0.000 
2 1 34 0.000 
2 1 35 1.141 
2 1 36 0.945 
2 1 37 0.926 
2 1 38 1.102 
2 1 39 0.907 
2 1 40 1.302 
2 1 41 1.204 
2 1 42 1.214 
2 1 43 1.080 
2 1 44 2.735 
2 1 45 3.000 
2 1 46 1.180 
2 1 47 0.000 
2 1 48 0.000 
2 1 49 0.000 
2 1 50 0.000 
2 1 51 0.000 
2 1 52 0.898 
2 1 53 1.041 
2 1 54 1.285 
2 1 55 0.843 
2 1 56 0.859 
2 1 57 0.972 
2 1 58 1.086 
2 1 59 1.024 
2 1 60 1.127 
2 1 61 0.907 
2 1 62 2.581 
2 1 63 1.116 
2 1 64 2.000 
2 1 65 0.000 
2 1 66 0.000 
2 1 67 0.000 
2 1 68 0.000 
2 1 69 1.018 
2 1 70 0.994 
2 1 71 0.997 
2 1 72 0.947 
2 1 73 1.000 
2 1 74 1.070 
2 1 75 0.906 
2 1 76 1.124 
2 1 77 0.976 
2 1 78 1.900 
2 1 79 1.403 
2 1 80 1.200 
2 1 81 0.557 
2 1 82 2.298 
2 1 83 0.800 
2 1 84 0.000 
2 1 85 0.000 
2 1 86 1.128 
2 1 87 0.948 
2 1 88 0.936 
2 1 89 0.894 
2 1 90 0.953 
2 1 91 1.012 
2 1 92 0.977 
2 1 93 0.923 
2 1 94 1.004 
2 1 95 1.102 
2 1 96 0.909 
2 1 97 1.663 
2 1 98 1.855 
2 1 99 1.073 
2 1 100 2.000 
2 1 101 0.000 
2 1 102 0.000 
2 1 103 1.067 
2 1 104 1.094 
2 1 105 0.867 
2 1 106 1.033 
2 1 107 1.061 
2 1 108 0.955 
2 1 109 0.808 
2 1 110 1.030 
2 1 111 1.385 
2 1 112 1.111 
2 1 113 0.962 
2 1 114 1.150 
2 1 115 0.919 
2 1 116 0.927 
2 1 117 0.923 
2 1 118 0.966 
2 1 119 0.000 
2 1 120 1.133 
2 1 121 1.112 
2 1 122 1.123 
2 1 123 0.991 
2 1 124 1.489 
2 1 125 1.076 
2 1 126 0.927 
2 1 127 1.126 
2 1 128 0.810 
2 1 129 1.007 
2 1 130 2.896 
2 1 131 0.821 
2 1 132 0.650 
2 1 133 0.820 
2 1 134 1.285 
2 1 135 3.000 
2 1 136 4.000 
2 1 137 1.445 
2 1 138 1.336 
2 1 139 1.133 
2 1 140 0.824 
2 1 141 1.037 
2 1 142 0.967 
2 1 143 1.005 
2 1 144 1.110 
2 1 145 1.045 
2 1 146 0.965 
2 1 147 1.321 
2 1 148 0.951 
2 1 149 0.923 
2 1 150 1.500 
2 1 151 1.145 
2 1 152 0.860 
2 1 153 1.000 
2 1 154 0.000 
2 1 155 0.000 
2 1 156 0.000 
2 1 157 0.000 
2 1 158 0.000 
2 1 159 0.000 
2 1 160 0.000 
2 1 161 0.000 
2 1 162 0.824 
2 1 163 1.223 
2 1 164 1.032 
2 1 165 1.088 
2 1 166 1.033 
2 1 167 0.951 
2 1 168 0.653 
2 1 169 0.742 
2 1 170 1.000 
2 1 171 0.000 
2 1 172 0.000 
2 1 173 0.000 
2 1 174 0.000 
2 1 175 0.000 
2 1 176 0.000 
2 1 177 0.000 
2 1 178 0.000 
2 1 179 1.047 
2 1 180 0.938 
2 1 181 1.068 
2 1 182 0.907 
2 1 183 0.914 
2 1 184 1.676 
2 1 185 1.637 
2 1 186 1.063 
2 1 187 1.500 
2 1 188 0.000 
2 1 189 0.000 
2 1 190 0.000 
2 1 191 0.000 
2 1 192 0.000 
2 1 193 0.000 
2 1 194 0.000 
2 1 195 0.000 
2 1 196 1.057 
2 1 197 0.938 
2 1 198 1.101 
2 1 199 0.868 
2 1 200 0.940 
2 1 201 1.075 
2 1 202 1.187 
2 1 203 0.865 
2 1 204 2.000 
2 1 205 0.200 
2 1 206 0.000 
2 1 207 0.000 
2 1 208 0.000 
2 1 209 0.000 
2 1 210 0.000 
2 1 211 0.000 
2 1 212 0.000 
2 1 213 1.007 
2 1 214 0.944 
2 1 215 0.893 
2 1 216 0.922 
2 1 217 1.507 
2 1 218 1.038 
2 1 219 0.896 
2 1 220 0.875 
2 1 221 0.200 
2 1 222 0.000 
2 1 223 0.000 
2 1 224 0.000 
2 1 225 0.000 
2 1 226 0.000 
2 1 227 0.000 
2 1 228 0.000 
2 1 229 0.000 
2 1 230 1.256 
2 1 231 1.585 
2 1 232 1.171 
2 1 233 1.285 
2 1 234 0.942 
2 1 235 0.820 
2 1 236 0.955 
2 1 237 1.270 
2 1 238 2.000 
2 1 239 0.000 
2 1 240 0.000 
2 1 241 0.000 
2 1 242 0.000 
2 1 243 0.000 
2 1 244 0.000 
2 1 245 0.000 
2 1 246 0.000 
2 1 247 0.978 
2 1 248 1.069 
2 1 249 0.780 
2 1 250 1.161 
2 1 251 1.160 
2 1 252 0.980 
2 1 253 1.101 
2 1 254 1.186 
2 1 255 1.000 
2 1 256 0.000 
2 1 257 0.000 
2 1 258 0.000 
2 1 259 0.000 
2 1 260 0.000 
2 1 261 0.000 
2 1 262 0.000 
2 1 263 0.000 
2 1 264 1.337 
2 1 265 1.098 
2 1 266 1.069 
2 1 267 1.045 
2 1 268 1.050 
2 1 269 0.919 
2 1 270 1.225 
2 1 271 0.953 
2 1 272 0.800 
2 1 273 0.000 
2 1 274 0.000 
2 1 275 0.000 
2 1 276 0.000 
2 1 277 0.000 
2 1 278 0.000 
2 1 279 0.000 
2 1 280 0.000 
2 1 281 0.936 
2 1 282 0.944 
2 1 283 0.857 
2 1 284 0.834 
2 1 285 0.985 
2 1 286 1.095 
2 1 287 1.163 
2 1 288 0.833 
2 1 289 2.000 
2 1 290 0.000 
2 1 291 0.000 
2 1 292 0.000 
2 1 293 0.000 
2 1 294 0.000 
2 1 295 0.000 
2 1 296 0.000 
2 1 297 0.000 
2 1 298 1.041 
2 1 299 1.008 
2 1 300 0.995 
2 1 301 1.020 
2 1 302 0.874 
2 1 303 1.014 
2 1 304 0.848 
2 1 305 1.584 
2 1 306 2.000 
2 1 307 0.000 
2 1 308 0.000 
2 1 309 0.000 
2 1 310 0.000 
2 1 311 0.000 
2 1 312 0.000 
2 1 313 0.000 
2 1 314 0.000 
2 1 315 1.341 
2 1 316 0.810 
2 1 317 1.173 
2 1 318 0.997 
2 1 319 1.051 
2 1 320 0.807 
2 1 321 1.074 
2 1 322 0.912 
2 1 323 1.194 
2 1 324 0.000 
2 1 325 0.000 
2 1 326 0.000 
2 1 327 0.000 
2 1 328 0.000 
2 1 329 0.000 
2 1 330 0.000 
2 1 331 0.000 
2 1 332 1.126 
2 1 333 0.902 
2 1 334 0.925 
2 1 335 0.894 
2 1 336 0.977 
2 1 337 0.884 
2 1 338 1.426 
2 1 339 0.937 
2 1 340 0.951 
2 1 341 0.000 
2 1 342 0.000 
2 1 343 0.000 
2 1 344 0.000 
2 1 345 0.000 
2 1 346 0.000 
2 1 347 0.000 
2 1 348 0.000 
2 1 349 1.156 
2 1 350 0.930 
2 1 351 1.156 
2 1 352 0.967 
2 1 353 1.105 
2 1 354 0.870 
2 1 355 1.032 
2 1 356 1.034 
2 1 357 1.075 
2 1 358 0.000 
2 1 359 0.000 
2 1 360 0.000 
2 1 361 0.000 
2 1 362 0.000 
2 1 363 0.000 
2 1 364 0.000 
2 1 365 0.000 
2 1 366 1.430 
2 1 367 1.090 
2 1 368 1.147 
2 1 369 0.966 
2 1 370 1.040 
2 1 371 1.000 
2 1 372 1.057 
2 1 373 0.928 
2 1 374 1.000 
2 1 375 0.000 
2 1 376 0.000 
2 1 377 0.000 
2 1 378 0.000 
2 1 379 0.000 
2 1 380 0.000 
2 1 381 0.000 
2 1 382 0.000 
2 1 383 1.417 
2 1 384 0.854 
2 1 385 1.095 
2 1 386 0.940 
2 1 387 0.915 
2 1 388 1.007 
2 1 389 0.927 
2 1 390 1.106 
2 1 391 0.903 
2 1 392 0.000 
2 1 393 0.000 
2 1 394 0.000 
2 1 395 0.000 
2 1 396 0.000 
2 1 397 0.000 
2 1 398 0.000 
2 1 399 0.000 
2 1 400 1.155 
2 1 401 0.877 
2 1 402 1.004 
2 1 403 0.968 
2 1 404 1.077 
2 1 405 1.027 
2 1 406 1.035 
2 1 407 1.085 
2 1 408 1.000 
2 1 409 0.000 
2 1 410 0.000 
2 1 411 0.000 
2 1 412 0.000 
2 1 413 0.000 
2 1 414 0.000 
2 1 415 0.000 
2 1 416 0.000 
2 1 417 1.023 
2 1 418 1.025 
2 1 419 1.132 
2 1 420 0.896 
2 1 421 1.039 
2 1 422 1.036 
2 1 423 0.931 
2 1 424 1.196 
2 1 425 1.500 
2 1 426 1.029 
2 1 427 1.820 
2 1 428 1.004 
2 1 429 0.990 
2 1 430 1.226 
2 1 431 0.972 
2 1 432 1.162 
2 1 433 0.895 
2 1 434 0.866 
2 1 435 0.900 
2 1 436 0.975 
2 1 437 0.928 
2 1 438 0.854 
2 1 439 1.193 
2 1 440 1.098 
2 1 441 1.261 
2 1 442 0.700 
2 1 443 1.130 
2 1 444 1.025 
2 1 445 1.039 
2 1 446 0.815 
2 1 447 1.127 
2 1 448 1.106 
2 1 449 1.000 
2 1 450 1.148 
2 1 451 1.020 
2 1 452 1.154 
2 1 453 0.936 
2 1 454 1.027 
2 1 455 1.057 
2 1 456 1.004 
2 1 457 1.014 
2 1 458 0.718 
2 1 459 0.700 
2 1 460 1.034 
2 1 461 1.030 
2 1 462 1.170 
2 1 463 0.920 
2 1 464 1.098 
2 1 465 1.014 
2 1 466 0.767 
2 1 467 0.863 
2 1 468 0.983 
2 1 469 0.922 
2 1 470 1.092 
2 1 471 1.451 
2 1 472 1.030 
2 1 473 1.053 
2 1 474 1.000 
2 1 475 1.308 
2 1 476 0.000 
2 1 477 1.036 
2 1 478 1.041 
2 1 479 0.983 
2 1 480 1.129 
2 1 481 0.974 
2 1 482 0.934 
2 1 483 0.300 
2 1 484 1.066 
2 1 485 0.936 
2 1 486 1.240 
2 1 487 0.984 
2 1 488 0.765 
2 1 489 1.290 
2 1 490 0.865 
2 1 491 0.899 
2 1 492 0.000 
2 1 493 0.000 
2 1 494 0.979 
2 1 495 0.802 
2 1 496 0.996 
2 1 497 0.886 
2 1 498 1.040 
2 1 499 0.890 
2 1 500 0.870 
2 1 501 0.969 
2 1 502 1.172 
2 1 503 0.867 
2 1 504 1.022 
2 1 505 0.765 
2 1 506 0.500 
2 1 507 0.922 
2 1 508 0.000 
2 1 509 0.000 
2 1 510 0.000 
2 1 511 1.233 
2 1 512 1.051 
2 1 513 1.006 
2 1 514 1.031 
2 1 515 1.796 
2 1 516 1.824 
2 1 517 1.519 
2 1 518 1.468 
2 1 519 0.911 
2 1 520 1.098 
2 1 521 1.239 
2 1 522 0.250 
2 1 523 0.150 
2 1 524 0.000 
2 1 525 0.000 
2 1 526 0.000 
2 1 527 0.000 
2 1 528 1.200 
2 1 529 0.949 
2 1 530 0.811 
2 1 531 1.200 
2 1 532 1.200 
2 1 533 1.800 
2 1 534 1.462 
2 1 535 1.009 
2 1 536 0.901 
2 1 537 2.397 
2 1 538 1.200 
2 1 539 0.518 
2 1 540 0.000 
2 1 541 0.000 
2 1 542 0.000 
2 1 543 0.000 
2 1 544 0.000 
2 1 545 1.239 
2 1 546 1.243 
2 1 547 1.257 
2 1 548 1.510 
2 1 549 1.300 
2 1 550 1.200 
2 1 551 1.592 
2 1 552 2.253 
2 1 553 1.321 
2 1 554 0.909 
2 1 555 0.632 
2 1 556 0.000 
2 1 557 0.000 
2 1 558 0.000 
2 1 559 0.000 
2 1 560 0.000 
2 1 561 0.000 
2 1 562 0.800 
2 1 563 0.800 
2 1 564 0.676 
2 1 565 0.500 
2 1 566 0.500 
2 1 567 0.350 
2 1 568 0.747 
2 1 569 0.800 
2 1 570 0.770 
2 1 571 0.800 
2 1 572 0.000 
2 1 573 0.000 
2 1 574 0.000 
2 1 575 0.000 
2 1 576 0.000 
2 1 577 0.000 
2 1 578 0.000 
2 2 1 0.551 
2 2 2 1.200 
2 2 3 1.200 
2 2 4 1.200 
2 2 5 1.200 
2 2 6 1.200 
2 2 7 1.200 
2 2 8 1.124 
2 2 9 1.107 
2 2 10 1.200 
2 2 11 0.000 
2 2 12 0.000 
2 2 13 0.000 
2 2 14 0.000 
2 2 15 0.000 
2 2 16 0.000 
2 2 17 0.000 
2 2 18 0.902 
2 2 19 1.813 
2 2 20 0.932 
2 2 21 0.764 
2 2 22 1.211 
2 2 23 0.919 
2 2 24 1.106 
2 2 25 1.117 
2 2 26 1.366 
2 2 27 0.888 
2 2 28 1.104 
2 2 29 0.000 
2 2 30 0.000 
2 2 31 0.000 
2 2 32 0.000 
2 2 33 0.000 
2 2 34 0.000 
2 2 35 0.900 
2 2 36 0.960 
2 2 37 2.595 
2 2 38 0.927 
2 2 39 0.950 
2 2 40 1.079 
2 2 41 0.921 
2 2 42 0.785 
2 2 43 1.311 
2 2 44 1.346 
2 2 45 0.887 
2 2 46 0.884 
2 2 47 0.000 
2 2 48 0.000 
2 2 49 0.000 
2 2 50 0.000 
2 2 51 0.000 
2 2 52 0.895 
2 2 53 1.083 
2 2 54 0.963 
2 2 55 0.831 
2 2 56 0.874 
2 2 57 1.395 
2 2 58 0.963 
2 2 59 0.800 
2 2 60 0.724 
2 2 61 1.326 
2 2 62 0.922 
2 2 63 0.800 
2 2 64 1.800 
2 2 65 0.000 
2 2 66 0.000 
2 2 67 0.000 
2 2 68 0.000 
2 2 69 1.109 
2 2 70 1.120 
2 2 71 0.923 
2 2 72 1.142 
2 2 73 0.963 
2 2 74 0.847 
2 2 75 0.929 
2 2 76 1.160 
2 2 77 1.353 
2 2 78 1.707 
2 2 79 0.588 
2 2 80 0.588 
2 2 81 0.588 
2 2 82 1.006 
2 2 83 0.000 
2 2 84 0.000 
2 2 85 0.000 
2 2 86 0.984 
2 2 87 1.192 
2 2 88 1.000 
2 2 89 1.000 
2 2 90 1.243 
2 2 91 0.960 
2 2 92 1.188 
2 2 93 0.876 
2 2 94 1.522 
2 2 95 0.882 
2 2 96 1.643 
2 2 97 1.122 
2 2 98 1.124 
2 2 99 1.000 
2 2 100 1.000 
2 2 101 0.000 
2 2 102 0.000 
2 2 103 1.009 
2 2 104 0.909 
2 2 105 0.771 
2 2 106 0.992 
2 2 107 0.848 
2 2 108 0.922 
2 2 109 0.935 
2 2 110 0.856 
2 2 111 0.719 
2 2 112 1.100 
2 2 113 1.332 
2 2 114 1.432 
2 2 115 1.002 
2 2 116 1.000 
2 2 117 0.815 
2 2 118 1.000 
2 2 119 0.000 
2 2 120 1.300 
2 2 121 1.310 
2 2 122 0.880 
2 2 123 0.949 
2 2 124 1.140 
2 2 125 0.735 
2 2 126 1.481 
2 2 127 0.946 
2 2 128 0.923 
2 2 129 0.934 
2 2 130 0.946 
2 2 131 0.821 
2 2 132 1.006 
2 2 133 0.990 
2 2 134 1.450 
2 2 135 0.777 
2 2 136 3.000 
2 2 137 1.492 
2 2 138 1.282 
2 2 139 1.051 
2 2 140 1.305 
2 2 141 1.011 
2 2 142 1.004 
2 2 143 1.004 
2 2 144 1.862 
2 2 145 1.285 
2 2 146 0.929 
2 2 147 0.929 
2 2 148 1.007 
2 2 149 1.084 
2 2 150 1.716 
2 2 151 1.268 
2 2 152 0.563 
2 2 153 1.000 
2 2 154 0.000 
2 2 155 0.000 
2 2 156 0.000 
2 2 157 0.000 
2 2 158 0.000 
2 2 159 0.000 
2 2 160 0.000 
2 2 161 0.000 
2 2 162 1.025 
2 2 163 1.289 
2 2 164 1.240 
2 2 165 1.123 
2 2 166 0.978 
2 2 167 1.132 
2 2 168 1.204 
2 2 169 0.800 
2 2 170 0.700 
2 2 171 0.000 
2 2 172 0.000 
2 2 173 0.000 
2 2 174 0.000 
2 2 175 0.000 
2 2 176 0.000 
2 2 177 0.000 
2 2 178 0.000 
2 2 179 0.961 
2 2 180 0.875 
2 2 181 0.792 
2 2 182 0.978 
2 2 183 0.846 
2 2 184 1.191 
2 2 185 0.878 
2 2 186 0.957 
2 2 187 1.300 
2 2 188 0.000 
2 2 189 0.000 
2 2 190 0.000 
2 2 191 0.000 
2 2 192 0.000 
2 2 193 0.000 
2 2 194 0.000 
2 2 195 0.000 
2 2 196 0.789 
2 2 197 1.233 
2 2 198 1.012 
2 2 199 0.910 
2 2 200 1.036 
2 2 201 0.828 
2 2 202 1.321 
2 2 203 1.202 
2 2 204 2.000 
2 2 205 0.000 
2 2 206 0.000 
2 2 207 0.000 
2 2 208 0.000 
2 2 209 0.000 
2 2 210 0.000 
2 2 211 0.000 
2 2 212 0.000 
2 2 213 1.018 
2 2 214 1.250 
2 2 215 0.833 
2 2 216 0.871 
2 2 217 0.994 
2 2 218 0.944 
2 2 219 1.038 
2 2 220 1.100 
2 2 221 1.500 
2 2 222 0.000 
2 2 223 0.000 
2 2 224 0.000 
2 2 225 0.000 
2 2 226 0.000 
2 2 227 0.000 
2 2 228 0.000 
2 2 229 0.000 
2 2 230 0.815 
2 2 231 1.239 
2 2 232 1.396 
2 2 233 0.919 
2 2 234 1.149 
2 2 235 1.046 
2 2 236 1.161 
2 2 237 0.871 
2 2 238 2.000 
2 2 239 0.000 
2 2 240 0.000 
2 2 241 0.000 
2 2 242 0.000 
2 2 243 0.000 
2 2 244 0.000 
2 2 245 0.000 
2 2 246 0.000 
2 2 247 1.030 
2 2 248 1.278 
2 2 249 0.810 
2 2 250 0.955 
2 2 251 1.036 
2 2 252 0.768 
2 2 253 2.028 
2 2 254 1.361 
2 2 255 1.500 
2 2 256 0.000 
2 2 257 0.000 
2 2 258 0.000 
2 2 259 0.000 
2 2 260 0.000 
2 2 261 0.000 
2 2 262 0.000 
2 2 263 0.000 
2 2 264 1.222 
2 2 265 1.064 
2 2 266 0.999 
2 2 267 0.872 
2 2 268 0.907 
2 2 269 1.155 
2 2 270 1.045 
2 2 271 1.107 
2 2 272 1.012 
2 2 273 0.000 
2 2 274 0.000 
2 2 275 0.000 
2 2 276 0.000 
2 2 277 0.000 
2 2 278 0.000 
2 2 279 0.000 
2 2 280 3.000 
2 2 281 1.000 
2 2 282 0.846 
2 2 283 0.877 
2 2 284 0.858 
2 2 285 1.405 
2 2 286 0.972 
2 2 287 1.231 
2 2 288 0.761 
2 2 289 0.700 
2 2 290 0.000 
2 2 291 0.000 
2 2 292 0.000 
2 2 293 0.000 
2 2 294 0.000 
2 2 295 0.000 
2 2 296 0.000 
2 2 297 0.000 
2 2 298 1.186 
2 2 299 1.060 
2 2 300 0.934 
2 2 301 1.028 
2 2 302 0.839 
2 2 303 1.438 
2 2 304 0.877 
2 2 305 0.805 
2 2 306 1.139 
2 2 307 0.000 
2 2 308 0.000 
2 2 309 0.000 
2 2 310 0.000 
2 2 311 0.000 
2 2 312 0.000 
2 2 313 0.000 
2 2 314 0.000 
2 2 315 1.041 
2 2 316 0.861 
2 2 317 0.996 
2 2 318 0.921 
2 2 319 0.925 
2 2 320 1.000 
2 2 321 1.298 
2 2 322 1.140 
2 2 323 1.000 
2 2 324 0.000 
2 2 325 0.000 
2 2 326 0.000 
2 2 327 0.000 
2 2 328 0.000 
2 2 329 1.000 
2 2 330 0.000 
2 2 331 0.000 
2 2 332 1.258 
2 2 333 1.149 
2 2 334 1.081 
2 2 335 0.966 
2 2 336 1.509 
2 2 337 1.068 
2 2 338 0.875 
2 2 339 1.047 
2 2 340 1.300 
2 2 341 0.000 
2 2 342 0.000 
2 2 343 0.000 
2 2 344 0.000 
2 2 345 0.000 
2 2 346 0.000 
2 2 347 0.000 
2 2 348 0.000 
2 2 349 1.037 
2 2 350 1.028 
2 2 351 0.926 
2 2 352 1.123 
2 2 353 1.067 
2 2 354 1.080 
2 2 355 0.873 
2 2 356 0.945 
2 2 357 1.300 
2 2 358 0.000 
2 2 359 0.000 
2 2 360 0.000 
2 2 361 0.000 
2 2 362 0.000 
2 2 363 0.000 
2 2 364 0.000 
2 2 365 0.000 
2 2 366 1.093 
2 2 367 1.002 
2 2 368 1.167 
2 2 369 0.943 
2 2 370 1.067 
2 2 371 1.015 
2 2 372 1.054 
2 2 373 1.043 
2 2 374 1.168 
2 2 375 0.000 
2 2 376 0.000 
2 2 377 0.000 
2 2 378 0.000 
2 2 379 0.000 
2 2 380 0.000 
2 2 381 0.000 
2 2 382 0.000 
2 2 383 1.035 
2 2 384 1.044 
2 2 385 1.003 
2 2 386 1.026 
2 2 387 0.892 
2 2 388 0.999 
2 2 389 1.038 
2 2 390 1.363 
2 2 391 0.760 
2 2 392 0.000 
2 2 393 0.000 
2 2 394 0.000 
2 2 395 0.000 
2 2 396 0.000 
2 2 397 0.000 
2 2 398 0.000 
2 2 399 0.000 
2 2 400 1.118 
2 2 401 1.092 
2 2 402 1.013 
2 2 403 0.921 
2 2 404 1.047 
2 2 405 0.942 
2 2 406 0.986 
2 2 407 1.343 
2 2 408 1.000 
2 2 409 0.000 
2 2 410 0.000 
2 2 411 0.000 
2 2 412 0.000 
2 2 413 0.000 
2 2 414 0.000 
2 2 415 1.400 
2 2 416 0.000 
2 2 417 1.076 
2 2 418 0.988 
2 2 419 0.965 
2 2 420 1.103 
2 2 421 1.082 
2 2 422 0.981 
2 2 423 1.077 
2 2 424 1.090 
2 2 425 1.000 
2 2 426 1.000 
2 2 427 1.283 
2 2 428 0.935 
2 2 429 0.930 
2 2 430 1.000 
2 2 431 1.100 
2 2 432 1.100 
2 2 433 1.184 
2 2 434 1.126 
2 2 435 0.816 
2 2 436 1.099 
2 2 437 1.039 
2 2 438 0.991 
2 2 439 1.085 
2 2 440 1.032 
2 2 441 0.800 
2 2 442 1.600 
2 2 443 1.175 
2 2 444 1.749 
2 2 445 1.290 
2 2 446 0.947 
2 2 447 1.432 
2 2 448 0.921 
2 2 449 1.060 
2 2 450 0.990 
2 2 451 0.953 
2 2 452 0.909 
2 2 453 0.948 
2 2 454 1.069 
2 2 455 0.952 
2 2 456 0.970 
2 2 457 1.609 
2 2 458 1.656 
2 2 459 0.400 
2 2 460 1.099 
2 2 461 0.934 
2 2 462 0.952 
2 2 463 1.041 
2 2 464 1.142 
2 2 465 1.014 
2 2 466 1.031 
2 2 467 1.200 
2 2 468 1.018 
2 2 469 1.015 
2 2 470 1.076 
2 2 471 1.077 
2 2 472 0.940 
2 2 473 1.210 
2 2 474 3.000 
2 2 475 0.800 
2 2 476 0.000 
2 2 477 0.955 
2 2 478 0.924 
2 2 479 0.993 
2 2 480 0.913 
2 2 481 1.159 
2 2 482 0.893 
2 2 483 1.382 
2 2 484 1.034 
2 2 485 1.107 
2 2 486 0.974 
2 2 487 1.297 
2 2 488 1.151 
2 2 489 1.664 
2 2 490 2.036 
2 2 491 1.171 
2 2 492 0.000 
2 2 493 0.000 
2 2 494 1.309 
2 2 495 1.284 
2 2 496 1.129 
2 2 497 0.984 
2 2 498 0.955 
2 2 499 1.063 
2 2 500 0.901 
2 2 501 1.151 
2 2 502 1.078 
2 2 503 0.984 
2 2 504 1.037 
2 2 505 1.307 
2 2 506 0.688 
2 2 507 1.145 
2 2 508 0.000 
2 2 509 0.000 
2 2 510 0.000 
2 2 511 0.967 
2 2 512 1.176 
2 2 513 1.063 
2 2 514 1.050 
2 2 515 1.041 
2 2 516 1.002 
2 2 517 1.366 
2 2 518 1.015 
2 2 519 1.063 
2 2 520 0.978 
2 2 521 1.280 
2 2 522 0.901 
2 2 523 1.087 
2 2 524 0.000 
2 2 525 0.000 
2 2 526 0.000 
2 2 527 0.000 
2 2 528 1.005 
2 2 529 1.075 
2 2 530 0.897 
2 2 531 0.981 
2 2 532 1.320 
2 2 533 1.213 
2 2 534 0.934 
2 2 535 1.096 
2 2 536 1.057 
2 2 537 1.174 
2 2 538 0.882 
2 2 539 1.301 
2 2 540 0.000 
2 2 541 0.000 
2 2 542 0.000 
2 2 543 0.000 
2 2 544 0.000 
2 2 545 1.182 
2 2 546 1.356 
2 2 547 0.986 
2 2 548 1.725 
2 2 549 1.000 
2 2 550 0.939 
2 2 551 0.819 
2 2 552 0.856 
2 2 553 1.586 
2 2 554 1.096 
2 2 555 1.927 
2 2 556 0.000 
2 2 557 0.000 
2 2 558 0.000 
2 2 559 0.000 
2 2 560 0.000 
2 2 561 0.000 
2 2 562 1.000 
2 2 563 1.000 
2 2 564 0.948 
2 2 565 1.000 
2 2 566 0.937 
2 2 567 1.000 
2 2 568 1.000 
2 2 569 1.000 
2 2 570 1.000 
2 2 571 0.745 
2 2 572 0.000 
2 2 573 0.000 
2 2 574 0.000 
2 2 575 0.000 
2 2 576 0.000 
2 2 577 0.000 
2 2 578 0.000 
2 3 1 0.660 
2 3 2 1.275 
2 3 3 0.870 
2 3 4 0.870 
2 3 5 0.857 
2 3 6 1.090 
2 3 7 0.837 
2 3 8 0.521 
2 3 9 4.000 
2 3 10 0.584 
2 3 11 1.319 
2 3 12 0.888 
2 3 13 0.983 
2 3 14 1.201 
2 3 15 1.098 
2 3 16 1.005 
2 3 17 0.945 
2 3 18 1.120 
2 3 19 1.121 
2 3 20 0.803 
2 3 21 1.068 
2 3 22 1.421 
2 3 23 1.398 
2 3 24 1.342 
2 3 25 1.571 
2 3 26 1.126 
2 3 27 1.447 
2 3 28 1.284 
2 3 29 0.728 
2 3 30 0.527 
2 3 31 0.751 
2 3 32 0.883 
2 3 33 0.798 
2 3 34 1.003 
2 3 35 0.833 
2 3 36 0.955 
2 3 37 0.666 
2 3 38 1.143 
2 3 39 0.830 
2 3 40 0.781 
2 3 41 1.107 
2 3 42 0.880 
2 3 43 0.559 
2 3 44 1.000 
2 3 45 0.743 
2 3 46 0.875 
2 3 47 1.600 
2 3 48 4.000 
2 3 49 0.900 
2 3 50 1.111 
2 3 51 0.501 
2 3 52 1.118 
2 3 53 0.715 
2 3 54 1.453 
2 3 55 1.124 
2 3 56 4.000 
2 3 57 1.072 
2 3 58 1.165 
2 3 59 0.790 
2 3 60 1.600 
2 3 61 0.413 
2 3 62 2.033 
2 3 63 0.850 
2 3 64 0.734 
2 3 65 1.883 
2 3 66 0.984 
2 3 67 1.054 
2 3 68 0.759 
2 3 69 1.043 
2 3 70 0.856 
2 3 71 0.923 
2 3 72 1.058 
2 3 73 1.383 
2 3 74 1.628 
2 3 75 1.040 
2 3 76 0.965 
2 3 77 0.690 
2 3 78 1.021 
2 3 79 1.015 
2 3 80 0.715 
2 3 81 1.114 
2 3 82 0.740 
2 3 83 0.515 
2 3 84 0.848 
2 3 85 0.000 
2 3 86 0.000 
2 3 87 0.000 
2 3 88 0.000 
2 3 89 0.000 
2 3 90 0.630 
2 3 91 1.087 
2 3 92 0.975 
2 3 93 1.117 
2 3 94 0.682 
2 3 95 0.724 
2 3 96 0.303 
2 3 97 0.000 
2 3 98 0.000 
2 3 99 0.000 
2 3 100 0.000 
2 3 101 0.000 
2 3 102 0.988 
2 3 103 0.934 
2 3 104 0.846 
2 3 105 0.982 
2 3 106 1.135 
2 3 107 1.067 
2 3 108 0.879 
2 3 109 0.000 
2 3 110 0.000 
2 3 111 0.000 
2 3 112 0.000 
2 3 113 0.000 
2 3 114 0.974 
2 3 115 1.029 
2 3 116 0.758 
2 3 117 0.935 
2 3 118 1.060 
2 3 119 0.984 
2 3 120 1.136 
2 3 121 0.000 
2 3 122 0.000 
2 3 123 0.000 
2 3 124 0.000 
2 3 125 0.000 
2 3 126 0.953 
2 3 127 0.952 
2 3 128 2.022 
2 3 129 0.908 
2 3 130 1.001 
2 3 131 0.933 
2 3 132 1.123 
2 3 133 0.000 
2 3 134 0.000 
2 3 135 0.000 
2 3 136 0.000 
2 3 137 0.000 
2 3 138 0.856 
2 3 139 0.869 
2 3 140 1.057 
2 3 141 0.840 
2 3 142 0.956 
2 3 143 0.956 
2 3 144 0.748 
2 3 145 0.000 
2 3 146 0.000 
2 3 147 0.000 
2 3 148 0.000 
2 3 149 0.000 
2 3 150 0.618 
2 3 151 1.468 
2 3 152 1.174 
2 3 153 1.042 
2 3 154 4.000 
2 3 155 0.988 
2 3 156 2.026 
2 3 157 0.000 
2 3 158 0.000 
2 3 159 0.000 
2 3 160 0.000 
2 3 161 0.000 
2 3 162 1.079 
2 3 163 0.398 
2 3 164 0.500 
2 3 165 0.650 
2 3 166 1.157 
2 3 167 0.945 
2 3 168 0.609 
2 3 169 0.000 
2 3 170 0.000 
2 3 171 0.000 
2 3 172 0.000 
2 3 173 0.000 
2 3 174 0.379 
2 3 175 0.852 
2 3 176 0.011 
2 3 177 1.586 
2 3 178 2.069 
2 3 179 1.380 
2 3 180 0.571 
2 3 181 0.000 
2 3 182 0.000 
2 3 183 0.000 
2 3 184 0.000 
2 3 185 0.000 
2 3 186 0.691 
2 3 187 0.618 
2 3 188 0.368 
2 3 189 0.461 
2 3 190 0.687 
2 3 191 0.575 
2 3 192 2.260 
2 3 193 0.000 
2 3 194 0.000 
2 3 195 0.000 
2 3 196 0.000 
2 3 197 0.000 
2 3 198 4.000 
2 3 199 4.000 
2 3 200 0.420 
2 3 201 1.043 
2 3 202 0.999 
2 3 203 4.000 
2 3 204 4.000 
2 3 205 0.577 
2 3 206 0.011 
2 3 207 0.011 
2 3 208 0.011 
2 3 209 0.011 
2 3 210 4.000 
2 3 211 0.853 
2 3 212 4.000 
2 3 213 1.134 
2 3 214 1.383 
2 3 215 4.000 
2 3 216 1.652 
2 3 217 1.426 
2 3 218 2.506 
2 3 219 0.431 
2 3 220 0.011 
2 3 221 0.629 
2 3 222 1.892 
2 3 223 0.642 
2 3 224 1.256 
2 3 225 1.028 
2 3 226 1.099 
2 3 227 0.557 
2 3 228 1.462 
2 3 229 0.663 
2 3 230 0.454 
2 3 231 0.937 
2 3 232 0.011 
2 3 233 0.729 
2 3 234 0.772 
2 3 235 0.011 
2 3 236 0.916 
2 3 237 1.394 
2 3 238 0.738 
2 3 239 0.800 
2 3 240 1.000 
2 3 241 1.400 
2 3 242 0.905 
2 3 243 1.140 
2 3 244 1.747 
2 3 245 1.207 
2 3 246 1.154 
2 3 247 0.722 
2 3 248 1.238 
2 3 249 1.392 
2 3 250 1.346 
2 3 251 0.435 
2 3 252 0.459 
2 3 253 1.018 
2 3 254 2.484 
2 3 255 1.080 
2 3 256 0.762 
2 3 257 1.427 
2 3 258 1.373 
2 3 259 1.200 
2 3 260 0.784 
2 3 261 0.989 
2 3 262 4.000 
2 3 263 0.596 
2 3 264 1.404 
2 3 265 2.937 
2 3 266 1.400 
2 3 267 1.394 
2 3 268 0.882 
2 3 269 0.786 
2 3 270 1.007 
2 3 271 2.212 
2 3 272 1.456 
2 3 273 0.471 
2 3 274 0.790 
2 3 275 1.172 
2 3 276 1.300 
2 3 277 0.966 
2 3 278 0.786 
2 3 279 1.539 
2 3 280 0.694 
2 3 281 0.977 
2 3 282 0.468 
2 3 283 0.677 
2 3 284 0.469 
2 3 285 0.463 
2 3 286 0.357 
2 3 287 1.122 
2 3 288 0.660 
2 4 1 0.314 
2 4 2 0.388 
2 4 3 0.922 
2 4 4 0.659 
2 4 5 3.000 
2 4 6 0.290 
2 4 7 0.460 
2 4 8 0.266 
2 4 9 0.800 
2 4 10 0.800 
2 4 11 2.224 
2 4 12 0.200 
2 4 13 0.844 
2 4 14 1.471 
2 4 15 1.469 
2 4 16 0.959 
2 4 17 1.000 
2 4 18 0.622 
2 4 19 0.587 
2 4 20 0.607 
2 4 21 0.328 
2 4 22 0.286 
2 4 23 1.115 
2 4 24 0.572 
2 4 25 0.779 
2 4 26 0.936 
2 4 27 0.849 
2 4 28 0.872 
2 4 29 0.605 
2 4 30 0.459 
2 4 31 0.791 
2 4 32 0.959 
2 4 33 1.183 
2 4 34 0.939 
2 4 35 0.441 
2 4 36 0.891 
2 4 37 0.644 
2 4 38 4.000 
2 4 39 0.866 
2 4 40 0.938 
2 4 41 0.683 
2 4 42 0.466 
2 4 43 0.847 
2 4 44 0.924 
2 4 45 0.847 
2 4 46 1.188 
2 4 47 0.639 
2 4 48 0.960 
2 4 49 0.798 
2 4 50 0.697 
2 4 51 0.810 
2 4 52 0.809 
2 4 53 1.211 
2 4 54 2.127 
2 4 55 1.227 
2 4 56 0.535 
2 4 57 0.522 
2 4 58 0.011 
2 4 59 1.029 
2 4 60 1.442 
2 4 61 4.000 
2 4 62 0.883 
2 4 63 1.017 
2 4 64 0.877 
2 4 65 0.692 
2 4 66 0.792 
2 4 67 0.783 
2 4 68 0.306 
2 4 69 0.437 
2 4 70 0.661 
2 4 71 0.743 
2 4 72 0.991 
2 4 73 1.200 
2 4 74 0.785 
2 4 75 1.096 
2 4 76 1.001 
2 4 77 1.279 
2 4 78 1.257 
2 4 79 1.594 
2 4 80 0.011 
2 4 81 0.408 
2 4 82 0.440 
2 4 83 0.581 
2 4 84 0.800 
2 4 85 0.000 
2 4 86 0.000 
2 4 87 0.000 
2 4 88 0.000 
2 4 89 0.000 
2 4 90 0.371 
2 4 91 0.391 
2 4 92 0.476 
2 4 93 1.200 
2 4 94 1.017 
2 4 95 1.075 
2 4 96 0.800 
2 4 97 0.000 
2 4 98 0.000 
2 4 99 0.000 
2 4 100 0.000 
2 4 101 0.000 
2 4 102 0.737 
2 4 103 1.080 
2 4 104 0.977 
2 4 105 1.141 
2 4 106 0.898 
2 4 107 0.636 
2 4 108 0.654 
2 4 109 0.000 
2 4 110 0.000 
2 4 111 0.000 
2 4 112 0.000 
2 4 113 0.000 
2 4 114 0.984 
2 4 115 0.919 
2 4 116 0.970 
2 4 117 0.867 
2 4 118 0.011 
2 4 119 0.836 
2 4 120 0.838 
2 4 121 0.000 
2 4 122 0.000 
2 4 123 0.000 
2 4 124 0.000 
2 4 125 0.000 
2 4 126 0.936 
2 4 127 0.932 
2 4 128 0.806 
2 4 129 0.948 
2 4 130 0.986 
2 4 131 1.026 
2 4 132 1.340 
2 4 133 0.000 
2 4 134 0.000 
2 4 135 0.000 
2 4 136 0.000 
2 4 137 0.000 
2 4 138 0.941 
2 4 139 0.988 
2 4 140 1.025 
2 4 141 0.968 
2 4 142 0.862 
2 4 143 1.423 
2 4 144 0.845 
2 4 145 0.000 
2 4 146 0.000 
2 4 147 0.000 
2 4 148 0.000 
2 4 149 0.000 
2 4 150 1.060 
2 4 151 0.848 
2 4 152 0.978 
2 4 153 0.890 
2 4 154 1.102 
2 4 155 1.024 
2 4 156 1.022 
2 4 157 0.000 
2 4 158 0.000 
2 4 159 0.000 
2 4 160 0.000 
2 4 161 0.000 
2 4 162 1.003 
2 4 163 1.065 
2 4 164 0.791 
2 4 165 1.067 
2 4 166 0.903 
2 4 167 1.025 
2 4 168 0.937 
2 4 169 0.000 
2 4 170 0.000 
2 4 171 0.000 
2 4 172 0.000 
2 4 173 0.000 
2 4 174 0.967 
2 4 175 0.729 
2 4 176 1.557 
2 4 177 0.932 
2 4 178 0.951 
2 4 179 1.175 
2 4 180 0.858 
2 4 181 0.000 
2 4 182 0.000 
2 4 183 0.000 
2 4 184 0.000 
2 4 185 0.000 
2 4 186 1.480 
2 4 187 1.154 
2 4 188 0.884 
2 4 189 1.050 
2 4 190 1.028 
2 4 191 1.017 
2 4 192 1.063 
2 4 193 0.000 
2 4 194 0.000 
2 4 195 0.000 
2 4 196 0.000 
2 4 197 0.000 
2 4 198 4.000 
2 4 199 0.512 
2 4 200 0.885 
2 4 201 4.000 
2 4 202 0.580 
2 4 203 1.081 
2 4 204 0.894 
2 4 205 0.011 
2 4 206 0.950 
2 4 207 0.950 
2 4 208 0.367 
2 4 209 0.011 
2 4 210 0.350 
2 4 211 1.118 
2 4 212 1.029 
2 4 213 0.926 
2 4 214 0.737 
2 4 215 0.808 
2 4 216 1.124 
2 4 217 0.662 
2 4 218 1.635 
2 4 219 2.937 
2 4 220 0.341 
2 4 221 4.000 
2 4 222 0.951 
2 4 223 2.350 
2 4 224 0.759 
2 4 225 4.000 
2 4 226 0.748 
2 4 227 2.636 
2 4 228 0.704 
2 4 229 0.666 
2 4 230 0.765 
2 4 231 0.670 
2 4 232 0.011 
2 4 233 0.587 
2 4 234 0.530 
2 4 235 4.000 
2 4 236 0.940 
2 4 237 0.924 
2 4 238 0.406 
2 4 239 1.964 
2 4 240 0.391 
2 4 241 0.011 
2 4 242 0.907 
2 4 243 1.034 
2 4 244 0.867 
2 4 245 1.270 
2 4 246 1.167 
2 4 247 1.021 
2 4 248 1.406 
2 4 249 1.289 
2 4 250 1.581 
2 4 251 0.729 
2 4 252 0.622 
2 4 253 0.877 
2 4 254 1.096 
2 4 255 0.963 
2 4 256 1.188 
2 4 257 1.146 
2 4 258 4.000 
2 4 259 1.157 
2 4 260 0.378 
2 4 261 1.591 
2 4 262 1.500 
2 4 263 1.697 
2 4 264 3.161 
2 4 265 0.851 
2 4 266 1.232 
2 4 267 1.067 
2 4 268 1.069 
2 4 269 0.899 
2 4 270 0.840 
2 4 271 0.525 
2 4 272 0.596 
2 4 273 0.419 
2 4 274 0.370 
2 4 275 0.363 
2 4 276 0.615 
2 4 277 0.665 
2 4 278 1.064 
2 4 279 0.604 
2 4 280 0.700 
2 4 281 0.011 
2 4 282 0.294 
2 4 283 0.640 
2 4 284 0.481 
2 4 285 0.274 
2 4 286 0.382 
2 4 287 4.000 
2 4 288 0.800 
