1431071921 1   1 
1431071921 2   0 
1431071921 3   0 
1431071921 4   -1 
1431071921 5   0 
1431071921 6   0 
1431071921 7   1 
1431071921 8   0 
1431071921 9   0 
1431071921 10   -1 
1431071921 11   0 
1431071921 12   0 
1431071921 13   1 
1431071921 14   0 
1431071921 15   0 
1431071921 16   -1 
1431071921 17   0 
1431071921 18   0 
1431071921 19   1 
1431071921 20   0 
1431071921 21   0 
1431071921 22   -1 
1431071921 23   0 
1431071921 24   0 
1431071921 25   1 
1431071921 26   0 
1431071921 27   0 
1431071921 28   -1 
1431071921 29   0 
1431071921 30   0 
1431071921 31   1 
1431071921 32   0 
1431071921 33   0 
1431071921 34   -1 
1431071921 35   0 
1431071921 36   0 
1431071921 37   0 
1431071921 38   0 
1431071921 39   0 
1431071921 40   0 
1431071921 41   0 
1431071921 42   0 
1431071921 43   0 
1431071921 44   0 
1431071921 45   0 
1431071921 46   0 
1431071921 47   0 
1431071921 48   0 
1431071921 49   0 
1431071921 50   0 
1431071921 51   0 
1431071921 52   0 
1431071921 53   0 
1431071921 54   0 
1431071921 55   0 
1431071921 56   0 
1431071921 57   0 
1431071921 58   0 
1431071921 59   0 
1431071921 60   0 
1431071921 61   0 
1431071921 62   0 
1431071921 63   0 
1431071921 64   0 
1431071921 65   0 
1431071921 66   0 
1431071921 67   0 
1431071921 68   0 
1431071921 69   0 
1431071921 70   0 
1431071921 71   0 
1431071921 72   0 
1431071921 73   0 
1431071921 74   0 
1431071921 75   0 
1431071921 76   0 
1431071921 77   0 
1431071921 78   0 
1431071921 79   0 
1431071921 80   0 
1431071921 81   0 
1431071921 82   0 
1431071921 83   0 
1431071921 84   0 
1431071921 85   0 
1431071921 86   0 
1431071921 87   0 
1431071921 88   0 
1431071921 89   0 
1431071921 90   0 
1431071921 91   0 
1431071921 92   0 
1431071921 93   0 
1431071921 94   0 
1431071921 95   0 
1431071921 96   0 
1431071921 97   0 
1431071921 98   0 
1431071921 99   0 
1431071921 100   0 
1431071921 101   0 
1431071921 102   0 
1431071921 103   0 
1431071921 104   0 
1431071921 105   0 
1431071921 106   0 
1431071921 107   0 
1431071921 108   0 
1431071921 109   0 
1431071921 110   0 
1431071921 111   0 
1431071921 112   0 
1431071921 113   0 
1431071921 114   0 
1431071921 115   0 
1431071921 116   0 
1431071921 117   0 
1431071921 118   0 
1431071921 119   0 
1431071921 120   0 
1431071921 121   0 
1431071921 122   0 
1431071921 123   0 
1431071921 124   0 
1431071921 125   0 
1431071921 126   0 
1431071921 127   0 
1431071921 128   0 
1431071921 129   0 
1431071921 130   0 
1431071921 131   0 
1431071921 132   0 
1431071921 133   0 
1431071921 134   0 
1431071921 135   0 
1431071921 136   0 
1431071921 137   0 
1431071921 138   0 
1431071921 139   0 
1431071921 140   0 
1431071921 141   0 
1431071921 142   0 
1431071921 143   0 
1431071921 144   0 
1431071921 145   0 
1431071921 146   0 
1431071921 147   0 
1431071921 148   0 
1431071921 149   0 
1431071921 150   0 
1431071921 151   0 
1431071921 152   0 
1431071921 153   0 
1431071921 154   0 
1431071921 155   0 
1431071921 156   0 
1431071921 157   0 
1431071921 158   0 
1431071921 159   0 
1431071921 160   0 
1431071921 161   0 
1431071921 162   0 
1431071921 163   0 
1431071921 164   0 
1431071921 165   0 
1431071921 166   0 
1431071921 167   0 
1431071921 168   0 
1431071921 169   0 
1431071921 170   0 
1431071921 171   0 
1431071921 172   0 
1431071921 173   0 
1431071921 174   0 
1431071921 175   0 
1431071921 176   0 
1431071921 177   0 
1431071921 178   0 
1431071921 179   0 
1431071921 180   0 
1431071921 181   0 
1431071921 182   0 
1431071921 183   0 
1431071921 184   0 
1431071921 185   0 
1431071921 186   0 
1431071921 187   0 
1431071921 188   0 
1431071921 189   0 
1431071921 190   0 
1431071921 191   0 
1431071921 192   0 
1431071921 193   0 
1431071921 194   0 
1431071921 195   0 
1431071921 196   0 
1431071921 197   0 
1431071921 198   0 
1431071921 199   0 
1431071921 200   0 
1431071921 201   0 
1431071921 202   0 
1431071921 203   0 
1431071921 204   0 
1431071921 205   0 
1431071921 206   0 
1431071921 207   0 
1431071921 208   0 
1431071921 209   0 
1431071921 210   0 
1431071921 211   0 
1431071921 212   0 
1431071921 213   0 
1431071921 214   0 
1431071921 215   0 
1431071921 216   0 
1431071921 217   0 
1431071921 218   0 
1431071921 219   0 
1431071921 220   0 
1431071921 221   0 
1431071921 222   0 
1431071921 223   0 
1431071921 224   0 
1431071921 225   0 
1431071921 226   0 
1431071921 227   0 
1431071921 228   0 
1431071921 229   0 
1431071921 230   0 
1431071921 231   0 
1431071921 232   0 
1431071921 233   0 
1431071921 234   0 
1431071921 235   0 
1431071921 236   0 
1431071921 237   0 
1431071921 238   0 
1431071921 239   0 
1431071921 240   0 
1431071921 241   0 
1431071921 242   0 
1431071921 243   0 
1431071921 244   0 
1431071921 245   0 
1431071921 246   0 
1431071921 247   0 
1431071921 248   0 
1431071921 249   0 
1431071921 250   0 
1431071921 251   0 
1431071921 252   0 
1431071921 253   0 
1431071921 254   0 
1431071921 255   0 
1431071921 256   0 
1431071921 257   0 
1431071921 258   0 
1431071921 259   0 
1431071921 260   0 
1431071921 261   0 
1431071921 262   0 
1431071921 263   0 
1431071921 264   0 
1431071921 265   0 
1431071921 266   0 
1431071921 267   0 
1431071921 268   0 
1431071921 269   0 
1431071921 270   0 
1431071921 271   0 
1431071921 272   0 
1431071921 273   0 
1431071921 274   0 
1431071921 275   0 
1431071921 276   0 
1431071921 277   0 
1431071921 278   0 
1431071921 279   0 
1431071921 280   0 
1431071921 281   0 
1431071921 282   0 
1431071921 283   0 
1431071921 284   0 
1431071921 285   0 
1431071921 286   0 
1431071921 287   0 
1431071921 288   0 
1431071921 289   0 
1431071921 290   0 
1431071921 291   0 
1431071921 292   0 
1431071921 293   0 
1431071921 294   0 
1431071921 295   0 
1431071921 296   0 
1431071921 297   0 
1431071921 298   0 
1431071921 299   0 
1431071921 300   0 
1431071921 301   0 
1431071921 302   0 
1431071921 303   0 
1431071921 304   0 
1431071921 305   0 
1431071921 306   0 
1431071921 307   0 
1431071921 308   0 
1431071921 309   0 
1431071921 310   0 
1431071921 311   0 
1431071921 312   0 
1431071921 313   0 
1431071921 314   0 
1431071921 315   0 
1431071921 316   0 
1431071921 317   0 
1431071921 318   0 
1431071921 319   0 
1431071921 320   0 
1431071921 321   0 
1431071921 322   0 
1431071921 323   0 
1431071921 324   0 
1431071921 325   0 
1431071921 326   0 
1431071921 327   0 
1431071921 328   0 
1431071921 329   0 
1431071921 330   0 
1431071921 331   0 
1431071921 332   0 
1431071921 333   0 
1431071921 334   0 
1431071921 335   0 
1431071921 336   0 
1431071921 337   0 
1431071921 338   0 
1431071921 339   0 
1431071921 340   0 
1431071921 341   0 
1431071921 342   0 
1431071921 343   0 
1431071921 344   0 
1431071921 345   0 
1431071921 346   0 
1431071921 347   0 
1431071921 348   0 
1431071921 349   0 
1431071921 350   0 
1431071921 351   0 
1431071921 352   0 
1431071921 353   0 
1431071921 354   0 
1431071921 355   0 
1431071921 356   0 
1431071921 357   0 
1431071921 358   0 
1431071921 359   0 
1431071921 360   0 
