1425669308 1   -1 
1425669308 2   0 
1425669308 3   0 
1425669308 4   1 
1425669308 5   0 
1425669308 6   0 
1425669308 7   -1 
1425669308 8   0 
1425669308 9   0 
1425669308 10   1 
1425669308 11   0 
1425669308 12   0 
1425669308 13   1 
1425669308 14   0 
1425669308 15   0 
1425669308 16   -1 
1425669308 17   0 
1425669308 18   0 
1425669308 19   1 
1425669308 20   0 
1425669308 21   0 
1425669308 22   -1 
1425669308 23   0 
1425669308 24   0 
1425669308 25   1 
1425669308 26   0 
1425669308 27   0 
1425669308 28   -1 
1425669308 29   0 
1425669308 30   0 
1425669308 31   1 
1425669308 32   0 
1425669308 33   0 
1425669308 34   -1 
1425669308 35   0 
1425669308 36   0 
1425669308 37   -1 
1425669308 38   0 
1425669308 39   0 
1425669308 40   1 
1425669308 41   0 
1425669308 42   0 
1425669308 43   -1 
1425669308 44   0 
1425669308 45   0 
1425669308 46   1 
1425669308 47   0 
1425669308 48   0 
1425669308 49   1 
1425669308 50   0 
1425669308 51   0 
1425669308 52   -1 
1425669308 53   0 
1425669308 54   0 
1425669308 55   1 
1425669308 56   0 
1425669308 57   0 
1425669308 58   -1 
1425669308 59   0 
1425669308 60   0 
1425669308 61   -1 
1425669308 62   0 
1425669308 63   0 
1425669308 64   1 
1425669308 65   0 
1425669308 66   0 
1425669308 67   -1 
1425669308 68   0 
1425669308 69   0 
1425669308 70   1 
1425669308 71   0 
1425669308 72   0 
1425669308 73   -1 
1425669308 74   0 
1425669308 75   0 
1425669308 76   1 
1425669308 77   0 
1425669308 78   0 
1425669308 79   -1 
1425669308 80   0 
1425669308 81   0 
1425669308 82   1 
1425669308 83   0 
1425669308 84   0 
1425669308 85   1 
1425669308 86   0 
1425669308 87   0 
1425669308 88   -1 
1425669308 89   0 
1425669308 90   0 
1425669308 91   1 
1425669308 92   0 
1425669308 93   0 
1425669308 94   -1 
1425669308 95   0 
1425669308 96   0 
1425669308 97   1 
1425669308 98   0 
1425669308 99   0 
1425669308 100   -1 
1425669308 101   0 
1425669308 102   0 
1425669308 103   1 
1425669308 104   0 
1425669308 105   0 
1425669308 106   -1 
1425669308 107   0 
1425669308 108   0 
1425669308 109   -1 
1425669308 110   0 
1425669308 111   0 
1425669308 112   1 
1425669308 113   0 
1425669308 114   0 
1425669308 115   -1 
1425669308 116   0 
1425669308 117   0 
1425669308 118   1 
1425669308 119   0 
1425669308 120   0 
1425669308 121   1 
1425669308 122   0 
1425669308 123   0 
1425669308 124   -1 
1425669308 125   0 
1425669308 126   0 
1425669308 127   1 
1425669308 128   0 
1425669308 129   0 
1425669308 130   -1 
1425669308 131   0 
1425669308 132   0 
1425669308 133   -1 
1425669308 134   0 
1425669308 135   0 
1425669308 136   1 
1425669308 137   0 
1425669308 138   0 
1425669308 139   -1 
1425669308 140   0 
1425669308 141   0 
1425669308 142   1 
1425669308 143   0 
1425669308 144   0 
1425669308 145   -1 
1425669308 146   0 
1425669308 147   0 
1425669308 148   1 
1425669308 149   0 
1425669308 150   0 
1425669308 151   -1 
1425669308 152   0 
1425669308 153   0 
1425669308 154   1 
1425669308 155   0 
1425669308 156   0 
1425669308 157   1 
1425669308 158   0 
1425669308 159   0 
1425669308 160   -1 
1425669308 161   0 
1425669308 162   0 
1425669308 163   1 
1425669308 164   0 
1425669308 165   0 
1425669308 166   -1 
1425669308 167   0 
1425669308 168   0 
1425669308 169   1 
1425669308 170   0 
1425669308 171   0 
1425669308 172   -1 
1425669308 173   0 
1425669308 174   0 
1425669308 175   1 
1425669308 176   0 
1425669308 177   0 
1425669308 178   -1 
1425669308 179   0 
1425669308 180   0 
1425669308 181   -1 
1425669308 182   0 
1425669308 183   0 
1425669308 184   1 
1425669308 185   0 
1425669308 186   0 
1425669308 187   -1 
1425669308 188   0 
1425669308 189   0 
1425669308 190   1 
1425669308 191   0 
1425669308 192   0 
1425669308 193   1 
1425669308 194   0 
1425669308 195   0 
1425669308 196   -1 
1425669308 197   0 
1425669308 198   0 
1425669308 199   1 
1425669308 200   0 
1425669308 201   0 
1425669308 202   -1 
1425669308 203   0 
1425669308 204   0 
1425669308 205   -1 
1425669308 206   0 
1425669308 207   0 
1425669308 208   1 
1425669308 209   0 
1425669308 210   0 
1425669308 211   -1 
1425669308 212   0 
1425669308 213   0 
1425669308 214   1 
1425669308 215   0 
1425669308 216   0 
1425669308 217   -1 
1425669308 218   0 
1425669308 219   0 
1425669308 220   1 
1425669308 221   0 
1425669308 222   0 
1425669308 223   -1 
1425669308 224   0 
1425669308 225   0 
1425669308 226   1 
1425669308 227   0 
1425669308 228   0 
1425669308 229   1 
1425669308 230   0 
1425669308 231   0 
1425669308 232   -1 
1425669308 233   0 
1425669308 234   0 
1425669308 235   1 
1425669308 236   0 
1425669308 237   0 
1425669308 238   -1 
1425669308 239   0 
1425669308 240   0 
1425669308 241   1 
1425669308 242   0 
1425669308 243   0 
1425669308 244   -1 
1425669308 245   0 
1425669308 246   0 
1425669308 247   1 
1425669308 248   0 
1425669308 249   0 
1425669308 250   -1 
1425669308 251   0 
1425669308 252   0 
1425669308 253   -1 
1425669308 254   0 
1425669308 255   0 
1425669308 256   1 
1425669308 257   0 
1425669308 258   0 
1425669308 259   -1 
1425669308 260   0 
1425669308 261   0 
1425669308 262   1 
1425669308 263   0 
1425669308 264   0 
1425669308 265   1 
1425669308 266   0 
1425669308 267   0 
1425669308 268   -1 
1425669308 269   0 
1425669308 270   0 
1425669308 271   1 
1425669308 272   0 
1425669308 273   0 
1425669308 274   -1 
1425669308 275   0 
1425669308 276   0 
1425669308 277   -1 
1425669308 278   0 
1425669308 279   0 
1425669308 280   1 
1425669308 281   0 
1425669308 282   0 
1425669308 283   -1 
1425669308 284   0 
1425669308 285   0 
1425669308 286   1 
1425669308 287   0 
1425669308 288   0 
1425669308 289   -1 
1425669308 290   0 
1425669308 291   0 
1425669308 292   1 
1425669308 293   0 
1425669308 294   0 
1425669308 295   -1 
1425669308 296   0 
1425669308 297   0 
1425669308 298   1 
1425669308 299   0 
1425669308 300   0 
1425669308 301   1 
1425669308 302   0 
1425669308 303   0 
1425669308 304   -1 
1425669308 305   0 
1425669308 306   0 
1425669308 307   1 
1425669308 308   0 
1425669308 309   0 
1425669308 310   -1 
1425669308 311   0 
1425669308 312   0 
1425669308 313   1 
1425669308 314   0 
1425669308 315   0 
1425669308 316   -1 
1425669308 317   0 
1425669308 318   0 
1425669308 319   1 
1425669308 320   0 
1425669308 321   0 
1425669308 322   -1 
1425669308 323   0 
1425669308 324   0 
1425669308 325   -1 
1425669308 326   0 
1425669308 327   0 
1425669308 328   1 
1425669308 329   0 
1425669308 330   0 
1425669308 331   -1 
1425669308 332   0 
1425669308 333   0 
1425669308 334   0 
1425669308 335   0 
1425669308 336   0 
1425669308 337   0 
1425669308 338   0 
1425669308 339   0 
1425669308 340   0 
1425669308 341   0 
1425669308 342   0 
1425669308 343   0 
1425669308 344   0 
1425669308 345   0 
1425669308 346   0 
1425669308 347   0 
1425669308 348   0 
1425669308 349   0 
1425669308 350   0 
1425669308 351   0 
1425669308 352   0 
1425669308 353   0 
1425669308 354   0 
1425669308 355   0 
1425669308 356   0 
1425669308 357   0 
1425669308 358   0 
1425669308 359   0 
1425669308 360   0 
