  1   1    1    1    3    4   20
  1   1    1    2    3    4   21
  1   1    1    3    3    4   22
  1   1    1    4    3    4   30
  1   1    1    5    3    3   31
  1   1    1    6    3    3   23
  1   1    1    7    3    3   15
  1   1    1    8    3    3    7
  1   1    1    9    3    2   31
  1   1    1   10    3    2   23
  1   1    1   11    3    2   15
  1   1    1   12    3    2    6
  1   1    1   13    3    1   30
  1   1    1   14    3    1   22
  1   1    1   15    3    1   14
  1   1    1   16    3    1    6
  1   1    2    1    3    4   17
  1   1    2    2    3    4   18
  1   1    2    3    3    4   19
  1   1    2    4    3    4   29
  1   1    2    5    3    3   30
  1   1    2    6    3    3   22
  1   1    2    7    3    3   14
  1   1    2    8    3    3    6
  1   1    2    9    3    2   30
  1   1    2   10    3    2   22
  1   1    2   11    3    2   14
  1   1    2   12    3    2    5
  1   1    2   13    3    1   29
  1   1    2   14    3    1   21
  1   1    2   15    3    1   13
  1   1    2   16    3    1    5
  1   1    3    1    3    4   12
  1   1    3    2    3    4   13
  1   1    3    3    3    4   14
  1   1    3    4    3    4   28
  1   1    3    5    3    3   29
  1   1    3    6    3    3   21
  1   1    3    7    3    3   13
  1   1    3    8    3    3    5
  1   1    3    9    3    2   29
  1   1    3   10    3    2   21
  1   1    3   11    3    2   13
  1   1    3   12    3    2    4
  1   1    3   13    3    1   28
  1   1    3   14    3    1   20
  1   1    3   15    3    1   12
  1   1    3   16    3    1    4
  1   1    4    1    3    4    9
  1   1    4    2    3    4   10
  1   1    4    3    3    4   11
  1   1    4    4    3    4   27
  1   1    4    5    3    3   28
  1   1    4    6    3    3   20
  1   1    4    7    3    3   12
  1   1    4    8    3    3    4
  1   1    4    9    3    2   28
  1   1    4   10    3    2   20
  1   1    4   11    3    2   12
  1   1    4   12    3    2    3
  1   1    4   13    3    1   27
  1   1    4   14    3    1   19
  1   1    4   15    3    1   11
  1   1    4   16    3    1    3
  1   1    5    1    3    4    4
  1   1    5    2    3    4    5
  1   1    5    3    3    4    6
  1   1    5    4    3    4   26
  1   1    5    5    3    3   27
  1   1    5    6    3    3   19
  1   1    5    7    3    3   11
  1   1    5    8    3    3    3
  1   1    5    9    3    2   27
  1   1    5   10    3    2   19
  1   1    5   11    3    2   11
  1   1    5   12    3    2    2
  1   1    5   13    3    1   26
  1   1    5   14    3    1   18
  1   1    5   15    3    1   10
  1   1    5   16    3    1    2
  1   1    6    1    3    3    8
  1   1    6    2    3    3   16
  1   1    6    3    3    3   24
  1   1    6    4    3    4   25
  1   1    6    5    3    3   26
  1   1    6    6    3    3   18
  1   1    6    7    3    3   10
  1   1    6    8    3    3    2
  1   1    6    9    3    2   26
  1   1    6   10    3    2   18
  1   1    6   11    3    2   10
  1   1    6   12    3    2    1
  1   1    6   13    3    1   25
  1   1    6   14    3    1   17
  1   1    6   15    3    1    9
  1   1    6   16    3    1    1
  1   1    7    1    3    3    9
  1   1    7    2    3    3   17
  1   1    7    3    3    3   25
  1   1    7    4    3   12    0
  1   1    7    5    3   12    1
  1   1    7    6    3   12    2
  1   1    7    7    3   12    3
  1   1    7    8    3    2   17
  1   1    7    9    3    2   25
  1   1    7   10    3    3    1
  1   1    7   11    3    2   16
  1   1    7   12    3    2   24
  1   1    7   13    3    3    0
  1   1    7   14    3    4    1
  1   1    7   15    3    4    2
  1   1    7   16    3    4    3
  1   1    8    1    3   12   15
  1   1    8    2    3   12   14
  1   1    8    3    3   12   13
  1   1    8    4    3   12   12
  1   1    8    5    3   12   11
  1   1    8    6    3   12   10
  1   1    8    7    3   12    9
  1   1    8    8    3   12    8
  1   1    8    9    3   12   23
  1   1    8   10    3   12   22
  1   1    8   11    3   12   21
  1   1    8   12    3   12   20
  1   1    8   13    3   12   19
  1   1    8   14    3   12   18
  1   1    8   15    3   12   17
  1   1    8   16    3   12   16
  1   1    9    1    3   10   31
  1   1    9    2    3   10   30
  1   1    9    3    3   10   29
  1   1    9    4    3   10   28
  1   1    9    5    3    2    8
  1   1    9    6    3    4    0
  1   1    9    7    3    4    8
  1   1    9    8    3    4   16
  1   1    9    9    3    4   24
 -1  -1   -1   -1   -1   -1   -1
  1   1    9   11    3    9   16
  1   1    9   12    3    9   24
  1   1    9   13    3   10    0
  1   1    9   14    3   10    8
  1   1    9   15    3   10   16
  1   1    9   16    3   10   24
  1   1   10    1    3   10   23
  1   1   10    2    3   10   22
  1   1   10    3    3   10   21
  1   1   10    4    3   10   20
  1   1   10    5    3    1    8
  1   1   10    6    3    1   16
  1   1   10    7    3    1   24
  1   1   10    8    3    2    0
  1   1   10    9    3    2    9
 -1  -1   -1   -1   -1   -1   -1
  1   1   10   11    3    9   17
  1   1   10   12    3    9   25
  1   1   10   13    3   10    1
  1   1   10   14    3   10    9
  1   1   10   15    3   10   17
  1   1   10   16    3   10   25
  1   1   11    1    3   10   15
  1   1   11    2    3   10   14
  1   1   11    3    3   10   13
  1   1   11    4    3   10   12
  1   1   11    5    3    9   11
  1   1   11    6    3    9   10
  1   1   11    7    3   12    4
  1   1   11    8    3    1    0
  1   1   11    9    3    9    1
  1   1   11   10    3    9    9
  1   1   11   11    3    9   18
  1   1   11   12    3    9   26
  1   1   11   13    3   10    2
  1   1   11   14    3   10   10
  1   1   11   15    3   10   18
  1   1   11   16    3   10   26
  1   1   12    1    3   10    7
  1   1   12    2    3   10    6
  1   1   12    3    3   10    5
  1   1   12    4    3   10    4
  1   1   12    5    3    9    3
  1   1   12    6    3    9    2
  1   1   12    7    3   12    5
  1   1   12    8    3   12    6
  1   1   12    9    3    9    0
  1   1   12   10    3    9    8
  1   1   12   11    3    9   19
  1   1   12   12    3    9   27
  1   1   12   13    3   10    3
  1   1   12   14    3   10   11
  1   1   12   15    3   10   19
  1   1   12   16    3   10   27
  1   1   13    1    3    9   31
  1   1   13    2    3    9   30
  1   1   13    3    3    9   29
  1   1   13    4    3    9   28
  1   1   13    5    3    8   27
  1   1   13    6    3    8   26
  1   1   13    7    3    8   25
  1   1   13    8    3    8   24
  1   1   13    9    3    6   24
  1   1   13   10    3    6   16
  1   1   13   11    3    6    8
  1   1   13   12    3    6    0
  1   1   13   13    3    5   24
  1   1   13   14    3    5   16
  1   1   13   15    3    5    8
  1   1   13   16    3    5    0
  1   1   14    1    3    9   23
  1   1   14    2    3    9   22
  1   1   14    3    3    9   21
  1   1   14    4    3    9   20
  1   1   14    5    3    8   19
  1   1   14    6    3    8   18
  1   1   14    7    3    8   17
  1   1   14    8    3    8   16
  1   1   14    9    3    6   25
  1   1   14   10    3    6   17
  1   1   14   11    3    6    9
  1   1   14   12    3    6    1
  1   1   14   13    3    5   25
  1   1   14   14    3    5   17
  1   1   14   15    3    5    9
  1   1   14   16    3    5    1
  1   1   15    1    3    9   15
  1   1   15    2    3    9   14
  1   1   15    3    3    9   13
  1   1   15    4    3    9   12
  1   1   15    5    3    8   11
  1   1   15    6    3    8   10
  1   1   15    7    3    8    9
  1   1   15    8    3    8    8
  1   1   15    9    3    6   26
  1   1   15   10    3    6   18
  1   1   15   11    3    6   10
  1   1   15   12    3    6    2
  1   1   15   13    3    5   26
  1   1   15   14    3    5   18
  1   1   15   15    3    5   10
  1   1   15   16    3    5    2
  1   1   16    1    3    9    7
  1   1   16    2    3    9    6
  1   1   16    3    3    9    5
  1   1   16    4    3    9    4
  1   1   16    5    3    8    3
  1   1   16    6    3    8    4
  1   1   16    7    3    8    5
  1   1   16    8    3    8    6
  1   1   16    9    3    6   27
  1   1   16   10    3    6   19
  1   1   16   11    3    6   11
  1   1   16   12    3    6    3
  1   1   16   13    3    5   27
  1   1   16   14    3    5   19
  1   1   16   15    3    5   11
  1   1   16   16    3    5    3
  1   1   17    1    3    8   31
  1   1   17    2    3    8   30
  1   1   17    3    3    8   29
  1   1   17    4    3    8   28
  1   1   17    5    3    7   24
  1   1   17    6    3    7   25
  1   1   17    7    3    7   26
  1   1   17    8    3    7   27
  1   1   17    9    3    6   28
  1   1   17   10    3    6   20
  1   1   17   11    3    6   12
  1   1   17   12    3    6    4
  1   1   17   13    3    5   28
  1   1   17   14    3    5   20
  1   1   17   15    3    5   12
  1   1   17   16    3    5    4
  1   1   18    1    3    8   23
  1   1   18    2    3    8   22
  1   1   18    3    3    8   21
  1   1   18    4    3    8   20
  1   1   18    5    3    7   16
  1   1   18    6    3    7   17
  1   1   18    7    3    7   18
  1   1   18    8    3    7   19
  1   1   18    9    3    6   29
  1   1   18   10    3    6   21
  1   1   18   11    3    6   13
  1   1   18   12    3    6    5
  1   1   18   13    3    5   29
  1   1   18   14    3    5   21
  1   1   18   15    3    5   13
  1   1   18   16    3    5    5
  1   1   19    1    3    8   15
  1   1   19    2    3    8   14
  1   1   19    3    3    8   13
  1   1   19    4    3    8   12
  1   1   19    5    3    7    8
  1   1   19    6    3    7    9
  1   1   19    7    3    7   10
  1   1   19    8    3    7   11
  1   1   19    9    3    6   30
  1   1   19   10    3    6   22
  1   1   19   11    3    6   14
  1   1   19   12    3    6    6
  1   1   19   13    3    5   30
  1   1   19   14    3    5   22
  1   1   19   15    3    5   14
  1   1   19   16    3    5    6
 -1  -1   -1   -1   -1   -1   -1
  1   1   20    2    3    8    0
  1   1   20    3    3    8    1
  1   1   20    4    3    8    2
 -1  -1   -1   -1   -1   -1   -1
  1   1   20    6    3    7    0
  1   1   20    7    3    7    1
  1   1   20    8    3    7    2
  1   1   20    9    3    6   31
  1   1   20   10    3    6   23
  1   1   20   11    3    6   15
  1   1   20   12    3    6    7
  1   1   20   13    3    5   31
  1   1   20   14    3    5   23
  1   1   20   15    3    5   15
  1   1   20   16    3    5    7
 -1  -1   -1   -1   -1   -1   -1
  1   2    1    2    4    8    0
  1   2    1    3    4    8    1
  1   2    1    4    4    8    2
 -1  -1   -1   -1   -1   -1   -1
  1   2    1    6    4    7    0
  1   2    1    7    4    7    1
  1   2    1    8    4    7    2
  1   2    1    9    4    6   31
  1   2    1   10    4    6   23
  1   2    1   11    4    6   15
  1   2    1   12    4    6    7
  1   2    1   13    4    5   31
  1   2    1   14    4    5   23
  1   2    1   15    4    5   15
  1   2    1   16    4    5    7
  1   2    2    1    4    8   15
  1   2    2    2    4    8   14
  1   2    2    3    4    8   13
  1   2    2    4    4    8   12
  1   2    2    5    4    7    8
  1   2    2    6    4    7    9
  1   2    2    7    4    7   10
  1   2    2    8    4    7   11
  1   2    2    9    4    6   30
  1   2    2   10    4    6   22
  1   2    2   11    4    6   14
  1   2    2   12    4    6    6
  1   2    2   13    4    5   30
  1   2    2   14    4    5   22
  1   2    2   15    4    5   14
  1   2    2   16    4    5    6
  1   2    3    1    4    8   23
  1   2    3    2    4    8   22
  1   2    3    3    4    8   21
  1   2    3    4    4    8   20
  1   2    3    5    4    7   16
  1   2    3    6    4    7   17
  1   2    3    7    4    7   18
  1   2    3    8    4    7   19
  1   2    3    9    4    6   29
  1   2    3   10    4    6   21
  1   2    3   11    4    6   13
  1   2    3   12    4    6    5
  1   2    3   13    4    5   29
  1   2    3   14    4    5   21
  1   2    3   15    4    5   13
  1   2    3   16    4    5    5
  1   2    4    1    4    8   31
  1   2    4    2    4    8   30
  1   2    4    3    4    8   29
  1   2    4    4    4    8   28
  1   2    4    5    4    7   24
  1   2    4    6    4    7   25
  1   2    4    7    4    7   26
  1   2    4    8    4    7   27
  1   2    4    9    4    6   28
  1   2    4   10    4    6   20
  1   2    4   11    4    6   12
  1   2    4   12    4    6    4
  1   2    4   13    4    5   28
  1   2    4   14    4    5   20
  1   2    4   15    4    5   12
  1   2    4   16    4    5    4
  1   2    5    1    4    9    7
  1   2    5    2    4    9    6
  1   2    5    3    4    9    5
  1   2    5    4    4    9    4
  1   2    5    5    4    8    3
  1   2    5    6    4    8    4
  1   2    5    7    4    8    5
  1   2    5    8    4    8    6
  1   2    5    9    4    6   27
  1   2    5   10    4    6   19
  1   2    5   11    4    6   11
  1   2    5   12    4    6    3
  1   2    5   13    4    5   27
  1   2    5   14    4    5   19
  1   2    5   15    4    5   11
  1   2    5   16    4    5    3
  1   2    6    1    4    9   15
  1   2    6    2    4    9   14
  1   2    6    3    4    9   13
  1   2    6    4    4    9   12
  1   2    6    5    4    8   11
  1   2    6    6    4    8   10
  1   2    6    7    4    8    9
  1   2    6    8    4    8    8
  1   2    6    9    4    6   26
  1   2    6   10    4    6   18
  1   2    6   11    4    6   10
  1   2    6   12    4    6    2
  1   2    6   13    4    5   26
  1   2    6   14    4    5   18
  1   2    6   15    4    5   10
  1   2    6   16    4    5    2
  1   2    7    1    4    9   23
  1   2    7    2    4    9   22
  1   2    7    3    4    9   21
  1   2    7    4    4    9   20
  1   2    7    5    4    8   19
  1   2    7    6    4    8   18
  1   2    7    7    4    8   17
  1   2    7    8    4    8   16
  1   2    7    9    4    6   25
  1   2    7   10    4    6   17
  1   2    7   11    4    6    9
  1   2    7   12    4    6    1
  1   2    7   13    4    5   25
  1   2    7   14    4    5   17
  1   2    7   15    4    5    9
  1   2    7   16    4    5    1
  1   2    8    1    4    9   31
  1   2    8    2    4    9   30
  1   2    8    3    4    9   29
  1   2    8    4    4    9   28
  1   2    8    5    4    8   27
  1   2    8    6    4    8   26
  1   2    8    7    4    8   25
  1   2    8    8    4    8   24
  1   2    8    9    4    6   24
  1   2    8   10    4    6   16
  1   2    8   11    4    6    8
  1   2    8   12    4    6    0
  1   2    8   13    4    5   24
  1   2    8   14    4    5   16
  1   2    8   15    4    5    8
  1   2    8   16    4    5    0
  1   2    9    1    4   10    7
  1   2    9    2    4   10    6
  1   2    9    3    4   10    5
  1   2    9    4    4   10    4
  1   2    9    5    4    9    3
  1   2    9    6    4    9    2
  1   2    9    7    4   12    3
  1   2    9    8    4   12    6
  1   2    9    9    4    9    0
  1   2    9   10    4    9    8
  1   2    9   11    4    9   19
  1   2    9   12    4    9   27
  1   2    9   13    4   10    3
  1   2    9   14    4   10   11
  1   2    9   15    4   10   19
  1   2    9   16    4   10   27
  1   2   10    1    4   10   15
  1   2   10    2    4   10   14
  1   2   10    3    4   10   13
  1   2   10    4    4   10   12
  1   2   10    5    4    9   11
  1   2   10    6    4    9   10
  1   2   10    7    4   12    4
  1   2   10    8    4    1    0
  1   2   10    9    4    9    1
  1   2   10   10    4    9    9
  1   2   10   11    4    9   18
  1   2   10   12    4    9   26
  1   2   10   13    4   10    2
  1   2   10   14    4   10   10
  1   2   10   15    4   10   18
  1   2   10   16    4   10   26
  1   2   11    1    4   10   23
  1   2   11    2    4   10   22
  1   2   11    3    4   10   21
  1   2   11    4    4   10   20
  1   2   11    5    4    1    8
  1   2   11    6    4    1   16
  1   2   11    7    4    1   24
  1   2   11    8    4    2    0
  1   2   11    9    4    2    9
 -1  -1   -1   -1   -1   -1   -1
  1   2   11   11    4    9   17
  1   2   11   12    4    9   25
  1   2   11   13    4   10    1
  1   2   11   14    4   10    9
  1   2   11   15    4   10   17
  1   2   11   16    4   10   25
  1   2   12    1    4   10   31
  1   2   12    2    4   10   30
  1   2   12    3    4   10   29
  1   2   12    4    4   10   28
  1   2   12    5    4    2    8
  1   2   12    6    4    4    0
  1   2   12    7    4    4    8
  1   2   12    8    4    4   16
  1   2   12    9    4    4   25
 -1  -1   -1   -1   -1   -1   -1
  1   2   12   11    4    9   16
  1   2   12   12    4    9   24
  1   2   12   13    4   10    0
  1   2   12   14    4   10    8
  1   2   12   15    4   10   16
  1   2   12   16    4   10   24
  1   2   13    1    4   12   15
  1   2   13    2    4   12   14
  1   2   13    3    4   12   13
  1   2   13    4    4   12   12
  1   2   13    5    4   12   11
  1   2   13    6    4   12   10
  1   2   13    7    4   12    9
  1   2   13    8    4   12    8
  1   2   13    9    4   12   23
  1   2   13   10    4   12   22
  1   2   13   11    4   12   21
  1   2   13   12    4   12   20
  1   2   13   13    4   12   19
  1   2   13   14    4   12   18
  1   2   13   15    4   12   17
  1   2   13   16    4   12   16
  1   2   14    1    4    3    9
  1   2   14    2    4    3   17
  1   2   14    3    4    3   25
  1   2   14    4    4   12    0
  1   2   14    5    4   12    1
  1   2   14    6    4   12    2
  1   2   14    7    4   12    5
  1   2   14    8    4    2   17
  1   2   14    9    4    2   25
  1   2   14   10    4    3    1
  1   2   14   11    4    2   16
  1   2   14   12    4    2   24
  1   2   14   13    4    3    0
  1   2   14   14    4    4    1
  1   2   14   15    4    4    2
  1   2   14   16    4    4    3
  1   2   15    1    4    3    8
  1   2   15    2    4    3   16
  1   2   15    3    4    3   24
  1   2   15    4    4    4   26
  1   2   15    5    4    3   26
  1   2   15    6    4    3   18
  1   2   15    7    4    3   10
  1   2   15    8    4    3    2
  1   2   15    9    4    2   26
  1   2   15   10    4    2   18
  1   2   15   11    4    2   10
  1   2   15   12    4    2    1
  1   2   15   13    4    1   25
  1   2   15   14    4    1   17
  1   2   15   15    4    1    9
  1   2   15   16    4    1    1
  1   2   16    1    4    4    4
  1   2   16    2    4    4    5
  1   2   16    3    4    4    6
  1   2   16    4    4    4   27
  1   2   16    5    4    3   27
  1   2   16    6    4    3   19
  1   2   16    7    4    3   11
  1   2   16    8    4    3    3
  1   2   16    9    4    2   27
  1   2   16   10    4    2   19
  1   2   16   11    4    2   11
  1   2   16   12    4    2    2
  1   2   16   13    4    1   26
  1   2   16   14    4    1   18
  1   2   16   15    4    1   10
  1   2   16   16    4    1    2
  1   2   17    1    4    4    9
  1   2   17    2    4    4   10
  1   2   17    3    4    4   11
  1   2   17    4    4    4   28
  1   2   17    5    4    3   28
  1   2   17    6    4    3   20
  1   2   17    7    4    3   12
  1   2   17    8    4    3    4
  1   2   17    9    4    2   28
  1   2   17   10    4    2   20
  1   2   17   11    4    2   12
  1   2   17   12    4    2    3
  1   2   17   13    4    1   27
  1   2   17   14    4    1   19
  1   2   17   15    4    1   11
  1   2   17   16    4    1    3
  1   2   18    1    4    4   12
  1   2   18    2    4    4   13
  1   2   18    3    4    4   14
  1   2   18    4    4    4   29
  1   2   18    5    4    3   29
  1   2   18    6    4    3   21
  1   2   18    7    4    3   13
  1   2   18    8    4    3    5
  1   2   18    9    4    2   29
  1   2   18   10    4    2   21
  1   2   18   11    4    2   13
  1   2   18   12    4    2    4
  1   2   18   13    4    1   28
  1   2   18   14    4    1   20
  1   2   18   15    4    1   12
  1   2   18   16    4    1    4
  1   2   19    1    4    4   17
  1   2   19    2    4    4   18
  1   2   19    3    4    4   19
  1   2   19    4    4    4   30
  1   2   19    5    4    3   30
  1   2   19    6    4    3   22
  1   2   19    7    4    3   14
  1   2   19    8    4    3    6
  1   2   19    9    4    2   30
  1   2   19   10    4    2   22
  1   2   19   11    4    2   14
  1   2   19   12    4    2    5
  1   2   19   13    4    1   29
  1   2   19   14    4    1   21
  1   2   19   15    4    1   13
  1   2   19   16    4    1    5
  1   2   20    1    4    4   20
  1   2   20    2    4    4   21
  1   2   20    3    4    4   22
  1   2   20    4    4    4   31
  1   2   20    5    4    3   31
  1   2   20    6    4    3   23
  1   2   20    7    4    3   15
  1   2   20    8    4    3    7
  1   2   20    9    4    2   31
  1   2   20   10    4    2   23
  1   2   20   11    4    2   15
  1   2   20   12    4    2    6
  1   2   20   13    4    1   30
  1   2   20   14    4    1   22
  1   2   20   15    4    1   14
  1   2   20   16    4    1    6
  2   1    1    1    1    4   20
  2   1    1    2    1    4   21
  2   1    1    3    1    4   22
  2   1    1    4    1    4   30
  2   1    1    5    1    3   31
  2   1    1    6    1    3   23
  2   1    1    7    1    3   15
  2   1    1    8    1    3    7
  2   1    1    9    1    2   31
  2   1    1   10    1    2   23
  2   1    1   11    1    2   15
  2   1    1   12    1    2    6
  2   1    1   13    1    1   30
  2   1    1   14    1    1   22
  2   1    1   15    1    1   14
  2   1    1   16    1    1    6
  2   1    2    1    1    4   17
  2   1    2    2    1    4   18
  2   1    2    3    1    4   19
  2   1    2    4    1    4   29
  2   1    2    5    1    3   30
  2   1    2    6    1    3   22
  2   1    2    7    1    3   14
  2   1    2    8    1    3    6
  2   1    2    9    1    2   30
  2   1    2   10    1    2   22
  2   1    2   11    1    2   14
  2   1    2   12    1    2    5
  2   1    2   13    1    1   29
  2   1    2   14    1    1   21
  2   1    2   15    1    1   13
  2   1    2   16    1    1    5
  2   1    3    1    1    4   12
  2   1    3    2    1    4   13
  2   1    3    3    1    4   14
  2   1    3    4    1    4   28
  2   1    3    5    1    3   29
  2   1    3    6    1    3   21
  2   1    3    7    1    3   13
  2   1    3    8    1    3    5
  2   1    3    9    1    2   29
  2   1    3   10    1    2   21
  2   1    3   11    1    2   13
  2   1    3   12    1    2    4
  2   1    3   13    1    1   28
  2   1    3   14    1    1   20
  2   1    3   15    1    1   12
  2   1    3   16    1    1    4
  2   1    4    1    1    4    9
  2   1    4    2    1    4   10
  2   1    4    3    1    4   11
  2   1    4    4    1    4   27
  2   1    4    5    1    3   28
  2   1    4    6    1    3   20
  2   1    4    7    1    3   12
  2   1    4    8    1    3    4
  2   1    4    9    1    2   28
  2   1    4   10    1    2   20
  2   1    4   11    1    2   12
  2   1    4   12    1    2    3
  2   1    4   13    1    1   27
  2   1    4   14    1    1   19
  2   1    4   15    1    1   11
  2   1    4   16    1    1    3
  2   1    5    1    1    4    4
  2   1    5    2    1    4    5
  2   1    5    3    1    4    6
  2   1    5    4    1    4   26
  2   1    5    5    1    3   27
  2   1    5    6    1    3   19
  2   1    5    7    1    3   11
  2   1    5    8    1    3    3
  2   1    5    9    1    2   27
  2   1    5   10    1    2   19
  2   1    5   11    1    2   11
  2   1    5   12    1    2    2
  2   1    5   13    1    1   26
  2   1    5   14    1    1   18
  2   1    5   15    1    1   10
  2   1    5   16    1    1    2
  2   1    6    1    1    3    8
  2   1    6    2    1    3   16
  2   1    6    3    1    3   24
  2   1    6    4    1    4   25
  2   1    6    5    1    3   26
  2   1    6    6    1    3   18
  2   1    6    7    1    3   10
  2   1    6    8    1    3    2
  2   1    6    9    1    2   26
  2   1    6   10    1    2   18
  2   1    6   11    1    2   10
  2   1    6   12    1    2    1
  2   1    6   13    1    1   25
  2   1    6   14    1    1   17
  2   1    6   15    1    1    9
  2   1    6   16    1    1    1
  2   1    7    1    1    3    9
  2   1    7    2    1    3   17
  2   1    7    3    1    3   25
  2   1    7    4    1   12    0
  2   1    7    5    1   12    1
  2   1    7    6    1   12    2
  2   1    7    7    1   12    3
  2   1    7    8    1    2   17
  2   1    7    9    1    2   25
  2   1    7   10    1    3    1
  2   1    7   11    1    2   16
  2   1    7   12    1    2   24
  2   1    7   13    1    3    0
  2   1    7   14    1    4    1
  2   1    7   15    1    4    2
  2   1    7   16    1    4    3
  2   1    8    1    1   12   15
  2   1    8    2    1   12   14
  2   1    8    3    1   12   13
  2   1    8    4    1   12   12
  2   1    8    5    1   12   11
  2   1    8    6    1   12   10
  2   1    8    7    1   12    9
  2   1    8    8    1   12    8
  2   1    8    9    1   12   23
  2   1    8   10    1   12   22
  2   1    8   11    1   12   21
  2   1    8   12    1   12   20
  2   1    8   13    1   12   19
  2   1    8   14    1   12   18
  2   1    8   15    1   12   17
  2   1    8   16    1   12   16
  2   1    9    1    1   10   31
  2   1    9    2    1   10   30
  2   1    9    3    1   10   29
  2   1    9    4    1   10   28
  2   1    9    5    1    2    8
  2   1    9    6    1    4    0
  2   1    9    7    1    4    8
  2   1    9    8    1    4   16
  2   1    9    9    1    4   24
 -1  -1   -1   -1   -1   -1   -1
  2   1    9   11    1    9   16
  2   1    9   12    1    9   24
  2   1    9   13    1   10    0
  2   1    9   14    1   10    8
  2   1    9   15    1   10   16
  2   1    9   16    1   10   24
  2   1   10    1    1   10   23
  2   1   10    2    1   10   22
  2   1   10    3    1   10   21
  2   1   10    4    1   10   20
  2   1   10    5    1    1    8
  2   1   10    6    1    1   16
  2   1   10    7    1    1   24
  2   1   10    8    1    2    0
  2   1   10    9    1    2    9
 -1  -1   -1   -1   -1   -1   -1
  2   1   10   11    1    9   17
  2   1   10   12    1    9   25
  2   1   10   13    1   10    1
  2   1   10   14    1   10    9
  2   1   10   15    1   10   17
  2   1   10   16    1   10   25
  2   1   11    1    1   10   15
  2   1   11    2    1   10   14
  2   1   11    3    1   10   13
  2   1   11    4    1   10   12
  2   1   11    5    1    9   11
  2   1   11    6    1    9   10
  2   1   11    7    1   12    4
  2   1   11    8    1    1    0
  2   1   11    9    1    9    1
  2   1   11   10    1    9    9
  2   1   11   11    1    9   18
  2   1   11   12    1    9   26
  2   1   11   13    1   10    2
  2   1   11   14    1   10   10
  2   1   11   15    1   10   18
  2   1   11   16    1   10   26
  2   1   12    1    1   10    7
  2   1   12    2    1   10    6
  2   1   12    3    1   10    5
  2   1   12    4    1   10    4
  2   1   12    5    1    9    3
  2   1   12    6    1    9    2
  2   1   12    7    1   12    5
  2   1   12    8    1   12    6
  2   1   12    9    1    9    0
  2   1   12   10    1    9    8
  2   1   12   11    1    9   19
  2   1   12   12    1    9   27
  2   1   12   13    1   10    3
  2   1   12   14    1   10   11
  2   1   12   15    1   10   19
  2   1   12   16    1   10   27
  2   1   13    1    1    9   31
  2   1   13    2    1    9   30
  2   1   13    3    1    9   29
  2   1   13    4    1    9   28
  2   1   13    5    1    8   27
  2   1   13    6    1    8   26
  2   1   13    7    1    8   25
  2   1   13    8    1    8   24
  2   1   13    9    1    6   24
  2   1   13   10    1    6   16
  2   1   13   11    1    6    8
  2   1   13   12    1    6    0
  2   1   13   13    1    5   24
  2   1   13   14    1    5   16
  2   1   13   15    1    5    8
  2   1   13   16    1    5    0
  2   1   14    1    1    9   23
  2   1   14    2    1    9   22
  2   1   14    3    1    9   21
  2   1   14    4    1    9   20
  2   1   14    5    1    8   19
  2   1   14    6    1    8   18
  2   1   14    7    1    8   17
  2   1   14    8    1    8   16
  2   1   14    9    1    6   25
  2   1   14   10    1    6   17
  2   1   14   11    1    6    9
  2   1   14   12    1    6    1
  2   1   14   13    1    5   25
  2   1   14   14    1    5   17
  2   1   14   15    1    5    9
  2   1   14   16    1    5    1
  2   1   15    1    1    9   15
  2   1   15    2    1    9   14
  2   1   15    3    1    9   13
  2   1   15    4    1    9   12
  2   1   15    5    1    8   11
  2   1   15    6    1    8   10
  2   1   15    7    1    8    9
  2   1   15    8    1    8    8
  2   1   15    9    1    6   26
  2   1   15   10    1    6   18
  2   1   15   11    1    6   10
  2   1   15   12    1    6    2
  2   1   15   13    1    5   26
  2   1   15   14    1    5   18
  2   1   15   15    1    5   10
  2   1   15   16    1    5    2
  2   1   16    1    1    9    7
  2   1   16    2    1    9    6
  2   1   16    3    1    9    5
  2   1   16    4    1    9    4
  2   1   16    5    1    8    3
  2   1   16    6    1    8    4
  2   1   16    7    1    8    5
  2   1   16    8    1    8    6
  2   1   16    9    1    6   27
  2   1   16   10    1    6   19
  2   1   16   11    1    6   11
  2   1   16   12    1    6    3
  2   1   16   13    1    5   27
  2   1   16   14    1    5   19
  2   1   16   15    1    5   11
  2   1   16   16    1    5    3
  2   1   17    1    1    8   31
  2   1   17    2    1    8   30
  2   1   17    3    1    8   29
  2   1   17    4    1    8   28
  2   1   17    5    1    7   24
  2   1   17    6    1    7   25
  2   1   17    7    1    7   26
  2   1   17    8    1    7   27
  2   1   17    9    1    6   28
  2   1   17   10    1    6   20
  2   1   17   11    1    6   12
  2   1   17   12    1    6    4
  2   1   17   13    1    5   28
  2   1   17   14    1    5   20
  2   1   17   15    1    5   12
  2   1   17   16    1    5    4
  2   1   18    1    1    8   23
  2   1   18    2    1    8   22
  2   1   18    3    1    8   21
  2   1   18    4    1    8   20
  2   1   18    5    1    7   16
  2   1   18    6    1    7   17
  2   1   18    7    1    7   18
  2   1   18    8    1    7   19
  2   1   18    9    1    6   29
  2   1   18   10    1    6   21
  2   1   18   11    1    6   13
  2   1   18   12    1    6    5
  2   1   18   13    1    5   29
  2   1   18   14    1    5   21
  2   1   18   15    1    5   13
  2   1   18   16    1    5    5
  2   1   19    1    1    8   15
  2   1   19    2    1    8   14
  2   1   19    3    1    8   13
  2   1   19    4    1    8   12
  2   1   19    5    1    7    8
  2   1   19    6    1    7    9
  2   1   19    7    1    7   10
  2   1   19    8    1    7   11
  2   1   19    9    1    6   30
  2   1   19   10    1    6   22
  2   1   19   11    1    6   14
  2   1   19   12    1    6    6
  2   1   19   13    1    5   30
  2   1   19   14    1    5   22
  2   1   19   15    1    5   14
  2   1   19   16    1    5    6
 -1  -1   -1   -1   -1   -1   -1
  2   1   20    2    1    8    0
  2   1   20    3    1    8    1
  2   1   20    4    1    8    2
 -1  -1   -1   -1   -1   -1   -1
  2   1   20    6    1    7    0
  2   1   20    7    1    7    1
  2   1   20    8    1    7    2
  2   1   20    9    1    6   31
  2   1   20   10    1    6   23
  2   1   20   11    1    6   15
  2   1   20   12    1    6    7
  2   1   20   13    1    5   31
  2   1   20   14    1    5   23
  2   1   20   15    1    5   15
  2   1   20   16    1    5    7
 -1  -1   -1   -1   -1   -1   -1
  2   2    1    2    2    8    0
  2   2    1    3    2    8    1
  2   2    1    4    2    8    2
 -1  -1   -1   -1   -1   -1   -1
  2   2    1    6    2    7    0
  2   2    1    7    2    7    1
  2   2    1    8    2    7    2
  2   2    1    9    2    6   31
  2   2    1   10    2    6   23
  2   2    1   11    2    6   15
  2   2    1   12    2    6    7
  2   2    1   13    2    5   31
  2   2    1   14    2    5   23
  2   2    1   15    2    5   15
  2   2    1   16    2    5    7
  2   2    2    1    2    8   15
  2   2    2    2    2    8   14
  2   2    2    3    2    8   13
  2   2    2    4    2    8   12
  2   2    2    5    2    7    8
  2   2    2    6    2    7    9
  2   2    2    7    2    7   10
  2   2    2    8    2    7   11
  2   2    2    9    2    6   30
  2   2    2   10    2    6   22
  2   2    2   11    2    6   14
  2   2    2   12    2    6    6
  2   2    2   13    2    5   30
  2   2    2   14    2    5   22
  2   2    2   15    2    5   14
  2   2    2   16    2    5    6
  2   2    3    1    2    8   23
  2   2    3    2    2    8   22
  2   2    3    3    2    8   21
  2   2    3    4    2    8   20
  2   2    3    5    2    7   16
  2   2    3    6    2    7   17
  2   2    3    7    2    7   18
  2   2    3    8    2    7   19
  2   2    3    9    2    6   29
  2   2    3   10    2    6   21
  2   2    3   11    2    6   13
  2   2    3   12    2    6    5
  2   2    3   13    2    5   29
  2   2    3   14    2    5   21
  2   2    3   15    2    5   13
  2   2    3   16    2    5    5
  2   2    4    1    2    8   31
  2   2    4    2    2    8   30
  2   2    4    3    2    8   29
  2   2    4    4    2    8   28
  2   2    4    5    2    7   24
  2   2    4    6    2    7   25
  2   2    4    7    2    7   26
  2   2    4    8    2    7   27
  2   2    4    9    2    6   28
  2   2    4   10    2    6   20
  2   2    4   11    2    6   12
  2   2    4   12    2    6    4
  2   2    4   13    2    5   28
  2   2    4   14    2    5   20
  2   2    4   15    2    5   12
  2   2    4   16    2    5    4
  2   2    5    1    2    9    7
  2   2    5    2    2    9    6
  2   2    5    3    2    9    5
  2   2    5    4    2    9    4
  2   2    5    5    2    8    3
  2   2    5    6    2    8    4
  2   2    5    7    2    8    5
  2   2    5    8    2    8    6
  2   2    5    9    2    6   27
  2   2    5   10    2    6   19
  2   2    5   11    2    6   11
  2   2    5   12    2    6    3
  2   2    5   13    2    5   27
  2   2    5   14    2    5   19
  2   2    5   15    2    5   11
  2   2    5   16    2    5    3
  2   2    6    1    2    9   15
  2   2    6    2    2    9   14
  2   2    6    3    2    9   13
  2   2    6    4    2    9   12
  2   2    6    5    2    8   11
  2   2    6    6    2    8   10
  2   2    6    7    2    8    9
  2   2    6    8    2    8    8
  2   2    6    9    2    6   26
  2   2    6   10    2    6   18
  2   2    6   11    2    6   10
  2   2    6   12    2    6    2
  2   2    6   13    2    5   26
  2   2    6   14    2    5   18
  2   2    6   15    2    5   10
  2   2    6   16    2    5    2
  2   2    7    1    2    9   23
  2   2    7    2    2    9   22
  2   2    7    3    2    9   21
  2   2    7    4    2    9   20
  2   2    7    5    2    8   19
  2   2    7    6    2    8   18
  2   2    7    7    2    8   17
  2   2    7    8    2    8   16
  2   2    7    9    2    6   25
  2   2    7   10    2    6   17
  2   2    7   11    2    6    9
  2   2    7   12    2    6    1
  2   2    7   13    2    5   25
  2   2    7   14    2    5   17
  2   2    7   15    2    5    9
  2   2    7   16    2    5    1
  2   2    8    1    2    9   31
  2   2    8    2    2    9   30
  2   2    8    3    2    9   29
  2   2    8    4    2    9   28
  2   2    8    5    2    8   27
  2   2    8    6    2    8   26
  2   2    8    7    2    8   25
  2   2    8    8    2    8   24
  2   2    8    9    2    6   24
  2   2    8   10    2    6   16
  2   2    8   11    2    6    8
  2   2    8   12    2    6    0
  2   2    8   13    2    5   24
  2   2    8   14    2    5   16
  2   2    8   15    2    5    8
  2   2    8   16    2    5    0
  2   2    9    1    2   10    7
  2   2    9    2    2   10    6
  2   2    9    3    2   10    5
  2   2    9    4    2   10    4
  2   2    9    5    2    9    3
  2   2    9    6    2    9    2
  2   2    9    7    2   12    3
  2   2    9    8    2   12    6
  2   2    9    9    2    9    0
  2   2    9   10    2    9    8
  2   2    9   11    2    9   19
  2   2    9   12    2    9   27
  2   2    9   13    2   10    3
  2   2    9   14    2   10   11
  2   2    9   15    2   10   19
  2   2    9   16    2   10   27
  2   2   10    1    2   10   15
  2   2   10    2    2   10   14
  2   2   10    3    2   10   13
  2   2   10    4    2   10   12
  2   2   10    5    2    9   11
  2   2   10    6    2    9   10
  2   2   10    7    2   12    4
  2   2   10    8    2    1    0
  2   2   10    9    2    9    1
  2   2   10   10    2    9    9
  2   2   10   11    2    9   18
  2   2   10   12    2    9   26
  2   2   10   13    2   10    2
  2   2   10   14    2   10   10
  2   2   10   15    2   10   18
  2   2   10   16    2   10   26
  2   2   11    1    2   10   23
  2   2   11    2    2   10   22
  2   2   11    3    2   10   21
  2   2   11    4    2   10   20
  2   2   11    5    2    1    8
  2   2   11    6    2    1   16
  2   2   11    7    2    1   24
  2   2   11    8    2    2    0
  2   2   11    9    2    2    9
 -1  -1   -1   -1   -1   -1   -1
  2   2   11   11    2    9   17
  2   2   11   12    2    9   25
  2   2   11   13    2   10    1
  2   2   11   14    2   10    9
  2   2   11   15    2   10   17
  2   2   11   16    2   10   25
  2   2   12    1    2   10   31
  2   2   12    2    2   10   30
  2   2   12    3    2   10   29
  2   2   12    4    2   10   28
  2   2   12    5    2    2    8
  2   2   12    6    2    4    0
  2   2   12    7    2    4    8
  2   2   12    8    2    4   16
  2   2   12    9    2    4   25
 -1  -1   -1   -1   -1   -1   -1
  2   2   12   11    2    9   16
  2   2   12   12    2    9   24
  2   2   12   13    2   10    0
  2   2   12   14    2   10    8
  2   2   12   15    2   10   16
  2   2   12   16    2   10   24
  2   2   13    1    2   12   15
  2   2   13    2    2   12   14
  2   2   13    3    2   12   13
  2   2   13    4    2   12   12
  2   2   13    5    2   12   11
  2   2   13    6    2   12   10
  2   2   13    7    2   12    9
  2   2   13    8    2   12    8
  2   2   13    9    2   12   23
  2   2   13   10    2   12   22
  2   2   13   11    2   12   21
  2   2   13   12    2   12   20
  2   2   13   13    2   12   19
  2   2   13   14    2   12   18
  2   2   13   15    2   12   17
  2   2   13   16    2   12   16
  2   2   14    1    2    3    9
  2   2   14    2    2    3   17
  2   2   14    3    2    3   25
  2   2   14    4    2   12    0
  2   2   14    5    2   12    1
  2   2   14    6    2   12    2
  2   2   14    7    2   12    5
  2   2   14    8    2    2   17
  2   2   14    9    2    2   25
  2   2   14   10    2    3    1
  2   2   14   11    2    2   16
  2   2   14   12    2    2   24
  2   2   14   13    2    3    0
  2   2   14   14    2    4    1
  2   2   14   15    2    4    2
  2   2   14   16    2    4    3
  2   2   15    1    2    3    8
  2   2   15    2    2    3   16
  2   2   15    3    2    3   24
  2   2   15    4    2    4   26
  2   2   15    5    2    3   26
  2   2   15    6    2    3   18
  2   2   15    7    2    3   10
  2   2   15    8    2    3    2
  2   2   15    9    2    2   26
  2   2   15   10    2    2   18
  2   2   15   11    2    2   10
  2   2   15   12    2    2    1
  2   2   15   13    2    1   25
  2   2   15   14    2    1   17
  2   2   15   15    2    1    9
  2   2   15   16    2    1    1
  2   2   16    1    2    4    4
  2   2   16    2    2    4    5
  2   2   16    3    2    4    6
  2   2   16    4    2    4   27
  2   2   16    5    2    3   27
  2   2   16    6    2    3   19
  2   2   16    7    2    3   11
  2   2   16    8    2    3    3
  2   2   16    9    2    2   27
  2   2   16   10    2    2   19
  2   2   16   11    2    2   11
  2   2   16   12    2    2    2
  2   2   16   13    2    1   26
  2   2   16   14    2    1   18
  2   2   16   15    2    1   10
  2   2   16   16    2    1    2
  2   2   17    1    2    4    9
  2   2   17    2    2    4   10
  2   2   17    3    2    4   11
  2   2   17    4    2    4   28
  2   2   17    5    2    3   28
  2   2   17    6    2    3   20
  2   2   17    7    2    3   12
  2   2   17    8    2    3    4
  2   2   17    9    2    2   28
  2   2   17   10    2    2   20
  2   2   17   11    2    2   12
  2   2   17   12    2    2    3
  2   2   17   13    2    1   27
  2   2   17   14    2    1   19
  2   2   17   15    2    1   11
  2   2   17   16    2    1    3
  2   2   18    1    2    4   12
  2   2   18    2    2    4   13
  2   2   18    3    2    4   14
  2   2   18    4    2    4   29
  2   2   18    5    2    3   29
  2   2   18    6    2    3   21
  2   2   18    7    2    3   13
  2   2   18    8    2    3    5
  2   2   18    9    2    2   29
  2   2   18   10    2    2   21
  2   2   18   11    2    2   13
  2   2   18   12    2    2    4
  2   2   18   13    2    1   28
  2   2   18   14    2    1   20
  2   2   18   15    2    1   12
  2   2   18   16    2    1    4
  2   2   19    1    2    4   17
  2   2   19    2    2    4   18
  2   2   19    3    2    4   19
  2   2   19    4    2    4   30
  2   2   19    5    2    3   30
  2   2   19    6    2    3   22
  2   2   19    7    2    3   14
  2   2   19    8    2    3    6
  2   2   19    9    2    2   30
  2   2   19   10    2    2   22
  2   2   19   11    2    2   14
  2   2   19   12    2    2    5
  2   2   19   13    2    1   29
  2   2   19   14    2    1   21
  2   2   19   15    2    1   13
  2   2   19   16    2    1    5
  2   2   20    1    2    4   20
  2   2   20    2    2    4   21
  2   2   20    3    2    4   22
  2   2   20    4    2    4   31
  2   2   20    5    2    3   31
  2   2   20    6    2    3   23
  2   2   20    7    2    3   15
  2   2   20    8    2    3    7
  2   2   20    9    2    2   31
  2   2   20   10    2    2   23
  2   2   20   11    2    2   15
  2   2   20   12    2    2    6
  2   2   20   13    2    1   30
  2   2   20   14    2    1   22
  2   2   20   15    2    1   14
  2   2   20   16    2    1    6

