Cell issues are catagorized various places

in Cell::RankCell(CalibStr* rank)
fills rank with 
  /*
   -1)  Unused
    0)  Dead Cell (ADC ~ 0) for bin# 6
    1,3,7,15,31,>32)  Shifted gain with nunber of consecutive zeros = given number
    0x80) No Shifted Cell
  
   */

Cell::Quality(CalibStr* rank)

bool edge = NSTB boundary cells without diagnols on large cells considered

check for dead or shifted neighbors from Cell::RankCell()

bool Dead5 =     x 
                xxx    
                 x

bool Dead9 =   xxx
               xxx
               xxx

Quality bits
 q& 0xFF => dead and shifted
 q& 0x100 => Edge
 q& 0x1000 => Dead5
 q& 0x10000 => Dead9


