1 1 1 1.000 
1 1 2 1.000 
1 1 3 1.000 
1 1 4 1.000 
1 1 5 1.000 
1 1 6 1.000 
1 1 7 1.000 
1 1 8 1.000 
1 1 9 1.000 
1 1 10 1.000 
1 1 11 1.000 
1 1 12 1.000 
1 1 13 1.000 
1 1 14 1.000 
1 1 15 1.000 
1 1 16 1.000 
1 1 17 1.000 
1 1 18 1.000 
1 1 19 1.000 
1 1 20 1.000 
1 1 21 1.000 
1 1 22 1.000 
1 1 23 1.000 
1 1 24 1.000 
1 1 25 1.000 
1 1 26 1.000 
1 1 27 1.000 
1 1 28 1.000 
1 1 29 1.000 
1 1 30 1.000 
1 1 31 1.000 
1 1 32 1.000 
1 1 33 1.000 
1 1 34 1.000 
1 1 35 1.000 
1 1 36 1.000 
1 1 37 1.000 
1 1 38 1.000 
1 1 39 1.000 
1 1 40 1.000 
1 1 41 1.000 
1 1 42 1.000 
1 1 43 1.000 
1 1 44 1.000 
1 1 45 1.000 
1 1 46 1.000 
1 1 47 1.000 
1 1 48 1.000 
1 1 49 1.000 
1 2 1 1.000 
1 2 2 1.000 
1 2 3 1.000 
1 2 4 1.000 
1 2 5 1.000 
1 2 6 1.000 
1 2 7 1.000 
1 2 8 1.000 
1 2 9 1.000 
1 2 10 1.000 
1 2 11 1.000 
1 2 12 1.000 
1 2 13 1.000 
1 2 14 1.000 
1 2 15 1.000 
1 2 16 1.000 
1 2 17 1.000 
1 2 18 1.000 
1 2 19 1.000 
1 2 20 1.000 
1 2 21 1.000 
1 2 22 1.000 
1 2 23 1.000 
1 2 24 1.000 
1 2 25 1.000 
1 2 26 1.000 
1 2 27 1.000 
1 2 28 1.000 
1 2 29 1.000 
1 2 30 1.000 
1 2 31 1.000 
1 2 32 1.000 
1 2 33 1.000 
1 2 34 1.000 
1 2 35 1.000 
1 2 36 1.000 
1 2 37 1.000 
1 2 38 1.000 
1 2 39 1.000 
1 2 40 1.000 
1 2 41 1.000 
1 2 42 1.000 
1 2 43 1.000 
1 2 44 1.000 
1 2 45 1.000 
1 2 46 1.000 
1 2 47 1.000 
1 2 48 1.000 
1 2 49 1.000 
1 3 1 0.000 
1 3 2 0.000 
1 3 3 0.000 
1 3 4 0.000 
1 3 5 0.000 
1 3 6 0.000 
1 3 7 0.000 
1 3 8 0.000 
1 3 9 0.000 
1 3 10 0.000 
1 3 11 0.000 
1 3 12 0.000 
1 3 13 0.000 
1 3 14 0.000 
1 3 15 0.000 
1 3 16 0.000 
1 3 17 0.000 
1 3 18 0.000 
1 3 19 0.000 
1 3 20 0.000 
1 3 21 0.000 
1 3 22 0.000 
1 3 23 0.000 
1 3 24 0.000 
1 3 25 0.000 
1 4 1 0.000 
1 4 2 0.000 
1 4 3 0.000 
1 4 4 0.000 
1 4 5 0.000 
1 4 6 0.000 
1 4 7 0.000 
1 4 8 0.000 
1 4 9 0.000 
1 4 10 0.000 
1 4 11 0.000 
1 4 12 0.000 
1 4 13 0.000 
1 4 14 0.000 
1 4 15 0.000 
1 4 16 0.000 
1 4 17 0.000 
1 4 18 0.000 
1 4 19 0.000 
1 4 20 0.000 
1 4 21 0.000 
1 4 22 0.000 
1 4 23 0.000 
1 4 24 0.000 
1 4 25 0.000 
1 5 1 1.000 
1 5 2 1.000 
1 5 3 1.000 
1 5 4 1.000 
1 5 5 1.000 
1 5 6 1.000 
1 5 7 1.000 
1 6 1 1.000 
1 6 2 1.000 
1 6 3 1.000 
1 6 4 1.000 
1 6 5 1.000 
1 6 6 1.000 
1 6 7 1.000 
2 1 1 1.000 
2 1 2 0.887 
2 1 3 0.749 
2 1 4 0.824 
2 1 5 0.531 
2 1 6 0.362 
2 1 7 1.830 
2 1 8 0.336 
2 1 9 0.327 
2 1 10 4.589 
2 1 11 0.000 
2 1 12 0.000 
2 1 13 0.000 
2 1 14 0.000 
2 1 15 0.000 
2 1 16 0.000 
2 1 17 0.000 
2 1 18 1.593 
2 1 19 0.000 
2 1 20 1.935 
2 1 21 6.033 
2 1 22 1.001 
2 1 23 2.092 
2 1 24 3.601 
2 1 25 1.136 
2 1 26 2.061 
2 1 27 3.124 
2 1 28 0.130 
2 1 29 0.000 
2 1 30 0.000 
2 1 31 0.000 
2 1 32 0.000 
2 1 33 0.000 
2 1 34 0.000 
2 1 35 0.500 
2 1 36 1.475 
2 1 37 1.489 
2 1 38 3.983 
2 1 39 1.619 
2 1 40 2.346 
2 1 41 1.174 
2 1 42 2.075 
2 1 43 2.109 
2 1 44 1.290 
2 1 45 1.543 
2 1 46 0.638 
2 1 47 0.000 
2 1 48 0.000 
2 1 49 0.000 
2 1 50 0.000 
2 1 51 0.000 
2 1 52 1.189 
2 1 53 1.063 
2 1 54 1.142 
2 1 55 3.736 
2 1 56 1.125 
2 1 57 1.232 
2 1 58 2.336 
2 1 59 5.020 
2 1 60 2.653 
2 1 61 2.270 
2 1 62 1.578 
2 1 63 1.169 
2 1 64 0.597 
2 1 65 0.000 
2 1 66 0.000 
2 1 67 0.000 
2 1 68 0.000 
2 1 69 1.332 
2 1 70 0.827 
2 1 71 1.207 
2 1 72 1.285 
2 1 73 1.000 
2 1 74 3.412 
2 1 75 1.321 
2 1 76 0.872 
2 1 77 1.256 
2 1 78 1.336 
2 1 79 2.042 
2 1 80 2.633 
2 1 81 0.977 
2 1 82 0.703 
2 1 83 0.000 
2 1 84 0.000 
2 1 85 0.000 
2 1 86 1.273 
2 1 87 2.300 
2 1 88 1.029 
2 1 89 1.480 
2 1 90 0.844 
2 1 91 1.039 
2 1 92 1.405 
2 1 93 2.842 
2 1 94 0.340 
2 1 95 0.122 
2 1 96 1.479 
2 1 97 1.969 
2 1 98 2.021 
2 1 99 2.051 
2 1 100 1.084 
2 1 101 0.000 
2 1 102 0.000 
2 1 103 0.350 
2 1 104 0.979 
2 1 105 1.253 
2 1 106 0.888 
2 1 107 2.243 
2 1 108 1.233 
2 1 109 0.639 
2 1 110 1.428 
2 1 111 1.144 
2 1 112 1.134 
2 1 113 0.436 
2 1 114 1.040 
2 1 115 0.228 
2 1 116 0.140 
2 1 117 0.993 
2 1 118 1.665 
2 1 119 0.000 
2 1 120 0.712 
2 1 121 0.473 
2 1 122 1.182 
2 1 123 1.059 
2 1 124 1.076 
2 1 125 1.267 
2 1 126 1.014 
2 1 127 1.014 
2 1 128 0.882 
2 1 129 25.487 
2 1 130 0.505 
2 1 131 0.876 
2 1 132 0.151 
2 1 133 1.428 
2 1 134 1.258 
2 1 135 3.943 
2 1 136 0.664 
2 1 137 0.587 
2 1 138 0.752 
2 1 139 0.892 
2 1 140 0.774 
2 1 141 0.458 
2 1 142 1.022 
2 1 143 1.165 
2 1 144 0.774 
2 1 145 0.856 
2 1 146 0.857 
2 1 147 1.020 
2 1 148 0.455 
2 1 149 1.100 
2 1 150 1.161 
2 1 151 1.000 
2 1 152 3.238 
2 1 153 0.673 
2 1 154 0.000 
2 1 155 0.000 
2 1 156 0.000 
2 1 157 0.000 
2 1 158 0.000 
2 1 159 0.000 
2 1 160 0.000 
2 1 161 0.000 
2 1 162 0.550 
2 1 163 0.399 
2 1 164 1.000 
2 1 165 1.245 
2 1 166 1.374 
2 1 167 0.781 
2 1 168 3.581 
2 1 169 1.353 
2 1 170 0.664 
2 1 171 0.000 
2 1 172 0.000 
2 1 173 0.000 
2 1 174 0.000 
2 1 175 0.000 
2 1 176 0.000 
2 1 177 0.000 
2 1 178 0.000 
2 1 179 2.773 
2 1 180 5.000 
2 1 181 1.029 
2 1 182 3.808 
2 1 183 1.101 
2 1 184 1.683 
2 1 185 5.197 
2 1 186 0.559 
2 1 187 1.000 
2 1 188 0.000 
2 1 189 0.000 
2 1 190 0.000 
2 1 191 0.000 
2 1 192 0.000 
2 1 193 0.000 
2 1 194 0.000 
2 1 195 0.000 
2 1 196 0.713 
2 1 197 0.527 
2 1 198 0.236 
2 1 199 0.061 
2 1 200 2.403 
2 1 201 0.336 
2 1 202 1.274 
2 1 203 1.574 
2 1 204 0.996 
2 1 205 0.000 
2 1 206 0.000 
2 1 207 0.000 
2 1 208 0.000 
2 1 209 0.000 
2 1 210 0.000 
2 1 211 0.000 
2 1 212 0.000 
2 1 213 3.734 
2 1 214 0.480 
2 1 215 0.027 
2 1 216 0.650 
2 1 217 3.552 
2 1 218 1.794 
2 1 219 0.774 
2 1 220 2.205 
2 1 221 13.865 
2 1 222 0.000 
2 1 223 0.000 
2 1 224 0.000 
2 1 225 0.000 
2 1 226 0.000 
2 1 227 0.000 
2 1 228 0.000 
2 1 229 0.000 
2 1 230 0.276 
2 1 231 0.502 
2 1 232 1.000 
2 1 233 0.174 
2 1 234 0.644 
2 1 235 3.976 
2 1 236 0.956 
2 1 237 1.418 
2 1 238 1.107 
2 1 239 0.000 
2 1 240 0.000 
2 1 241 0.000 
2 1 242 0.000 
2 1 243 0.000 
2 1 244 0.000 
2 1 245 0.000 
2 1 246 0.000 
2 1 247 0.737 
2 1 248 1.267 
2 1 249 2.720 
2 1 250 0.951 
2 1 251 0.466 
2 1 252 5.039 
2 1 253 1.447 
2 1 254 2.706 
2 1 255 1.673 
2 1 256 0.000 
2 1 257 0.000 
2 1 258 0.000 
2 1 259 0.000 
2 1 260 0.000 
2 1 261 0.000 
2 1 262 0.000 
2 1 263 0.000 
2 1 264 1.339 
2 1 265 0.365 
2 1 266 0.766 
2 1 267 0.442 
2 1 268 1.532 
2 1 269 1.000 
2 1 270 0.970 
2 1 271 1.283 
2 1 272 0.847 
2 1 273 0.000 
2 1 274 0.000 
2 1 275 0.000 
2 1 276 0.000 
2 1 277 0.000 
2 1 278 0.000 
2 1 279 0.000 
2 1 280 0.000 
2 1 281 0.640 
2 1 282 0.725 
2 1 283 1.192 
2 1 284 1.394 
2 1 285 1.801 
2 1 286 1.478 
2 1 287 2.339 
2 1 288 1.509 
2 1 289 1.286 
2 1 290 0.000 
2 1 291 0.000 
2 1 292 0.000 
2 1 293 0.000 
2 1 294 0.000 
2 1 295 0.000 
2 1 296 0.000 
2 1 297 0.000 
2 1 298 0.807 
2 1 299 0.802 
2 1 300 0.589 
2 1 301 1.050 
2 1 302 1.145 
2 1 303 0.825 
2 1 304 1.499 
2 1 305 0.959 
2 1 306 0.998 
2 1 307 0.000 
2 1 308 0.000 
2 1 309 0.000 
2 1 310 0.000 
2 1 311 0.000 
2 1 312 0.000 
2 1 313 0.000 
2 1 314 0.000 
2 1 315 0.443 
2 1 316 1.371 
2 1 317 0.920 
2 1 318 1.067 
2 1 319 1.197 
2 1 320 1.163 
2 1 321 2.329 
2 1 322 0.232 
2 1 323 0.824 
2 1 324 0.000 
2 1 325 0.000 
2 1 326 0.000 
2 1 327 0.000 
2 1 328 0.000 
2 1 329 0.000 
2 1 330 0.000 
2 1 331 0.000 
2 1 332 1.337 
2 1 333 2.877 
2 1 334 1.031 
2 1 335 1.275 
2 1 336 1.367 
2 1 337 0.500 
2 1 338 1.803 
2 1 339 2.116 
2 1 340 1.019 
2 1 341 0.000 
2 1 342 0.000 
2 1 343 0.000 
2 1 344 0.000 
2 1 345 0.000 
2 1 346 0.000 
2 1 347 0.000 
2 1 348 0.000 
2 1 349 1.399 
2 1 350 0.935 
2 1 351 1.108 
2 1 352 1.006 
2 1 353 1.779 
2 1 354 1.355 
2 1 355 0.443 
2 1 356 1.213 
2 1 357 0.692 
2 1 358 0.000 
2 1 359 0.000 
2 1 360 0.000 
2 1 361 0.000 
2 1 362 0.000 
2 1 363 0.000 
2 1 364 0.000 
2 1 365 0.000 
2 1 366 3.000 
2 1 367 0.852 
2 1 368 0.982 
2 1 369 1.120 
2 1 370 1.104 
2 1 371 1.396 
2 1 372 3.214 
2 1 373 3.301 
2 1 374 0.664 
2 1 375 0.000 
2 1 376 0.000 
2 1 377 0.000 
2 1 378 0.000 
2 1 379 0.000 
2 1 380 0.000 
2 1 381 0.000 
2 1 382 0.000 
2 1 383 0.515 
2 1 384 0.696 
2 1 385 0.859 
2 1 386 0.745 
2 1 387 1.200 
2 1 388 1.211 
2 1 389 1.492 
2 1 390 0.881 
2 1 391 0.809 
2 1 392 0.000 
2 1 393 0.000 
2 1 394 0.000 
2 1 395 0.000 
2 1 396 0.000 
2 1 397 0.000 
2 1 398 0.000 
2 1 399 0.000 
2 1 400 0.815 
2 1 401 0.484 
2 1 402 2.172 
2 1 403 0.029 
2 1 404 1.161 
2 1 405 1.604 
2 1 406 3.289 
2 1 407 3.830 
2 1 408 0.507 
2 1 409 0.000 
2 1 410 0.000 
2 1 411 0.000 
2 1 412 0.000 
2 1 413 0.000 
2 1 414 0.000 
2 1 415 0.000 
2 1 416 0.000 
2 1 417 0.633 
2 1 418 1.047 
2 1 419 6.664 
2 1 420 1.142 
2 1 421 1.270 
2 1 422 1.719 
2 1 423 2.309 
2 1 424 2.297 
2 1 425 0.791 
2 1 426 5.928 
2 1 427 0.979 
2 1 428 0.587 
2 1 429 0.867 
2 1 430 1.420 
2 1 431 0.198 
2 1 432 0.477 
2 1 433 1.043 
2 1 434 0.759 
2 1 435 1.230 
2 1 436 1.082 
2 1 437 1.354 
2 1 438 1.256 
2 1 439 3.067 
2 1 440 0.735 
2 1 441 1.834 
2 1 442 0.910 
2 1 443 1.011 
2 1 444 1.079 
2 1 445 0.946 
2 1 446 0.985 
2 1 447 0.974 
2 1 448 2.012 
2 1 449 0.854 
2 1 450 0.500 
2 1 451 5.399 
2 1 452 1.188 
2 1 453 1.814 
2 1 454 0.599 
2 1 455 0.851 
2 1 456 1.500 
2 1 457 2.698 
2 1 458 3.440 
2 1 459 0.802 
2 1 460 0.886 
2 1 461 1.693 
2 1 462 1.100 
2 1 463 1.362 
2 1 464 0.974 
2 1 465 1.586 
2 1 466 1.359 
2 1 467 1.109 
2 1 468 2.994 
2 1 469 1.136 
2 1 470 1.325 
2 1 471 1.790 
2 1 472 1.713 
2 1 473 2.712 
2 1 474 3.796 
2 1 475 0.699 
2 1 476 0.000 
2 1 477 0.836 
2 1 478 0.861 
2 1 479 1.685 
2 1 480 1.914 
2 1 481 0.989 
2 1 482 1.784 
2 1 483 1.000 
2 1 484 2.253 
2 1 485 3.036 
2 1 486 2.149 
2 1 487 5.897 
2 1 488 4.023 
2 1 489 4.535 
2 1 490 1.497 
2 1 491 0.658 
2 1 492 0.000 
2 1 493 0.000 
2 1 494 0.788 
2 1 495 1.094 
2 1 496 1.904 
2 1 497 1.141 
2 1 498 1.650 
2 1 499 2.021 
2 1 500 2.059 
2 1 501 1.902 
2 1 502 1.297 
2 1 503 3.408 
2 1 504 0.531 
2 1 505 0.500 
2 1 506 0.905 
2 1 507 0.995 
2 1 508 0.000 
2 1 509 0.000 
2 1 510 0.000 
2 1 511 1.649 
2 1 512 1.878 
2 1 513 1.590 
2 1 514 1.356 
2 1 515 2.232 
2 1 516 1.596 
2 1 517 2.059 
2 1 518 2.168 
2 1 519 1.800 
2 1 520 3.207 
2 1 521 5.044 
2 1 522 5.478 
2 1 523 0.530 
2 1 524 0.000 
2 1 525 0.000 
2 1 526 0.000 
2 1 527 0.000 
2 1 528 2.121 
2 1 529 1.399 
2 1 530 3.084 
2 1 531 1.746 
2 1 532 3.677 
2 1 533 1.688 
2 1 534 3.312 
2 1 535 3.027 
2 1 536 0.560 
2 1 537 2.690 
2 1 538 5.429 
2 1 539 2.314 
2 1 540 0.000 
2 1 541 0.000 
2 1 542 0.000 
2 1 543 0.000 
2 1 544 0.000 
2 1 545 1.949 
2 1 546 2.380 
2 1 547 4.876 
2 1 548 2.397 
2 1 549 2.174 
2 1 550 3.748 
2 1 551 3.915 
2 1 552 3.001 
2 1 553 5.682 
2 1 554 4.630 
2 1 555 1.269 
2 1 556 0.000 
2 1 557 0.000 
2 1 558 0.000 
2 1 559 0.000 
2 1 560 0.000 
2 1 561 0.000 
2 1 562 0.948 
2 1 563 1.179 
2 1 564 0.935 
2 1 565 1.951 
2 1 566 1.951 
2 1 567 1.054 
2 1 568 0.898 
2 1 569 1.489 
2 1 570 1.317 
2 1 571 0.890 
2 1 572 0.000 
2 1 573 0.000 
2 1 574 0.000 
2 1 575 0.000 
2 1 576 0.000 
2 1 577 0.000 
2 1 578 0.000 
2 2 1 1.042 
2 2 2 0.644 
2 2 3 0.973 
2 2 4 0.522 
2 2 5 0.862 
2 2 6 1.182 
2 2 7 1.376 
2 2 8 1.063 
2 2 9 1.548 
2 2 10 0.679 
2 2 11 0.000 
2 2 12 0.000 
2 2 13 0.000 
2 2 14 0.000 
2 2 15 0.000 
2 2 16 0.000 
2 2 17 0.000 
2 2 18 2.811 
2 2 19 4.436 
2 2 20 5.701 
2 2 21 0.824 
2 2 22 0.439 
2 2 23 1.822 
2 2 24 1.384 
2 2 25 2.408 
2 2 26 0.500 
2 2 27 0.379 
2 2 28 1.099 
2 2 29 0.000 
2 2 30 0.000 
2 2 31 0.000 
2 2 32 0.000 
2 2 33 0.000 
2 2 34 0.000 
2 2 35 1.000 
2 2 36 3.980 
2 2 37 3.625 
2 2 38 3.250 
2 2 39 3.936 
2 2 40 4.352 
2 2 41 5.270 
2 2 42 4.249 
2 2 43 2.465 
2 2 44 0.847 
2 2 45 0.834 
2 2 46 1.119 
2 2 47 0.000 
2 2 48 0.000 
2 2 49 0.000 
2 2 50 0.000 
2 2 51 0.000 
2 2 52 1.214 
2 2 53 2.220 
2 2 54 2.806 
2 2 55 2.391 
2 2 56 1.828 
2 2 57 2.416 
2 2 58 1.993 
2 2 59 13.981 
2 2 60 0.491 
2 2 61 4.780 
2 2 62 2.543 
2 2 63 2.369 
2 2 64 0.216 
2 2 65 0.000 
2 2 66 0.000 
2 2 67 0.000 
2 2 68 0.000 
2 2 69 0.831 
2 2 70 1.117 
2 2 71 3.907 
2 2 72 3.153 
2 2 73 2.055 
2 2 74 2.078 
2 2 75 1.767 
2 2 76 3.016 
2 2 77 1.827 
2 2 78 2.669 
2 2 79 0.794 
2 2 80 4.845 
2 2 81 0.529 
2 2 82 0.306 
2 2 83 0.000 
2 2 84 0.000 
2 2 85 0.000 
2 2 86 0.706 
2 2 87 0.905 
2 2 88 1.281 
2 2 89 1.722 
2 2 90 1.228 
2 2 91 2.115 
2 2 92 1.591 
2 2 93 1.302 
2 2 94 3.997 
2 2 95 0.673 
2 2 96 0.500 
2 2 97 0.500 
2 2 98 0.801 
2 2 99 0.964 
2 2 100 2.309 
2 2 101 0.000 
2 2 102 0.000 
2 2 103 0.735 
2 2 104 0.854 
2 2 105 1.467 
2 2 106 0.659 
2 2 107 0.853 
2 2 108 1.166 
2 2 109 1.089 
2 2 110 1.131 
2 2 111 1.534 
2 2 112 0.254 
2 2 113 4.880 
2 2 114 1.499 
2 2 115 0.500 
2 2 116 2.042 
2 2 117 2.928 
2 2 118 3.691 
2 2 119 0.000 
2 2 120 0.493 
2 2 121 0.626 
2 2 122 0.805 
2 2 123 0.448 
2 2 124 0.809 
2 2 125 4.365 
2 2 126 1.454 
2 2 127 1.192 
2 2 128 1.572 
2 2 129 1.034 
2 2 130 0.650 
2 2 131 7.291 
2 2 132 2.330 
2 2 133 1.617 
2 2 134 0.709 
2 2 135 0.799 
2 2 136 0.550 
2 2 137 1.568 
2 2 138 2.214 
2 2 139 0.510 
2 2 140 0.678 
2 2 141 0.711 
2 2 142 0.647 
2 2 143 0.770 
2 2 144 0.815 
2 2 145 1.469 
2 2 146 1.052 
2 2 147 1.007 
2 2 148 0.391 
2 2 149 1.445 
2 2 150 0.522 
2 2 151 0.094 
2 2 152 2.806 
2 2 153 1.237 
2 2 154 0.000 
2 2 155 0.000 
2 2 156 0.000 
2 2 157 0.000 
2 2 158 0.000 
2 2 159 0.000 
2 2 160 0.000 
2 2 161 0.000 
2 2 162 0.493 
2 2 163 0.626 
2 2 164 0.740 
2 2 165 0.000 
2 2 166 2.120 
2 2 167 3.115 
2 2 168 0.728 
2 2 169 0.000 
2 2 170 0.898 
2 2 171 0.000 
2 2 172 0.000 
2 2 173 0.000 
2 2 174 0.000 
2 2 175 0.000 
2 2 176 0.000 
2 2 177 0.000 
2 2 178 0.000 
2 2 179 0.372 
2 2 180 2.410 
2 2 181 8.255 
2 2 182 0.696 
2 2 183 0.716 
2 2 184 0.518 
2 2 185 2.026 
2 2 186 2.431 
2 2 187 0.723 
2 2 188 0.000 
2 2 189 0.000 
2 2 190 0.000 
2 2 191 0.000 
2 2 192 0.000 
2 2 193 0.000 
2 2 194 0.000 
2 2 195 0.000 
2 2 196 1.419 
2 2 197 1.917 
2 2 198 1.417 
2 2 199 0.645 
2 2 200 0.703 
2 2 201 2.783 
2 2 202 0.000 
2 2 203 3.161 
2 2 204 0.719 
2 2 205 0.000 
2 2 206 0.000 
2 2 207 0.000 
2 2 208 0.000 
2 2 209 0.000 
2 2 210 0.000 
2 2 211 0.000 
2 2 212 0.000 
2 2 213 1.235 
2 2 214 1.101 
2 2 215 0.347 
2 2 216 0.716 
2 2 217 1.000 
2 2 218 1.701 
2 2 219 15.887 
2 2 220 1.644 
2 2 221 0.692 
2 2 222 0.000 
2 2 223 0.000 
2 2 224 0.000 
2 2 225 0.000 
2 2 226 0.000 
2 2 227 0.000 
2 2 228 0.000 
2 2 229 0.000 
2 2 230 0.517 
2 2 231 0.239 
2 2 232 2.277 
2 2 233 0.313 
2 2 234 1.760 
2 2 235 4.640 
2 2 236 2.008 
2 2 237 1.183 
2 2 238 1.133 
2 2 239 0.000 
2 2 240 0.000 
2 2 241 0.000 
2 2 242 0.000 
2 2 243 0.000 
2 2 244 0.000 
2 2 245 0.000 
2 2 246 0.000 
2 2 247 0.857 
2 2 248 2.430 
2 2 249 6.729 
2 2 250 2.185 
2 2 251 1.591 
2 2 252 0.000 
2 2 253 1.379 
2 2 254 0.000 
2 2 255 0.656 
2 2 256 0.000 
2 2 257 0.000 
2 2 258 0.000 
2 2 259 0.000 
2 2 260 0.000 
2 2 261 0.000 
2 2 262 0.000 
2 2 263 0.000 
2 2 264 2.145 
2 2 265 18.122 
2 2 266 0.497 
2 2 267 1.590 
2 2 268 0.530 
2 2 269 0.699 
2 2 270 1.662 
2 2 271 2.317 
2 2 272 0.529 
2 2 273 0.000 
2 2 274 0.000 
2 2 275 0.000 
2 2 276 0.000 
2 2 277 0.000 
2 2 278 0.000 
2 2 279 0.000 
2 2 280 0.000 
2 2 281 2.118 
2 2 282 1.498 
2 2 283 1.345 
2 2 284 1.667 
2 2 285 0.086 
2 2 286 1.435 
2 2 287 6.473 
2 2 288 3.100 
2 2 289 1.778 
2 2 290 0.000 
2 2 291 0.000 
2 2 292 0.000 
2 2 293 0.000 
2 2 294 0.000 
2 2 295 0.000 
2 2 296 0.000 
2 2 297 0.000 
2 2 298 0.313 
2 2 299 1.087 
2 2 300 2.433 
2 2 301 0.615 
2 2 302 1.091 
2 2 303 0.000 
2 2 304 3.116 
2 2 305 0.949 
2 2 306 1.624 
2 2 307 0.000 
2 2 308 0.000 
2 2 309 0.000 
2 2 310 0.000 
2 2 311 0.000 
2 2 312 0.000 
2 2 313 0.000 
2 2 314 0.000 
2 2 315 0.499 
2 2 316 1.141 
2 2 317 0.500 
2 2 318 0.510 
2 2 319 4.295 
2 2 320 1.627 
2 2 321 1.513 
2 2 322 1.239 
2 2 323 1.041 
2 2 324 0.000 
2 2 325 0.000 
2 2 326 0.000 
2 2 327 0.000 
2 2 328 0.000 
2 2 329 0.000 
2 2 330 0.000 
2 2 331 0.000 
2 2 332 1.359 
2 2 333 1.215 
2 2 334 0.920 
2 2 335 0.628 
2 2 336 37.037 
2 2 337 2.913 
2 2 338 0.168 
2 2 339 0.789 
2 2 340 1.096 
2 2 341 0.000 
2 2 342 0.000 
2 2 343 0.000 
2 2 344 0.000 
2 2 345 0.000 
2 2 346 0.000 
2 2 347 0.000 
2 2 348 0.000 
2 2 349 3.379 
2 2 350 1.686 
2 2 351 1.664 
2 2 352 1.495 
2 2 353 1.000 
2 2 354 1.929 
2 2 355 11.019 
2 2 356 2.528 
2 2 357 1.591 
2 2 358 0.000 
2 2 359 0.000 
2 2 360 0.000 
2 2 361 0.000 
2 2 362 0.000 
2 2 363 0.000 
2 2 364 0.000 
2 2 365 0.000 
2 2 366 12.000 
2 2 367 0.609 
2 2 368 0.822 
2 2 369 1.803 
2 2 370 0.951 
2 2 371 0.816 
2 2 372 1.124 
2 2 373 0.559 
2 2 374 0.246 
2 2 375 0.000 
2 2 376 0.000 
2 2 377 0.000 
2 2 378 0.000 
2 2 379 0.000 
2 2 380 0.000 
2 2 381 0.000 
2 2 382 0.000 
2 2 383 0.000 
2 2 384 1.029 
2 2 385 0.862 
2 2 386 0.884 
2 2 387 1.078 
2 2 388 1.038 
2 2 389 0.701 
2 2 390 0.127 
2 2 391 0.845 
2 2 392 0.000 
2 2 393 0.000 
2 2 394 0.000 
2 2 395 0.000 
2 2 396 0.000 
2 2 397 0.000 
2 2 398 0.000 
2 2 399 0.000 
2 2 400 0.300 
2 2 401 4.273 
2 2 402 0.690 
2 2 403 2.313 
2 2 404 0.500 
2 2 405 0.494 
2 2 406 2.032 
2 2 407 0.769 
2 2 408 1.504 
2 2 409 0.000 
2 2 410 0.000 
2 2 411 0.000 
2 2 412 0.000 
2 2 413 0.000 
2 2 414 0.000 
2 2 415 0.000 
2 2 416 0.000 
2 2 417 0.354 
2 2 418 1.106 
2 2 419 0.392 
2 2 420 2.034 
2 2 421 1.411 
2 2 422 7.830 
2 2 423 2.372 
2 2 424 0.293 
2 2 425 7.246 
2 2 426 1.916 
2 2 427 6.286 
2 2 428 0.447 
2 2 429 19.540 
2 2 430 0.958 
2 2 431 0.291 
2 2 432 0.676 
2 2 433 0.244 
2 2 434 0.365 
2 2 435 1.188 
2 2 436 0.328 
2 2 437 1.257 
2 2 438 0.905 
2 2 439 2.586 
2 2 440 2.657 
2 2 441 2.425 
2 2 442 0.704 
2 2 443 2.106 
2 2 444 0.958 
2 2 445 1.533 
2 2 446 1.440 
2 2 447 1.317 
2 2 448 0.499 
2 2 449 0.618 
2 2 450 0.999 
2 2 451 0.308 
2 2 452 1.000 
2 2 453 1.653 
2 2 454 0.184 
2 2 455 0.071 
2 2 456 0.310 
2 2 457 0.942 
2 2 458 0.953 
2 2 459 0.450 
2 2 460 3.533 
2 2 461 2.270 
2 2 462 1.433 
2 2 463 1.475 
2 2 464 1.192 
2 2 465 1.447 
2 2 466 2.977 
2 2 467 0.385 
2 2 468 1.002 
2 2 469 1.000 
2 2 470 2.237 
2 2 471 1.060 
2 2 472 1.595 
2 2 473 0.264 
2 2 474 1.109 
2 2 475 0.179 
2 2 476 0.000 
2 2 477 1.663 
2 2 478 1.236 
2 2 479 0.951 
2 2 480 1.512 
2 2 481 1.137 
2 2 482 1.841 
2 2 483 1.602 
2 2 484 1.459 
2 2 485 2.199 
2 2 486 1.430 
2 2 487 0.992 
2 2 488 11.031 
2 2 489 1.384 
2 2 490 1.212 
2 2 491 4.110 
2 2 492 0.000 
2 2 493 0.000 
2 2 494 0.969 
2 2 495 0.820 
2 2 496 1.122 
2 2 497 0.914 
2 2 498 3.142 
2 2 499 2.120 
2 2 500 1.550 
2 2 501 0.987 
2 2 502 1.059 
2 2 503 1.367 
2 2 504 1.000 
2 2 505 1.596 
2 2 506 1.400 
2 2 507 0.618 
2 2 508 0.000 
2 2 509 0.000 
2 2 510 0.000 
2 2 511 2.563 
2 2 512 1.674 
2 2 513 2.483 
2 2 514 2.189 
2 2 515 1.764 
2 2 516 1.684 
2 2 517 1.634 
2 2 518 2.346 
2 2 519 1.410 
2 2 520 0.960 
2 2 521 0.394 
2 2 522 2.000 
2 2 523 0.919 
2 2 524 0.000 
2 2 525 0.000 
2 2 526 0.000 
2 2 527 0.000 
2 2 528 2.026 
2 2 529 1.534 
2 2 530 1.691 
2 2 531 2.403 
2 2 532 1.834 
2 2 533 2.157 
2 2 534 2.730 
2 2 535 1.000 
2 2 536 1.887 
2 2 537 0.416 
2 2 538 0.664 
2 2 539 0.484 
2 2 540 0.000 
2 2 541 0.000 
2 2 542 0.000 
2 2 543 0.000 
2 2 544 0.000 
2 2 545 1.242 
2 2 546 2.506 
2 2 547 5.032 
2 2 548 3.751 
2 2 549 3.231 
2 2 550 3.850 
2 2 551 6.268 
2 2 552 1.592 
2 2 553 0.501 
2 2 554 0.698 
2 2 555 0.438 
2 2 556 0.000 
2 2 557 0.000 
2 2 558 0.000 
2 2 559 0.000 
2 2 560 0.000 
2 2 561 0.000 
2 2 562 0.947 
2 2 563 0.352 
2 2 564 1.137 
2 2 565 1.163 
2 2 566 1.337 
2 2 567 0.806 
2 2 568 1.436 
2 2 569 1.119 
2 2 570 1.401 
2 2 571 0.479 
2 2 572 0.000 
2 2 573 0.000 
2 2 574 0.000 
2 2 575 0.000 
2 2 576 0.000 
2 2 577 0.000 
2 2 578 0.000 
2 3 1 0.782 
2 3 2 3.689 
2 3 3 2.071 
2 3 4 0.971 
2 3 5 0.626 
2 3 6 0.918 
2 3 7 1.429 
2 3 8 1.405 
2 3 9 1.513 
2 3 10 1.165 
2 3 11 1.846 
2 3 12 1.158 
2 3 13 2.191 
2 3 14 1.650 
2 3 15 1.177 
2 3 16 1.370 
2 3 17 0.998 
2 3 18 1.185 
2 3 19 4.045 
2 3 20 1.105 
2 3 21 0.884 
2 3 22 1.698 
2 3 23 1.071 
2 3 24 1.688 
2 3 25 0.751 
2 3 26 0.909 
2 3 27 0.948 
2 3 28 1.171 
2 3 29 1.428 
2 3 30 0.937 
2 3 31 1.231 
2 3 32 1.511 
2 3 33 1.151 
2 3 34 1.299 
2 3 35 1.830 
2 3 36 1.508 
2 3 37 0.757 
2 3 38 0.978 
2 3 39 0.841 
2 3 40 1.416 
2 3 41 1.310 
2 3 42 0.979 
2 3 43 1.810 
2 3 44 1.173 
2 3 45 0.731 
2 3 46 1.193 
2 3 47 1.112 
2 3 48 1.822 
2 3 49 1.011 
2 3 50 0.845 
2 3 51 1.089 
2 3 52 0.480 
2 3 53 11.814 
2 3 54 1.307 
2 3 55 1.096 
2 3 56 1.089 
2 3 57 1.050 
2 3 58 1.073 
2 3 59 0.820 
2 3 60 1.441 
2 3 61 0.857 
2 3 62 0.443 
2 3 63 0.776 
2 3 64 0.363 
2 3 65 0.431 
2 3 66 1.507 
2 3 67 1.244 
2 3 68 1.379 
2 3 69 0.734 
2 3 70 1.341 
2 3 71 1.099 
2 3 72 1.553 
2 3 73 0.523 
2 3 74 1.112 
2 3 75 1.109 
2 3 76 1.851 
2 3 77 1.354 
2 3 78 1.019 
2 3 79 1.231 
2 3 80 5.000 
2 3 81 1.128 
2 3 82 0.595 
2 3 83 0.617 
2 3 84 0.767 
2 3 85 0.000 
2 3 86 0.000 
2 3 87 0.000 
2 3 88 0.000 
2 3 89 0.000 
2 3 90 5.000 
2 3 91 1.808 
2 3 92 2.634 
2 3 93 2.071 
2 3 94 0.831 
2 3 95 1.744 
2 3 96 0.812 
2 3 97 0.000 
2 3 98 0.000 
2 3 99 0.000 
2 3 100 0.000 
2 3 101 0.000 
2 3 102 0.908 
2 3 103 1.243 
2 3 104 0.580 
2 3 105 1.482 
2 3 106 1.494 
2 3 107 0.766 
2 3 108 0.878 
2 3 109 0.000 
2 3 110 0.000 
2 3 111 0.000 
2 3 112 0.000 
2 3 113 0.000 
2 3 114 0.868 
2 3 115 0.585 
2 3 116 0.500 
2 3 117 0.852 
2 3 118 1.013 
2 3 119 1.012 
2 3 120 1.000 
2 3 121 0.000 
2 3 122 0.000 
2 3 123 0.000 
2 3 124 0.000 
2 3 125 0.000 
2 3 126 0.553 
2 3 127 0.742 
2 3 128 0.599 
2 3 129 0.455 
2 3 130 0.664 
2 3 131 0.800 
2 3 132 1.331 
2 3 133 0.000 
2 3 134 0.000 
2 3 135 0.000 
2 3 136 0.000 
2 3 137 0.000 
2 3 138 0.249 
2 3 139 0.775 
2 3 140 0.845 
2 3 141 0.957 
2 3 142 0.495 
2 3 143 0.773 
2 3 144 1.220 
2 3 145 0.000 
2 3 146 0.000 
2 3 147 0.000 
2 3 148 0.000 
2 3 149 0.000 
2 3 150 1.191 
2 3 151 0.895 
2 3 152 0.955 
2 3 153 0.751 
2 3 154 0.855 
2 3 155 1.000 
2 3 156 5.042 
2 3 157 0.000 
2 3 158 0.000 
2 3 159 0.000 
2 3 160 0.000 
2 3 161 0.000 
2 3 162 0.835 
2 3 163 0.398 
2 3 164 0.618 
2 3 165 0.751 
2 3 166 0.749 
2 3 167 1.050 
2 3 168 0.847 
2 3 169 0.000 
2 3 170 0.000 
2 3 171 0.000 
2 3 172 0.000 
2 3 173 0.000 
2 3 174 0.811 
2 3 175 0.668 
2 3 176 0.466 
2 3 177 1.116 
2 3 178 0.632 
2 3 179 1.000 
2 3 180 1.875 
2 3 181 0.000 
2 3 182 0.000 
2 3 183 0.000 
2 3 184 0.000 
2 3 185 0.000 
2 3 186 0.416 
2 3 187 0.758 
2 3 188 0.896 
2 3 189 1.067 
2 3 190 1.423 
2 3 191 0.667 
2 3 192 2.241 
2 3 193 0.000 
2 3 194 0.000 
2 3 195 0.000 
2 3 196 0.000 
2 3 197 0.000 
2 3 198 1.000 
2 3 199 1.168 
2 3 200 1.157 
2 3 201 1.310 
2 3 202 1.637 
2 3 203 3.932 
2 3 204 0.907 
2 3 205 1.435 
2 3 206 0.950 
2 3 207 2.075 
2 3 208 2.579 
2 3 209 1.000 
2 3 210 1.000 
2 3 211 2.022 
2 3 212 2.428 
2 3 213 1.077 
2 3 214 1.857 
2 3 215 1.353 
2 3 216 2.113 
2 3 217 0.853 
2 3 218 0.936 
2 3 219 0.673 
2 3 220 2.429 
2 3 221 1.081 
2 3 222 0.784 
2 3 223 1.399 
2 3 224 1.228 
2 3 225 1.601 
2 3 226 1.716 
2 3 227 1.813 
2 3 228 2.075 
2 3 229 1.269 
2 3 230 0.286 
2 3 231 2.213 
2 3 232 1.000 
2 3 233 3.473 
2 3 234 1.386 
2 3 235 1.382 
2 3 236 1.551 
2 3 237 2.162 
2 3 238 1.997 
2 3 239 1.457 
2 3 240 1.031 
2 3 241 3.403 
2 3 242 1.137 
2 3 243 2.639 
2 3 244 1.651 
2 3 245 1.264 
2 3 246 0.590 
2 3 247 1.615 
2 3 248 1.210 
2 3 249 1.373 
2 3 250 1.193 
2 3 251 1.362 
2 3 252 1.790 
2 3 253 1.447 
2 3 254 2.045 
2 3 255 0.486 
2 3 256 0.633 
2 3 257 1.081 
2 3 258 1.261 
2 3 259 2.041 
2 3 260 1.100 
2 3 261 1.193 
2 3 262 1.695 
2 3 263 1.764 
2 3 264 1.229 
2 3 265 1.596 
2 3 266 1.369 
2 3 267 1.103 
2 3 268 1.085 
2 3 269 1.447 
2 3 270 1.468 
2 3 271 1.324 
2 3 272 0.887 
2 3 273 1.383 
2 3 274 1.819 
2 3 275 1.130 
2 3 276 1.429 
2 3 277 0.617 
2 3 278 1.158 
2 3 279 0.853 
2 3 280 1.946 
2 3 281 2.245 
2 3 282 1.635 
2 3 283 0.587 
2 3 284 1.515 
2 3 285 0.430 
2 3 286 0.479 
2 3 287 10.547 
2 3 288 0.591 
2 4 1 1.393 
2 4 2 1.271 
2 4 3 1.065 
2 4 4 0.749 
2 4 5 1.853 
2 4 6 0.661 
2 4 7 1.000 
2 4 8 1.316 
2 4 9 0.881 
2 4 10 0.437 
2 4 11 2.267 
2 4 12 0.117 
2 4 13 1.294 
2 4 14 0.897 
2 4 15 0.651 
2 4 16 0.837 
2 4 17 1.197 
2 4 18 0.929 
2 4 19 0.268 
2 4 20 1.239 
2 4 21 1.682 
2 4 22 1.361 
2 4 23 0.632 
2 4 24 0.348 
2 4 25 1.612 
2 4 26 0.800 
2 4 27 0.944 
2 4 28 1.356 
2 4 29 2.987 
2 4 30 0.671 
2 4 31 0.826 
2 4 32 1.622 
2 4 33 0.879 
2 4 34 1.345 
2 4 35 1.518 
2 4 36 0.889 
2 4 37 1.530 
2 4 38 0.764 
2 4 39 25.466 
2 4 40 1.224 
2 4 41 3.313 
2 4 42 1.876 
2 4 43 1.188 
2 4 44 1.147 
2 4 45 1.715 
2 4 46 1.546 
2 4 47 1.435 
2 4 48 2.203 
2 4 49 1.493 
2 4 50 0.850 
2 4 51 1.167 
2 4 52 1.055 
2 4 53 1.381 
2 4 54 1.451 
2 4 55 2.067 
2 4 56 1.199 
2 4 57 1.460 
2 4 58 1.000 
2 4 59 1.319 
2 4 60 1.867 
2 4 61 0.871 
2 4 62 0.815 
2 4 63 1.002 
2 4 64 0.535 
2 4 65 0.772 
2 4 66 0.729 
2 4 67 1.571 
2 4 68 1.846 
2 4 69 2.024 
2 4 70 1.913 
2 4 71 2.253 
2 4 72 2.537 
2 4 73 1.156 
2 4 74 1.274 
2 4 75 1.167 
2 4 76 1.521 
2 4 77 0.606 
2 4 78 1.070 
2 4 79 0.914 
2 4 80 1.975 
2 4 81 1.272 
2 4 82 1.568 
2 4 83 0.735 
2 4 84 1.483 
2 4 85 0.000 
2 4 86 0.000 
2 4 87 0.000 
2 4 88 0.000 
2 4 89 0.000 
2 4 90 0.925 
2 4 91 1.098 
2 4 92 3.880 
2 4 93 1.545 
2 4 94 1.374 
2 4 95 1.991 
2 4 96 1.460 
2 4 97 0.000 
2 4 98 0.000 
2 4 99 0.000 
2 4 100 0.000 
2 4 101 0.000 
2 4 102 0.979 
2 4 103 0.974 
2 4 104 1.139 
2 4 105 1.118 
2 4 106 1.204 
2 4 107 1.158 
2 4 108 0.985 
2 4 109 0.000 
2 4 110 0.000 
2 4 111 0.000 
2 4 112 0.000 
2 4 113 0.000 
2 4 114 0.548 
2 4 115 0.592 
2 4 116 2.318 
2 4 117 1.066 
2 4 118 0.718 
2 4 119 0.880 
2 4 120 0.927 
2 4 121 0.000 
2 4 122 0.000 
2 4 123 0.000 
2 4 124 0.000 
2 4 125 0.000 
2 4 126 0.922 
2 4 127 0.873 
2 4 128 0.965 
2 4 129 0.905 
2 4 130 1.004 
2 4 131 1.014 
2 4 132 1.403 
2 4 133 0.000 
2 4 134 0.000 
2 4 135 0.000 
2 4 136 0.000 
2 4 137 0.000 
2 4 138 0.811 
2 4 139 0.800 
2 4 140 1.103 
2 4 141 0.971 
2 4 142 1.182 
2 4 143 1.370 
2 4 144 0.828 
2 4 145 0.000 
2 4 146 0.000 
2 4 147 0.000 
2 4 148 0.000 
2 4 149 0.000 
2 4 150 1.728 
2 4 151 0.972 
2 4 152 2.087 
2 4 153 1.115 
2 4 154 1.541 
2 4 155 1.223 
2 4 156 1.231 
2 4 157 0.000 
2 4 158 0.000 
2 4 159 0.000 
2 4 160 0.000 
2 4 161 0.000 
2 4 162 0.395 
2 4 163 0.574 
2 4 164 0.945 
2 4 165 1.014 
2 4 166 0.710 
2 4 167 0.532 
2 4 168 0.602 
2 4 169 0.000 
2 4 170 0.000 
2 4 171 0.000 
2 4 172 0.000 
2 4 173 0.000 
2 4 174 0.784 
2 4 175 0.666 
2 4 176 1.311 
2 4 177 1.554 
2 4 178 0.781 
2 4 179 1.324 
2 4 180 1.632 
2 4 181 0.000 
2 4 182 0.000 
2 4 183 0.000 
2 4 184 0.000 
2 4 185 0.000 
2 4 186 1.138 
2 4 187 0.595 
2 4 188 0.613 
2 4 189 1.355 
2 4 190 1.258 
2 4 191 1.112 
2 4 192 1.505 
2 4 193 0.000 
2 4 194 0.000 
2 4 195 0.000 
2 4 196 0.000 
2 4 197 0.000 
2 4 198 1.000 
2 4 199 1.125 
2 4 200 0.925 
2 4 201 1.769 
2 4 202 1.151 
2 4 203 1.321 
2 4 204 1.407 
2 4 205 1.000 
2 4 206 2.831 
2 4 207 2.887 
2 4 208 0.500 
2 4 209 1.144 
2 4 210 1.779 
2 4 211 0.943 
2 4 212 1.309 
2 4 213 1.475 
2 4 214 1.743 
2 4 215 1.647 
2 4 216 1.342 
2 4 217 1.219 
2 4 218 0.483 
2 4 219 4.323 
2 4 220 0.820 
2 4 221 0.612 
2 4 222 0.742 
2 4 223 0.722 
2 4 224 1.530 
2 4 225 1.114 
2 4 226 1.396 
2 4 227 1.457 
2 4 228 1.235 
2 4 229 0.913 
2 4 230 0.974 
2 4 231 0.833 
2 4 232 2.600 
2 4 233 0.839 
2 4 234 1.601 
2 4 235 0.762 
2 4 236 0.806 
2 4 237 1.007 
2 4 238 1.516 
2 4 239 1.724 
2 4 240 0.857 
2 4 241 0.897 
2 4 242 0.777 
2 4 243 1.756 
2 4 244 1.334 
2 4 245 0.500 
2 4 246 2.094 
2 4 247 1.196 
2 4 248 0.946 
2 4 249 0.986 
2 4 250 1.408 
2 4 251 1.468 
2 4 252 1.306 
2 4 253 0.601 
2 4 254 0.428 
2 4 255 0.953 
2 4 256 1.081 
2 4 257 0.767 
2 4 258 1.502 
2 4 259 1.006 
2 4 260 1.639 
2 4 261 1.487 
2 4 262 1.007 
2 4 263 0.442 
2 4 264 0.677 
2 4 265 1.426 
2 4 266 1.358 
2 4 267 1.739 
2 4 268 0.976 
2 4 269 3.626 
2 4 270 1.071 
2 4 271 2.139 
2 4 272 0.983 
2 4 273 0.993 
2 4 274 0.799 
2 4 275 0.269 
2 4 276 0.481 
2 4 277 0.689 
2 4 278 1.897 
2 4 279 1.037 
2 4 280 0.943 
2 4 281 0.193 
2 4 282 0.119 
2 4 283 2.151 
2 4 284 0.498 
2 4 285 0.111 
2 4 286 0.063 
2 4 287 0.558 
2 4 288 0.600 
