1428106365 1   -1 
1428106365 2   0 
1428106365 3   0 
1428106365 4   1 
1428106365 5   0 
1428106365 6   0 
1428106365 7   -1 
1428106365 8   0 
1428106365 9   0 
1428106365 10   1 
1428106365 11   0 
1428106365 12   0 
1428106365 13   1 
1428106365 14   0 
1428106365 15   0 
1428106365 16   -1 
1428106365 17   0 
1428106365 18   0 
1428106365 19   1 
1428106365 20   0 
1428106365 21   0 
1428106365 22   -1 
1428106365 23   0 
1428106365 24   0 
1428106365 25   1 
1428106365 26   0 
1428106365 27   0 
1428106365 28   -1 
1428106365 29   0 
1428106365 30   0 
1428106365 31   1 
1428106365 32   0 
1428106365 33   0 
1428106365 34   -1 
1428106365 35   0 
1428106365 36   0 
1428106365 37   -1 
1428106365 38   0 
1428106365 39   0 
1428106365 40   1 
1428106365 41   0 
1428106365 42   0 
1428106365 43   -1 
1428106365 44   0 
1428106365 45   0 
1428106365 46   1 
1428106365 47   0 
1428106365 48   0 
1428106365 49   1 
1428106365 50   0 
1428106365 51   0 
1428106365 52   -1 
1428106365 53   0 
1428106365 54   0 
1428106365 55   1 
1428106365 56   0 
1428106365 57   0 
1428106365 58   -1 
1428106365 59   0 
1428106365 60   0 
1428106365 61   -1 
1428106365 62   0 
1428106365 63   0 
1428106365 64   1 
1428106365 65   0 
1428106365 66   0 
1428106365 67   -1 
1428106365 68   0 
1428106365 69   0 
1428106365 70   1 
1428106365 71   0 
1428106365 72   0 
1428106365 73   -1 
1428106365 74   0 
1428106365 75   0 
1428106365 76   1 
1428106365 77   0 
1428106365 78   0 
1428106365 79   -1 
1428106365 80   0 
1428106365 81   0 
1428106365 82   1 
1428106365 83   0 
1428106365 84   0 
1428106365 85   1 
1428106365 86   0 
1428106365 87   0 
1428106365 88   -1 
1428106365 89   0 
1428106365 90   0 
1428106365 91   1 
1428106365 92   0 
1428106365 93   0 
1428106365 94   -1 
1428106365 95   0 
1428106365 96   0 
1428106365 97   1 
1428106365 98   0 
1428106365 99   0 
1428106365 100   -1 
1428106365 101   0 
1428106365 102   0 
1428106365 103   1 
1428106365 104   0 
1428106365 105   0 
1428106365 106   -1 
1428106365 107   0 
1428106365 108   0 
1428106365 109   -1 
1428106365 110   0 
1428106365 111   0 
1428106365 112   1 
1428106365 113   0 
1428106365 114   0 
1428106365 115   -1 
1428106365 116   0 
1428106365 117   0 
1428106365 118   1 
1428106365 119   0 
1428106365 120   0 
1428106365 121   1 
1428106365 122   0 
1428106365 123   0 
1428106365 124   -1 
1428106365 125   0 
1428106365 126   0 
1428106365 127   1 
1428106365 128   0 
1428106365 129   0 
1428106365 130   -1 
1428106365 131   0 
1428106365 132   0 
1428106365 133   -1 
1428106365 134   0 
1428106365 135   0 
1428106365 136   1 
1428106365 137   0 
1428106365 138   0 
1428106365 139   -1 
1428106365 140   0 
1428106365 141   0 
1428106365 142   1 
1428106365 143   0 
1428106365 144   0 
1428106365 145   -1 
1428106365 146   0 
1428106365 147   0 
1428106365 148   1 
1428106365 149   0 
1428106365 150   0 
1428106365 151   -1 
1428106365 152   0 
1428106365 153   0 
1428106365 154   1 
1428106365 155   0 
1428106365 156   0 
1428106365 157   1 
1428106365 158   0 
1428106365 159   0 
1428106365 160   -1 
1428106365 161   0 
1428106365 162   0 
1428106365 163   1 
1428106365 164   0 
1428106365 165   0 
1428106365 166   -1 
1428106365 167   0 
1428106365 168   0 
1428106365 169   1 
1428106365 170   0 
1428106365 171   0 
1428106365 172   -1 
1428106365 173   0 
1428106365 174   0 
1428106365 175   1 
1428106365 176   0 
1428106365 177   0 
1428106365 178   -1 
1428106365 179   0 
1428106365 180   0 
1428106365 181   -1 
1428106365 182   0 
1428106365 183   0 
1428106365 184   1 
1428106365 185   0 
1428106365 186   0 
1428106365 187   -1 
1428106365 188   0 
1428106365 189   0 
1428106365 190   1 
1428106365 191   0 
1428106365 192   0 
1428106365 193   1 
1428106365 194   0 
1428106365 195   0 
1428106365 196   -1 
1428106365 197   0 
1428106365 198   0 
1428106365 199   1 
1428106365 200   0 
1428106365 201   0 
1428106365 202   -1 
1428106365 203   0 
1428106365 204   0 
1428106365 205   -1 
1428106365 206   0 
1428106365 207   0 
1428106365 208   1 
1428106365 209   0 
1428106365 210   0 
1428106365 211   -1 
1428106365 212   0 
1428106365 213   0 
1428106365 214   1 
1428106365 215   0 
1428106365 216   0 
1428106365 217   -1 
1428106365 218   0 
1428106365 219   0 
1428106365 220   1 
1428106365 221   0 
1428106365 222   0 
1428106365 223   -1 
1428106365 224   0 
1428106365 225   0 
1428106365 226   1 
1428106365 227   0 
1428106365 228   0 
1428106365 229   1 
1428106365 230   0 
1428106365 231   0 
1428106365 232   -1 
1428106365 233   0 
1428106365 234   0 
1428106365 235   1 
1428106365 236   0 
1428106365 237   0 
1428106365 238   -1 
1428106365 239   0 
1428106365 240   0 
1428106365 241   1 
1428106365 242   0 
1428106365 243   0 
1428106365 244   -1 
1428106365 245   0 
1428106365 246   0 
1428106365 247   1 
1428106365 248   0 
1428106365 249   0 
1428106365 250   -1 
1428106365 251   0 
1428106365 252   0 
1428106365 253   -1 
1428106365 254   0 
1428106365 255   0 
1428106365 256   1 
1428106365 257   0 
1428106365 258   0 
1428106365 259   -1 
1428106365 260   0 
1428106365 261   0 
1428106365 262   1 
1428106365 263   0 
1428106365 264   0 
1428106365 265   1 
1428106365 266   0 
1428106365 267   0 
1428106365 268   -1 
1428106365 269   0 
1428106365 270   0 
1428106365 271   1 
1428106365 272   0 
1428106365 273   0 
1428106365 274   -1 
1428106365 275   0 
1428106365 276   0 
1428106365 277   -1 
1428106365 278   0 
1428106365 279   0 
1428106365 280   1 
1428106365 281   0 
1428106365 282   0 
1428106365 283   -1 
1428106365 284   0 
1428106365 285   0 
1428106365 286   1 
1428106365 287   0 
1428106365 288   0 
1428106365 289   -1 
1428106365 290   0 
1428106365 291   0 
1428106365 292   1 
1428106365 293   0 
1428106365 294   0 
1428106365 295   -1 
1428106365 296   0 
1428106365 297   0 
1428106365 298   1 
1428106365 299   0 
1428106365 300   0 
1428106365 301   1 
1428106365 302   0 
1428106365 303   0 
1428106365 304   -1 
1428106365 305   0 
1428106365 306   0 
1428106365 307   1 
1428106365 308   0 
1428106365 309   0 
1428106365 310   -1 
1428106365 311   0 
1428106365 312   0 
1428106365 313   1 
1428106365 314   0 
1428106365 315   0 
1428106365 316   -1 
1428106365 317   0 
1428106365 318   0 
1428106365 319   1 
1428106365 320   0 
1428106365 321   0 
1428106365 322   -1 
1428106365 323   0 
1428106365 324   0 
1428106365 325   -1 
1428106365 326   0 
1428106365 327   0 
1428106365 328   1 
1428106365 329   0 
1428106365 330   0 
1428106365 331   -1 
1428106365 332   0 
1428106365 333   0 
1428106365 334   0 
1428106365 335   0 
1428106365 336   0 
1428106365 337   0 
1428106365 338   0 
1428106365 339   0 
1428106365 340   0 
1428106365 341   0 
1428106365 342   0 
1428106365 343   0 
1428106365 344   0 
1428106365 345   0 
1428106365 346   0 
1428106365 347   0 
1428106365 348   0 
1428106365 349   0 
1428106365 350   0 
1428106365 351   0 
1428106365 352   0 
1428106365 353   0 
1428106365 354   0 
1428106365 355   0 
1428106365 356   0 
1428106365 357   0 
1428106365 358   0 
1428106365 359   0 
1428106365 360   0 
