1423543665 1   1 
1423543665 2   0 
1423543665 3   0 
1423543665 4   -1 
1423543665 5   0 
1423543665 6   0 
1423543665 7   1 
1423543665 8   0 
1423543665 9   0 
1423543665 10   -1 
1423543665 11   0 
1423543665 12   0 
1423543665 13   -1 
1423543665 14   0 
1423543665 15   0 
1423543665 16   1 
1423543665 17   0 
1423543665 18   0 
1423543665 19   -1 
1423543665 20   0 
1423543665 21   0 
1423543665 22   1 
1423543665 23   0 
1423543665 24   0 
1423543665 25   -1 
1423543665 26   0 
1423543665 27   0 
1423543665 28   1 
1423543665 29   0 
1423543665 30   0 
1423543665 31   -1 
1423543665 32   0 
1423543665 33   0 
1423543665 34   1 
1423543665 35   0 
1423543665 36   0 
1423543665 37   1 
1423543665 38   0 
1423543665 39   0 
1423543665 40   -1 
1423543665 41   0 
1423543665 42   0 
1423543665 43   1 
1423543665 44   0 
1423543665 45   0 
1423543665 46   -1 
1423543665 47   0 
1423543665 48   0 
1423543665 49   -1 
1423543665 50   0 
1423543665 51   0 
1423543665 52   1 
1423543665 53   0 
1423543665 54   0 
1423543665 55   -1 
1423543665 56   0 
1423543665 57   0 
1423543665 58   1 
1423543665 59   0 
1423543665 60   0 
1423543665 61   1 
1423543665 62   0 
1423543665 63   0 
1423543665 64   -1 
1423543665 65   0 
1423543665 66   0 
1423543665 67   1 
1423543665 68   0 
1423543665 69   0 
1423543665 70   -1 
1423543665 71   0 
1423543665 72   0 
1423543665 73   1 
1423543665 74   0 
1423543665 75   0 
1423543665 76   -1 
1423543665 77   0 
1423543665 78   0 
1423543665 79   1 
1423543665 80   0 
1423543665 81   0 
1423543665 82   -1 
1423543665 83   0 
1423543665 84   0 
1423543665 85   -1 
1423543665 86   0 
1423543665 87   0 
1423543665 88   1 
1423543665 89   0 
1423543665 90   0 
1423543665 91   -1 
1423543665 92   0 
1423543665 93   0 
1423543665 94   1 
1423543665 95   0 
1423543665 96   0 
1423543665 97   -1 
1423543665 98   0 
1423543665 99   0 
1423543665 100   1 
1423543665 101   0 
1423543665 102   0 
1423543665 103   -1 
1423543665 104   0 
1423543665 105   0 
1423543665 106   1 
1423543665 107   0 
1423543665 108   0 
1423543665 109   1 
1423543665 110   0 
1423543665 111   0 
1423543665 112   -1 
1423543665 113   0 
1423543665 114   0 
1423543665 115   1 
1423543665 116   0 
1423543665 117   0 
1423543665 118   -1 
1423543665 119   0 
1423543665 120   0 
1423543665 121   -1 
1423543665 122   0 
1423543665 123   0 
1423543665 124   1 
1423543665 125   0 
1423543665 126   0 
1423543665 127   -1 
1423543665 128   0 
1423543665 129   0 
1423543665 130   1 
1423543665 131   0 
1423543665 132   0 
1423543665 133   1 
1423543665 134   0 
1423543665 135   0 
1423543665 136   -1 
1423543665 137   0 
1423543665 138   0 
1423543665 139   1 
1423543665 140   0 
1423543665 141   0 
1423543665 142   -1 
1423543665 143   0 
1423543665 144   0 
1423543665 145   1 
1423543665 146   0 
1423543665 147   0 
1423543665 148   -1 
1423543665 149   0 
1423543665 150   0 
1423543665 151   1 
1423543665 152   0 
1423543665 153   0 
1423543665 154   -1 
1423543665 155   0 
1423543665 156   0 
1423543665 157   -1 
1423543665 158   0 
1423543665 159   0 
1423543665 160   1 
1423543665 161   0 
1423543665 162   0 
1423543665 163   -1 
1423543665 164   0 
1423543665 165   0 
1423543665 166   1 
1423543665 167   0 
1423543665 168   0 
1423543665 169   -1 
1423543665 170   0 
1423543665 171   0 
1423543665 172   1 
1423543665 173   0 
1423543665 174   0 
1423543665 175   -1 
1423543665 176   0 
1423543665 177   0 
1423543665 178   1 
1423543665 179   0 
1423543665 180   0 
1423543665 181   1 
1423543665 182   0 
1423543665 183   0 
1423543665 184   -1 
1423543665 185   0 
1423543665 186   0 
1423543665 187   1 
1423543665 188   0 
1423543665 189   0 
1423543665 190   -1 
1423543665 191   0 
1423543665 192   0 
1423543665 193   -1 
1423543665 194   0 
1423543665 195   0 
1423543665 196   1 
1423543665 197   0 
1423543665 198   0 
1423543665 199   -1 
1423543665 200   0 
1423543665 201   0 
1423543665 202   1 
1423543665 203   0 
1423543665 204   0 
1423543665 205   1 
1423543665 206   0 
1423543665 207   0 
1423543665 208   -1 
1423543665 209   0 
1423543665 210   0 
1423543665 211   1 
1423543665 212   0 
1423543665 213   0 
1423543665 214   -1 
1423543665 215   0 
1423543665 216   0 
1423543665 217   1 
1423543665 218   0 
1423543665 219   0 
1423543665 220   -1 
1423543665 221   0 
1423543665 222   0 
1423543665 223   1 
1423543665 224   0 
1423543665 225   0 
1423543665 226   -1 
1423543665 227   0 
1423543665 228   0 
1423543665 229   -1 
1423543665 230   0 
1423543665 231   0 
1423543665 232   1 
1423543665 233   0 
1423543665 234   0 
1423543665 235   -1 
1423543665 236   0 
1423543665 237   0 
1423543665 238   1 
1423543665 239   0 
1423543665 240   0 
1423543665 241   -1 
1423543665 242   0 
1423543665 243   0 
1423543665 244   1 
1423543665 245   0 
1423543665 246   0 
1423543665 247   -1 
1423543665 248   0 
1423543665 249   0 
1423543665 250   1 
1423543665 251   0 
1423543665 252   0 
1423543665 253   1 
1423543665 254   0 
1423543665 255   0 
1423543665 256   -1 
1423543665 257   0 
1423543665 258   0 
1423543665 259   1 
1423543665 260   0 
1423543665 261   0 
1423543665 262   -1 
1423543665 263   0 
1423543665 264   0 
1423543665 265   -1 
1423543665 266   0 
1423543665 267   0 
1423543665 268   1 
1423543665 269   0 
1423543665 270   0 
1423543665 271   -1 
1423543665 272   0 
1423543665 273   0 
1423543665 274   1 
1423543665 275   0 
1423543665 276   0 
1423543665 277   1 
1423543665 278   0 
1423543665 279   0 
1423543665 280   -1 
1423543665 281   0 
1423543665 282   0 
1423543665 283   1 
1423543665 284   0 
1423543665 285   0 
1423543665 286   -1 
1423543665 287   0 
1423543665 288   0 
1423543665 289   1 
1423543665 290   0 
1423543665 291   0 
1423543665 292   -1 
1423543665 293   0 
1423543665 294   0 
1423543665 295   1 
1423543665 296   0 
1423543665 297   0 
1423543665 298   -1 
1423543665 299   0 
1423543665 300   0 
1423543665 301   -1 
1423543665 302   0 
1423543665 303   0 
1423543665 304   1 
1423543665 305   0 
1423543665 306   0 
1423543665 307   -1 
1423543665 308   0 
1423543665 309   0 
1423543665 310   1 
1423543665 311   0 
1423543665 312   0 
1423543665 313   -1 
1423543665 314   0 
1423543665 315   0 
1423543665 316   1 
1423543665 317   0 
1423543665 318   0 
1423543665 319   -1 
1423543665 320   0 
1423543665 321   0 
1423543665 322   1 
1423543665 323   0 
1423543665 324   0 
1423543665 325   1 
1423543665 326   0 
1423543665 327   0 
1423543665 328   -1 
1423543665 329   0 
1423543665 330   0 
1423543665 331   1 
1423543665 332   0 
1423543665 333   0 
1423543665 334   0 
1423543665 335   0 
1423543665 336   0 
1423543665 337   0 
1423543665 338   0 
1423543665 339   0 
1423543665 340   0 
1423543665 341   0 
1423543665 342   0 
1423543665 343   0 
1423543665 344   0 
1423543665 345   0 
1423543665 346   0 
1423543665 347   0 
1423543665 348   0 
1423543665 349   0 
1423543665 350   0 
1423543665 351   0 
1423543665 352   0 
1423543665 353   0 
1423543665 354   0 
1423543665 355   0 
1423543665 356   0 
1423543665 357   0 
1423543665 358   0 
1423543665 359   0 
1423543665 360   0 
