1430889545 1   1 
1430889545 2   0 
1430889545 3   0 
1430889545 4   -1 
1430889545 5   0 
1430889545 6   0 
1430889545 7   1 
1430889545 8   0 
1430889545 9   0 
1430889545 10   -1 
1430889545 11   0 
1430889545 12   0 
1430889545 13   1 
1430889545 14   0 
1430889545 15   0 
1430889545 16   -1 
1430889545 17   0 
1430889545 18   0 
1430889545 19   1 
1430889545 20   0 
1430889545 21   0 
1430889545 22   -1 
1430889545 23   0 
1430889545 24   0 
1430889545 25   1 
1430889545 26   0 
1430889545 27   0 
1430889545 28   -1 
1430889545 29   0 
1430889545 30   0 
1430889545 31   1 
1430889545 32   0 
1430889545 33   0 
1430889545 34   -1 
1430889545 35   0 
1430889545 36   0 
1430889545 37   0 
1430889545 38   0 
1430889545 39   0 
1430889545 40   0 
1430889545 41   0 
1430889545 42   0 
1430889545 43   0 
1430889545 44   0 
1430889545 45   0 
1430889545 46   0 
1430889545 47   0 
1430889545 48   0 
1430889545 49   0 
1430889545 50   0 
1430889545 51   0 
1430889545 52   0 
1430889545 53   0 
1430889545 54   0 
1430889545 55   0 
1430889545 56   0 
1430889545 57   0 
1430889545 58   0 
1430889545 59   0 
1430889545 60   0 
1430889545 61   0 
1430889545 62   0 
1430889545 63   0 
1430889545 64   0 
1430889545 65   0 
1430889545 66   0 
1430889545 67   0 
1430889545 68   0 
1430889545 69   0 
1430889545 70   0 
1430889545 71   0 
1430889545 72   0 
1430889545 73   0 
1430889545 74   0 
1430889545 75   0 
1430889545 76   0 
1430889545 77   0 
1430889545 78   0 
1430889545 79   0 
1430889545 80   0 
1430889545 81   0 
1430889545 82   0 
1430889545 83   0 
1430889545 84   0 
1430889545 85   0 
1430889545 86   0 
1430889545 87   0 
1430889545 88   0 
1430889545 89   0 
1430889545 90   0 
1430889545 91   0 
1430889545 92   0 
1430889545 93   0 
1430889545 94   0 
1430889545 95   0 
1430889545 96   0 
1430889545 97   0 
1430889545 98   0 
1430889545 99   0 
1430889545 100   0 
1430889545 101   0 
1430889545 102   0 
1430889545 103   0 
1430889545 104   0 
1430889545 105   0 
1430889545 106   0 
1430889545 107   0 
1430889545 108   0 
1430889545 109   0 
1430889545 110   0 
1430889545 111   0 
1430889545 112   0 
1430889545 113   0 
1430889545 114   0 
1430889545 115   0 
1430889545 116   0 
1430889545 117   0 
1430889545 118   0 
1430889545 119   0 
1430889545 120   0 
1430889545 121   0 
1430889545 122   0 
1430889545 123   0 
1430889545 124   0 
1430889545 125   0 
1430889545 126   0 
1430889545 127   0 
1430889545 128   0 
1430889545 129   0 
1430889545 130   0 
1430889545 131   0 
1430889545 132   0 
1430889545 133   0 
1430889545 134   0 
1430889545 135   0 
1430889545 136   0 
1430889545 137   0 
1430889545 138   0 
1430889545 139   0 
1430889545 140   0 
1430889545 141   0 
1430889545 142   0 
1430889545 143   0 
1430889545 144   0 
1430889545 145   0 
1430889545 146   0 
1430889545 147   0 
1430889545 148   0 
1430889545 149   0 
1430889545 150   0 
1430889545 151   0 
1430889545 152   0 
1430889545 153   0 
1430889545 154   0 
1430889545 155   0 
1430889545 156   0 
1430889545 157   0 
1430889545 158   0 
1430889545 159   0 
1430889545 160   0 
1430889545 161   0 
1430889545 162   0 
1430889545 163   0 
1430889545 164   0 
1430889545 165   0 
1430889545 166   0 
1430889545 167   0 
1430889545 168   0 
1430889545 169   0 
1430889545 170   0 
1430889545 171   0 
1430889545 172   0 
1430889545 173   0 
1430889545 174   0 
1430889545 175   0 
1430889545 176   0 
1430889545 177   0 
1430889545 178   0 
1430889545 179   0 
1430889545 180   0 
1430889545 181   0 
1430889545 182   0 
1430889545 183   0 
1430889545 184   0 
1430889545 185   0 
1430889545 186   0 
1430889545 187   0 
1430889545 188   0 
1430889545 189   0 
1430889545 190   0 
1430889545 191   0 
1430889545 192   0 
1430889545 193   0 
1430889545 194   0 
1430889545 195   0 
1430889545 196   0 
1430889545 197   0 
1430889545 198   0 
1430889545 199   0 
1430889545 200   0 
1430889545 201   0 
1430889545 202   0 
1430889545 203   0 
1430889545 204   0 
1430889545 205   0 
1430889545 206   0 
1430889545 207   0 
1430889545 208   0 
1430889545 209   0 
1430889545 210   0 
1430889545 211   0 
1430889545 212   0 
1430889545 213   0 
1430889545 214   0 
1430889545 215   0 
1430889545 216   0 
1430889545 217   0 
1430889545 218   0 
1430889545 219   0 
1430889545 220   0 
1430889545 221   0 
1430889545 222   0 
1430889545 223   0 
1430889545 224   0 
1430889545 225   0 
1430889545 226   0 
1430889545 227   0 
1430889545 228   0 
1430889545 229   0 
1430889545 230   0 
1430889545 231   0 
1430889545 232   0 
1430889545 233   0 
1430889545 234   0 
1430889545 235   0 
1430889545 236   0 
1430889545 237   0 
1430889545 238   0 
1430889545 239   0 
1430889545 240   0 
1430889545 241   0 
1430889545 242   0 
1430889545 243   0 
1430889545 244   0 
1430889545 245   0 
1430889545 246   0 
1430889545 247   0 
1430889545 248   0 
1430889545 249   0 
1430889545 250   0 
1430889545 251   0 
1430889545 252   0 
1430889545 253   0 
1430889545 254   0 
1430889545 255   0 
1430889545 256   0 
1430889545 257   0 
1430889545 258   0 
1430889545 259   0 
1430889545 260   0 
1430889545 261   0 
1430889545 262   0 
1430889545 263   0 
1430889545 264   0 
1430889545 265   0 
1430889545 266   0 
1430889545 267   0 
1430889545 268   0 
1430889545 269   0 
1430889545 270   0 
1430889545 271   0 
1430889545 272   0 
1430889545 273   0 
1430889545 274   0 
1430889545 275   0 
1430889545 276   0 
1430889545 277   0 
1430889545 278   0 
1430889545 279   0 
1430889545 280   0 
1430889545 281   0 
1430889545 282   0 
1430889545 283   0 
1430889545 284   0 
1430889545 285   0 
1430889545 286   0 
1430889545 287   0 
1430889545 288   0 
1430889545 289   0 
1430889545 290   0 
1430889545 291   0 
1430889545 292   0 
1430889545 293   0 
1430889545 294   0 
1430889545 295   0 
1430889545 296   0 
1430889545 297   0 
1430889545 298   0 
1430889545 299   0 
1430889545 300   0 
1430889545 301   0 
1430889545 302   0 
1430889545 303   0 
1430889545 304   0 
1430889545 305   0 
1430889545 306   0 
1430889545 307   0 
1430889545 308   0 
1430889545 309   0 
1430889545 310   0 
1430889545 311   0 
1430889545 312   0 
1430889545 313   0 
1430889545 314   0 
1430889545 315   0 
1430889545 316   0 
1430889545 317   0 
1430889545 318   0 
1430889545 319   0 
1430889545 320   0 
1430889545 321   0 
1430889545 322   0 
1430889545 323   0 
1430889545 324   0 
1430889545 325   0 
1430889545 326   0 
1430889545 327   0 
1430889545 328   0 
1430889545 329   0 
1430889545 330   0 
1430889545 331   0 
1430889545 332   0 
1430889545 333   0 
1430889545 334   0 
1430889545 335   0 
1430889545 336   0 
1430889545 337   0 
1430889545 338   0 
1430889545 339   0 
1430889545 340   0 
1430889545 341   0 
1430889545 342   0 
1430889545 343   0 
1430889545 344   0 
1430889545 345   0 
1430889545 346   0 
1430889545 347   0 
1430889545 348   0 
1430889545 349   0 
1430889545 350   0 
1430889545 351   0 
1430889545 352   0 
1430889545 353   0 
1430889545 354   0 
1430889545 355   0 
1430889545 356   0 
1430889545 357   0 
1430889545 358   0 
1430889545 359   0 
1430889545 360   0 
