1424485136 1   1 
1424485136 2   0 
1424485136 3   0 
1424485136 4   1 
1424485136 5   0 
1424485136 6   0 
1424485136 7   -1 
1424485136 8   0 
1424485136 9   0 
1424485136 10   -1 
1424485136 11   0 
1424485136 12   0 
1424485136 13   1 
1424485136 14   0 
1424485136 15   0 
1424485136 16   1 
1424485136 17   0 
1424485136 18   0 
1424485136 19   -1 
1424485136 20   0 
1424485136 21   0 
1424485136 22   -1 
1424485136 23   0 
1424485136 24   0 
1424485136 25   1 
1424485136 26   0 
1424485136 27   0 
1424485136 28   1 
1424485136 29   0 
1424485136 30   0 
1424485136 31   -1 
1424485136 32   0 
1424485136 33   0 
1424485136 34   -1 
1424485136 35   0 
1424485136 36   0 
1424485136 37   1 
1424485136 38   0 
1424485136 39   0 
1424485136 40   1 
1424485136 41   0 
1424485136 42   0 
1424485136 43   -1 
1424485136 44   0 
1424485136 45   0 
1424485136 46   -1 
1424485136 47   0 
1424485136 48   0 
1424485136 49   1 
1424485136 50   0 
1424485136 51   0 
1424485136 52   1 
1424485136 53   0 
1424485136 54   0 
1424485136 55   -1 
1424485136 56   0 
1424485136 57   0 
1424485136 58   -1 
1424485136 59   0 
1424485136 60   0 
1424485136 61   1 
1424485136 62   0 
1424485136 63   0 
1424485136 64   1 
1424485136 65   0 
1424485136 66   0 
1424485136 67   -1 
1424485136 68   0 
1424485136 69   0 
1424485136 70   -1 
1424485136 71   0 
1424485136 72   0 
1424485136 73   1 
1424485136 74   0 
1424485136 75   0 
1424485136 76   1 
1424485136 77   0 
1424485136 78   0 
1424485136 79   -1 
1424485136 80   0 
1424485136 81   0 
1424485136 82   -1 
1424485136 83   0 
1424485136 84   0 
1424485136 85   1 
1424485136 86   0 
1424485136 87   0 
1424485136 88   1 
1424485136 89   0 
1424485136 90   0 
1424485136 91   -1 
1424485136 92   0 
1424485136 93   0 
1424485136 94   -1 
1424485136 95   0 
1424485136 96   0 
1424485136 97   1 
1424485136 98   0 
1424485136 99   0 
1424485136 100   1 
1424485136 101   0 
1424485136 102   0 
1424485136 103   -1 
1424485136 104   0 
1424485136 105   0 
1424485136 106   -1 
1424485136 107   0 
1424485136 108   0 
1424485136 109   1 
1424485136 110   0 
1424485136 111   0 
1424485136 112   1 
1424485136 113   0 
1424485136 114   0 
1424485136 115   -1 
1424485136 116   0 
1424485136 117   0 
1424485136 118   -1 
1424485136 119   0 
1424485136 120   0 
1424485136 121   1 
1424485136 122   0 
1424485136 123   0 
1424485136 124   1 
1424485136 125   0 
1424485136 126   0 
1424485136 127   -1 
1424485136 128   0 
1424485136 129   0 
1424485136 130   -1 
1424485136 131   0 
1424485136 132   0 
1424485136 133   1 
1424485136 134   0 
1424485136 135   0 
1424485136 136   1 
1424485136 137   0 
1424485136 138   0 
1424485136 139   -1 
1424485136 140   0 
1424485136 141   0 
1424485136 142   -1 
1424485136 143   0 
1424485136 144   0 
1424485136 145   1 
1424485136 146   0 
1424485136 147   0 
1424485136 148   1 
1424485136 149   0 
1424485136 150   0 
1424485136 151   -1 
1424485136 152   0 
1424485136 153   0 
1424485136 154   -1 
1424485136 155   0 
1424485136 156   0 
1424485136 157   1 
1424485136 158   0 
1424485136 159   0 
1424485136 160   1 
1424485136 161   0 
1424485136 162   0 
1424485136 163   -1 
1424485136 164   0 
1424485136 165   0 
1424485136 166   -1 
1424485136 167   0 
1424485136 168   0 
1424485136 169   1 
1424485136 170   0 
1424485136 171   0 
1424485136 172   1 
1424485136 173   0 
1424485136 174   0 
1424485136 175   -1 
1424485136 176   0 
1424485136 177   0 
1424485136 178   -1 
1424485136 179   0 
1424485136 180   0 
1424485136 181   1 
1424485136 182   0 
1424485136 183   0 
1424485136 184   1 
1424485136 185   0 
1424485136 186   0 
1424485136 187   -1 
1424485136 188   0 
1424485136 189   0 
1424485136 190   -1 
1424485136 191   0 
1424485136 192   0 
1424485136 193   1 
1424485136 194   0 
1424485136 195   0 
1424485136 196   1 
1424485136 197   0 
1424485136 198   0 
1424485136 199   -1 
1424485136 200   0 
1424485136 201   0 
1424485136 202   -1 
1424485136 203   0 
1424485136 204   0 
1424485136 205   1 
1424485136 206   0 
1424485136 207   0 
1424485136 208   1 
1424485136 209   0 
1424485136 210   0 
1424485136 211   -1 
1424485136 212   0 
1424485136 213   0 
1424485136 214   -1 
1424485136 215   0 
1424485136 216   0 
1424485136 217   1 
1424485136 218   0 
1424485136 219   0 
1424485136 220   1 
1424485136 221   0 
1424485136 222   0 
1424485136 223   -1 
1424485136 224   0 
1424485136 225   0 
1424485136 226   -1 
1424485136 227   0 
1424485136 228   0 
1424485136 229   1 
1424485136 230   0 
1424485136 231   0 
1424485136 232   1 
1424485136 233   0 
1424485136 234   0 
1424485136 235   -1 
1424485136 236   0 
1424485136 237   0 
1424485136 238   -1 
1424485136 239   0 
1424485136 240   0 
1424485136 241   1 
1424485136 242   0 
1424485136 243   0 
1424485136 244   1 
1424485136 245   0 
1424485136 246   0 
1424485136 247   -1 
1424485136 248   0 
1424485136 249   0 
1424485136 250   -1 
1424485136 251   0 
1424485136 252   0 
1424485136 253   1 
1424485136 254   0 
1424485136 255   0 
1424485136 256   1 
1424485136 257   0 
1424485136 258   0 
1424485136 259   -1 
1424485136 260   0 
1424485136 261   0 
1424485136 262   -1 
1424485136 263   0 
1424485136 264   0 
1424485136 265   1 
1424485136 266   0 
1424485136 267   0 
1424485136 268   1 
1424485136 269   0 
1424485136 270   0 
1424485136 271   -1 
1424485136 272   0 
1424485136 273   0 
1424485136 274   -1 
1424485136 275   0 
1424485136 276   0 
1424485136 277   1 
1424485136 278   0 
1424485136 279   0 
1424485136 280   1 
1424485136 281   0 
1424485136 282   0 
1424485136 283   -1 
1424485136 284   0 
1424485136 285   0 
1424485136 286   -1 
1424485136 287   0 
1424485136 288   0 
1424485136 289   1 
1424485136 290   0 
1424485136 291   0 
1424485136 292   1 
1424485136 293   0 
1424485136 294   0 
1424485136 295   -1 
1424485136 296   0 
1424485136 297   0 
1424485136 298   -1 
1424485136 299   0 
1424485136 300   0 
1424485136 301   1 
1424485136 302   0 
1424485136 303   0 
1424485136 304   1 
1424485136 305   0 
1424485136 306   0 
1424485136 307   -1 
1424485136 308   0 
1424485136 309   0 
1424485136 310   -1 
1424485136 311   0 
1424485136 312   0 
1424485136 313   1 
1424485136 314   0 
1424485136 315   0 
1424485136 316   1 
1424485136 317   0 
1424485136 318   0 
1424485136 319   -1 
1424485136 320   0 
1424485136 321   0 
1424485136 322   -1 
1424485136 323   0 
1424485136 324   0 
1424485136 325   1 
1424485136 326   0 
1424485136 327   0 
1424485136 328   1 
1424485136 329   0 
1424485136 330   0 
1424485136 331   -1 
1424485136 332   0 
1424485136 333   0 
1424485136 334   0 
1424485136 335   0 
1424485136 336   0 
1424485136 337   0 
1424485136 338   0 
1424485136 339   0 
1424485136 340   0 
1424485136 341   0 
1424485136 342   0 
1424485136 343   0 
1424485136 344   0 
1424485136 345   0 
1424485136 346   0 
1424485136 347   0 
1424485136 348   0 
1424485136 349   0 
1424485136 350   0 
1424485136 351   0 
1424485136 352   0 
1424485136 353   0 
1424485136 354   0 
1424485136 355   0 
1424485136 356   0 
1424485136 357   0 
1424485136 358   0 
1424485136 359   0 
1424485136 360   0 
