1430442571 1   1 
1430442571 2   0 
1430442571 3   0 
1430442571 4   0 
1430442571 5   0 
1430442571 6   0 
1430442571 7   0 
1430442571 8   0 
1430442571 9   0 
1430442571 10   0 
1430442571 11   0 
1430442571 12   0 
1430442571 13   0 
1430442571 14   0 
1430442571 15   0 
1430442571 16   0 
1430442571 17   0 
1430442571 18   0 
1430442571 19   0 
1430442571 20   0 
1430442571 21   0 
1430442571 22   0 
1430442571 23   0 
1430442571 24   0 
1430442571 25   0 
1430442571 26   0 
1430442571 27   0 
1430442571 28   0 
1430442571 29   0 
1430442571 30   0 
1430442571 31   0 
1430442571 32   0 
1430442571 33   0 
1430442571 34   0 
1430442571 35   0 
1430442571 36   0 
1430442571 37   0 
1430442571 38   0 
1430442571 39   0 
1430442571 40   0 
1430442571 41   0 
1430442571 42   0 
1430442571 43   0 
1430442571 44   0 
1430442571 45   0 
1430442571 46   0 
1430442571 47   0 
1430442571 48   0 
1430442571 49   0 
1430442571 50   0 
1430442571 51   0 
1430442571 52   0 
1430442571 53   0 
1430442571 54   0 
1430442571 55   0 
1430442571 56   0 
1430442571 57   0 
1430442571 58   0 
1430442571 59   0 
1430442571 60   0 
1430442571 61   -1 
1430442571 62   0 
1430442571 63   0 
1430442571 64   0 
1430442571 65   0 
1430442571 66   0 
1430442571 67   0 
1430442571 68   0 
1430442571 69   0 
1430442571 70   0 
1430442571 71   0 
1430442571 72   0 
1430442571 73   0 
1430442571 74   0 
1430442571 75   0 
1430442571 76   0 
1430442571 77   0 
1430442571 78   0 
1430442571 79   0 
1430442571 80   0 
1430442571 81   0 
1430442571 82   0 
1430442571 83   0 
1430442571 84   0 
1430442571 85   0 
1430442571 86   0 
1430442571 87   0 
1430442571 88   0 
1430442571 89   0 
1430442571 90   0 
1430442571 91   0 
1430442571 92   0 
1430442571 93   0 
1430442571 94   0 
1430442571 95   0 
1430442571 96   0 
1430442571 97   0 
1430442571 98   0 
1430442571 99   0 
1430442571 100   0 
1430442571 101   0 
1430442571 102   0 
1430442571 103   0 
1430442571 104   0 
1430442571 105   0 
1430442571 106   0 
1430442571 107   0 
1430442571 108   0 
1430442571 109   0 
1430442571 110   0 
1430442571 111   0 
1430442571 112   0 
1430442571 113   0 
1430442571 114   0 
1430442571 115   0 
1430442571 116   0 
1430442571 117   0 
1430442571 118   0 
1430442571 119   0 
1430442571 120   0 
1430442571 121   1 
1430442571 122   0 
1430442571 123   0 
1430442571 124   0 
1430442571 125   0 
1430442571 126   0 
1430442571 127   0 
1430442571 128   0 
1430442571 129   0 
1430442571 130   0 
1430442571 131   0 
1430442571 132   0 
1430442571 133   0 
1430442571 134   0 
1430442571 135   0 
1430442571 136   0 
1430442571 137   0 
1430442571 138   0 
1430442571 139   0 
1430442571 140   0 
1430442571 141   0 
1430442571 142   0 
1430442571 143   0 
1430442571 144   0 
1430442571 145   0 
1430442571 146   0 
1430442571 147   0 
1430442571 148   0 
1430442571 149   0 
1430442571 150   0 
1430442571 151   0 
1430442571 152   0 
1430442571 153   0 
1430442571 154   0 
1430442571 155   0 
1430442571 156   0 
1430442571 157   0 
1430442571 158   0 
1430442571 159   0 
1430442571 160   0 
1430442571 161   0 
1430442571 162   0 
1430442571 163   0 
1430442571 164   0 
1430442571 165   0 
1430442571 166   0 
1430442571 167   0 
1430442571 168   0 
1430442571 169   0 
1430442571 170   0 
1430442571 171   0 
1430442571 172   0 
1430442571 173   0 
1430442571 174   0 
1430442571 175   0 
1430442571 176   0 
1430442571 177   0 
1430442571 178   0 
1430442571 179   0 
1430442571 180   0 
1430442571 181   -1 
1430442571 182   0 
1430442571 183   0 
1430442571 184   0 
1430442571 185   0 
1430442571 186   0 
1430442571 187   0 
1430442571 188   0 
1430442571 189   0 
1430442571 190   0 
1430442571 191   0 
1430442571 192   0 
1430442571 193   0 
1430442571 194   0 
1430442571 195   0 
1430442571 196   0 
1430442571 197   0 
1430442571 198   0 
1430442571 199   0 
1430442571 200   0 
1430442571 201   0 
1430442571 202   0 
1430442571 203   0 
1430442571 204   0 
1430442571 205   0 
1430442571 206   0 
1430442571 207   0 
1430442571 208   0 
1430442571 209   0 
1430442571 210   0 
1430442571 211   0 
1430442571 212   0 
1430442571 213   0 
1430442571 214   0 
1430442571 215   0 
1430442571 216   0 
1430442571 217   0 
1430442571 218   0 
1430442571 219   0 
1430442571 220   0 
1430442571 221   0 
1430442571 222   0 
1430442571 223   0 
1430442571 224   0 
1430442571 225   0 
1430442571 226   0 
1430442571 227   0 
1430442571 228   0 
1430442571 229   0 
1430442571 230   0 
1430442571 231   0 
1430442571 232   0 
1430442571 233   0 
1430442571 234   0 
1430442571 235   0 
1430442571 236   0 
1430442571 237   0 
1430442571 238   0 
1430442571 239   0 
1430442571 240   0 
1430442571 241   1 
1430442571 242   0 
1430442571 243   0 
1430442571 244   0 
1430442571 245   0 
1430442571 246   0 
1430442571 247   0 
1430442571 248   0 
1430442571 249   0 
1430442571 250   0 
1430442571 251   0 
1430442571 252   0 
1430442571 253   0 
1430442571 254   0 
1430442571 255   0 
1430442571 256   0 
1430442571 257   0 
1430442571 258   0 
1430442571 259   0 
1430442571 260   0 
1430442571 261   0 
1430442571 262   0 
1430442571 263   0 
1430442571 264   0 
1430442571 265   0 
1430442571 266   0 
1430442571 267   0 
1430442571 268   0 
1430442571 269   0 
1430442571 270   0 
1430442571 271   0 
1430442571 272   0 
1430442571 273   0 
1430442571 274   0 
1430442571 275   0 
1430442571 276   0 
1430442571 277   0 
1430442571 278   0 
1430442571 279   0 
1430442571 280   0 
1430442571 281   0 
1430442571 282   0 
1430442571 283   0 
1430442571 284   0 
1430442571 285   0 
1430442571 286   0 
1430442571 287   0 
1430442571 288   0 
1430442571 289   0 
1430442571 290   0 
1430442571 291   0 
1430442571 292   0 
1430442571 293   0 
1430442571 294   0 
1430442571 295   0 
1430442571 296   0 
1430442571 297   0 
1430442571 298   0 
1430442571 299   0 
1430442571 300   0 
1430442571 301   -1 
1430442571 302   0 
1430442571 303   0 
1430442571 304   0 
1430442571 305   0 
1430442571 306   0 
1430442571 307   0 
1430442571 308   0 
1430442571 309   0 
1430442571 310   0 
1430442571 311   0 
1430442571 312   0 
1430442571 313   0 
1430442571 314   0 
1430442571 315   0 
1430442571 316   0 
1430442571 317   0 
1430442571 318   0 
1430442571 319   0 
1430442571 320   0 
1430442571 321   0 
1430442571 322   0 
1430442571 323   0 
1430442571 324   0 
1430442571 325   0 
1430442571 326   0 
1430442571 327   0 
1430442571 328   0 
1430442571 329   0 
1430442571 330   0 
1430442571 331   0 
1430442571 332   0 
1430442571 333   0 
1430442571 334   0 
1430442571 335   0 
1430442571 336   0 
1430442571 337   0 
1430442571 338   0 
1430442571 339   0 
1430442571 340   0 
1430442571 341   0 
1430442571 342   0 
1430442571 343   0 
1430442571 344   0 
1430442571 345   0 
1430442571 346   0 
1430442571 347   0 
1430442571 348   0 
1430442571 349   0 
1430442571 350   0 
1430442571 351   0 
1430442571 352   0 
1430442571 353   0 
1430442571 354   0 
1430442571 355   0 
1430442571 356   0 
1430442571 357   0 
1430442571 358   0 
1430442571 359   0 
1430442571 360   0 
