1426939107 1   1 
1426939107 2   0 
1426939107 3   0 
1426939107 4   -1 
1426939107 5   0 
1426939107 6   0 
1426939107 7   1 
1426939107 8   0 
1426939107 9   0 
1426939107 10   -1 
1426939107 11   0 
1426939107 12   0 
1426939107 13   -1 
1426939107 14   0 
1426939107 15   0 
1426939107 16   1 
1426939107 17   0 
1426939107 18   0 
1426939107 19   -1 
1426939107 20   0 
1426939107 21   0 
1426939107 22   1 
1426939107 23   0 
1426939107 24   0 
1426939107 25   -1 
1426939107 26   0 
1426939107 27   0 
1426939107 28   1 
1426939107 29   0 
1426939107 30   0 
1426939107 31   -1 
1426939107 32   0 
1426939107 33   0 
1426939107 34   1 
1426939107 35   0 
1426939107 36   0 
1426939107 37   1 
1426939107 38   0 
1426939107 39   0 
1426939107 40   -1 
1426939107 41   0 
1426939107 42   0 
1426939107 43   1 
1426939107 44   0 
1426939107 45   0 
1426939107 46   -1 
1426939107 47   0 
1426939107 48   0 
1426939107 49   -1 
1426939107 50   0 
1426939107 51   0 
1426939107 52   1 
1426939107 53   0 
1426939107 54   0 
1426939107 55   -1 
1426939107 56   0 
1426939107 57   0 
1426939107 58   1 
1426939107 59   0 
1426939107 60   0 
1426939107 61   1 
1426939107 62   0 
1426939107 63   0 
1426939107 64   -1 
1426939107 65   0 
1426939107 66   0 
1426939107 67   1 
1426939107 68   0 
1426939107 69   0 
1426939107 70   -1 
1426939107 71   0 
1426939107 72   0 
1426939107 73   1 
1426939107 74   0 
1426939107 75   0 
1426939107 76   -1 
1426939107 77   0 
1426939107 78   0 
1426939107 79   1 
1426939107 80   0 
1426939107 81   0 
1426939107 82   -1 
1426939107 83   0 
1426939107 84   0 
1426939107 85   -1 
1426939107 86   0 
1426939107 87   0 
1426939107 88   1 
1426939107 89   0 
1426939107 90   0 
1426939107 91   -1 
1426939107 92   0 
1426939107 93   0 
1426939107 94   1 
1426939107 95   0 
1426939107 96   0 
1426939107 97   -1 
1426939107 98   0 
1426939107 99   0 
1426939107 100   1 
1426939107 101   0 
1426939107 102   0 
1426939107 103   -1 
1426939107 104   0 
1426939107 105   0 
1426939107 106   1 
1426939107 107   0 
1426939107 108   0 
1426939107 109   1 
1426939107 110   0 
1426939107 111   0 
1426939107 112   -1 
1426939107 113   0 
1426939107 114   0 
1426939107 115   1 
1426939107 116   0 
1426939107 117   0 
1426939107 118   -1 
1426939107 119   0 
1426939107 120   0 
1426939107 121   -1 
1426939107 122   0 
1426939107 123   0 
1426939107 124   1 
1426939107 125   0 
1426939107 126   0 
1426939107 127   -1 
1426939107 128   0 
1426939107 129   0 
1426939107 130   1 
1426939107 131   0 
1426939107 132   0 
1426939107 133   1 
1426939107 134   0 
1426939107 135   0 
1426939107 136   -1 
1426939107 137   0 
1426939107 138   0 
1426939107 139   1 
1426939107 140   0 
1426939107 141   0 
1426939107 142   -1 
1426939107 143   0 
1426939107 144   0 
1426939107 145   1 
1426939107 146   0 
1426939107 147   0 
1426939107 148   -1 
1426939107 149   0 
1426939107 150   0 
1426939107 151   1 
1426939107 152   0 
1426939107 153   0 
1426939107 154   -1 
1426939107 155   0 
1426939107 156   0 
1426939107 157   -1 
1426939107 158   0 
1426939107 159   0 
1426939107 160   1 
1426939107 161   0 
1426939107 162   0 
1426939107 163   -1 
1426939107 164   0 
1426939107 165   0 
1426939107 166   1 
1426939107 167   0 
1426939107 168   0 
1426939107 169   -1 
1426939107 170   0 
1426939107 171   0 
1426939107 172   1 
1426939107 173   0 
1426939107 174   0 
1426939107 175   -1 
1426939107 176   0 
1426939107 177   0 
1426939107 178   1 
1426939107 179   0 
1426939107 180   0 
1426939107 181   1 
1426939107 182   0 
1426939107 183   0 
1426939107 184   -1 
1426939107 185   0 
1426939107 186   0 
1426939107 187   1 
1426939107 188   0 
1426939107 189   0 
1426939107 190   -1 
1426939107 191   0 
1426939107 192   0 
1426939107 193   -1 
1426939107 194   0 
1426939107 195   0 
1426939107 196   1 
1426939107 197   0 
1426939107 198   0 
1426939107 199   -1 
1426939107 200   0 
1426939107 201   0 
1426939107 202   1 
1426939107 203   0 
1426939107 204   0 
1426939107 205   1 
1426939107 206   0 
1426939107 207   0 
1426939107 208   -1 
1426939107 209   0 
1426939107 210   0 
1426939107 211   1 
1426939107 212   0 
1426939107 213   0 
1426939107 214   -1 
1426939107 215   0 
1426939107 216   0 
1426939107 217   1 
1426939107 218   0 
1426939107 219   0 
1426939107 220   -1 
1426939107 221   0 
1426939107 222   0 
1426939107 223   1 
1426939107 224   0 
1426939107 225   0 
1426939107 226   -1 
1426939107 227   0 
1426939107 228   0 
1426939107 229   -1 
1426939107 230   0 
1426939107 231   0 
1426939107 232   1 
1426939107 233   0 
1426939107 234   0 
1426939107 235   -1 
1426939107 236   0 
1426939107 237   0 
1426939107 238   1 
1426939107 239   0 
1426939107 240   0 
1426939107 241   -1 
1426939107 242   0 
1426939107 243   0 
1426939107 244   1 
1426939107 245   0 
1426939107 246   0 
1426939107 247   -1 
1426939107 248   0 
1426939107 249   0 
1426939107 250   1 
1426939107 251   0 
1426939107 252   0 
1426939107 253   1 
1426939107 254   0 
1426939107 255   0 
1426939107 256   -1 
1426939107 257   0 
1426939107 258   0 
1426939107 259   1 
1426939107 260   0 
1426939107 261   0 
1426939107 262   -1 
1426939107 263   0 
1426939107 264   0 
1426939107 265   -1 
1426939107 266   0 
1426939107 267   0 
1426939107 268   1 
1426939107 269   0 
1426939107 270   0 
1426939107 271   -1 
1426939107 272   0 
1426939107 273   0 
1426939107 274   1 
1426939107 275   0 
1426939107 276   0 
1426939107 277   1 
1426939107 278   0 
1426939107 279   0 
1426939107 280   -1 
1426939107 281   0 
1426939107 282   0 
1426939107 283   1 
1426939107 284   0 
1426939107 285   0 
1426939107 286   -1 
1426939107 287   0 
1426939107 288   0 
1426939107 289   1 
1426939107 290   0 
1426939107 291   0 
1426939107 292   -1 
1426939107 293   0 
1426939107 294   0 
1426939107 295   1 
1426939107 296   0 
1426939107 297   0 
1426939107 298   -1 
1426939107 299   0 
1426939107 300   0 
1426939107 301   -1 
1426939107 302   0 
1426939107 303   0 
1426939107 304   1 
1426939107 305   0 
1426939107 306   0 
1426939107 307   -1 
1426939107 308   0 
1426939107 309   0 
1426939107 310   1 
1426939107 311   0 
1426939107 312   0 
1426939107 313   -1 
1426939107 314   0 
1426939107 315   0 
1426939107 316   1 
1426939107 317   0 
1426939107 318   0 
1426939107 319   -1 
1426939107 320   0 
1426939107 321   0 
1426939107 322   1 
1426939107 323   0 
1426939107 324   0 
1426939107 325   1 
1426939107 326   0 
1426939107 327   0 
1426939107 328   -1 
1426939107 329   0 
1426939107 330   0 
1426939107 331   1 
1426939107 332   0 
1426939107 333   0 
1426939107 334   0 
1426939107 335   0 
1426939107 336   0 
1426939107 337   0 
1426939107 338   0 
1426939107 339   0 
1426939107 340   0 
1426939107 341   0 
1426939107 342   0 
1426939107 343   0 
1426939107 344   0 
1426939107 345   0 
1426939107 346   0 
1426939107 347   0 
1426939107 348   0 
1426939107 349   0 
1426939107 350   0 
1426939107 351   0 
1426939107 352   0 
1426939107 353   0 
1426939107 354   0 
1426939107 355   0 
1426939107 356   0 
1426939107 357   0 
1426939107 358   0 
1426939107 359   0 
1426939107 360   0 
