1 1 1 1.000 
1 1 2 1.000 
1 1 3 1.000 
1 1 4 1.000 
1 1 5 1.000 
1 1 6 1.000 
1 1 7 1.000 
1 1 8 1.000 
1 1 9 1.000 
1 1 10 1.000 
1 1 11 1.000 
1 1 12 1.000 
1 1 13 1.000 
1 1 14 1.000 
1 1 15 1.000 
1 1 16 1.000 
1 1 17 1.000 
1 1 18 1.000 
1 1 19 1.000 
1 1 20 1.000 
1 1 21 1.000 
1 1 22 1.000 
1 1 23 1.000 
1 1 24 1.000 
1 1 25 1.000 
1 1 26 1.000 
1 1 27 1.000 
1 1 28 1.000 
1 1 29 1.000 
1 1 30 1.000 
1 1 31 1.000 
1 1 32 1.000 
1 1 33 1.000 
1 1 34 1.000 
1 1 35 1.000 
1 1 36 1.000 
1 1 37 1.000 
1 1 38 1.000 
1 1 39 1.000 
1 1 40 1.000 
1 1 41 1.000 
1 1 42 1.000 
1 1 43 1.000 
1 1 44 1.000 
1 1 45 1.000 
1 1 46 1.000 
1 1 47 1.000 
1 1 48 1.000 
1 1 49 1.000 
1 2 1 1.000 
1 2 2 1.000 
1 2 3 1.000 
1 2 4 1.000 
1 2 5 1.000 
1 2 6 1.000 
1 2 7 1.000 
1 2 8 1.000 
1 2 9 1.000 
1 2 10 1.000 
1 2 11 1.000 
1 2 12 1.000 
1 2 13 1.000 
1 2 14 1.000 
1 2 15 1.000 
1 2 16 1.000 
1 2 17 1.000 
1 2 18 1.000 
1 2 19 1.000 
1 2 20 1.000 
1 2 21 1.000 
1 2 22 1.000 
1 2 23 1.000 
1 2 24 1.000 
1 2 25 1.000 
1 2 26 1.000 
1 2 27 1.000 
1 2 28 1.000 
1 2 29 1.000 
1 2 30 1.000 
1 2 31 1.000 
1 2 32 1.000 
1 2 33 1.000 
1 2 34 1.000 
1 2 35 1.000 
1 2 36 1.000 
1 2 37 1.000 
1 2 38 1.000 
1 2 39 1.000 
1 2 40 1.000 
1 2 41 1.000 
1 2 42 1.000 
1 2 43 1.000 
1 2 44 1.000 
1 2 45 1.000 
1 2 46 1.000 
1 2 47 1.000 
1 2 48 1.000 
1 2 49 1.000 
1 3 1 0.000 
1 3 2 0.000 
1 3 3 0.000 
1 3 4 0.000 
1 3 5 0.000 
1 3 6 0.000 
1 3 7 0.000 
1 3 8 0.000 
1 3 9 0.000 
1 3 10 0.000 
1 3 11 0.000 
1 3 12 0.000 
1 3 13 0.000 
1 3 14 0.000 
1 3 15 0.000 
1 3 16 0.000 
1 3 17 0.000 
1 3 18 0.000 
1 3 19 0.000 
1 3 20 0.000 
1 3 21 0.000 
1 3 22 0.000 
1 3 23 0.000 
1 3 24 0.000 
1 3 25 0.000 
1 4 1 0.000 
1 4 2 0.000 
1 4 3 0.000 
1 4 4 0.000 
1 4 5 0.000 
1 4 6 0.000 
1 4 7 0.000 
1 4 8 0.000 
1 4 9 0.000 
1 4 10 0.000 
1 4 11 0.000 
1 4 12 0.000 
1 4 13 0.000 
1 4 14 0.000 
1 4 15 0.000 
1 4 16 0.000 
1 4 17 0.000 
1 4 18 0.000 
1 4 19 0.000 
1 4 20 0.000 
1 4 21 0.000 
1 4 22 0.000 
1 4 23 0.000 
1 4 24 0.000 
1 4 25 0.000 
1 5 1 1.000 
1 5 2 1.000 
1 5 3 1.000 
1 5 4 1.000 
1 5 5 1.000 
1 5 6 1.000 
1 5 7 1.000 
1 6 1 1.000 
1 6 2 1.000 
1 6 3 1.000 
1 6 4 1.000 
1 6 5 1.000 
1 6 6 1.000 
1 6 7 1.000 
2 1 1 0.636 
2 1 2 0.577 
2 1 3 0.665 
2 1 4 1.243 
2 1 5 0.584 
2 1 6 0.848 
2 1 7 0.683 
2 1 8 1.054 
2 1 9 2.888 
2 1 10 14.634 
2 1 11 0.000 
2 1 12 0.000 
2 1 13 0.000 
2 1 14 0.000 
2 1 15 0.000 
2 1 16 0.000 
2 1 17 0.000 
2 1 18 2.304 
2 1 19 0.000 
2 1 20 0.651 
2 1 21 14.527 
2 1 22 1.337 
2 1 23 1.037 
2 1 24 0.912 
2 1 25 0.187 
2 1 26 5.093 
2 1 27 3.669 
2 1 28 3.018 
2 1 29 0.000 
2 1 30 0.000 
2 1 31 0.000 
2 1 32 0.000 
2 1 33 0.000 
2 1 34 0.000 
2 1 35 1.886 
2 1 36 1.157 
2 1 37 0.805 
2 1 38 3.891 
2 1 39 0.978 
2 1 40 2.256 
2 1 41 0.178 
2 1 42 0.879 
2 1 43 1.514 
2 1 44 1.678 
2 1 45 4.273 
2 1 46 5.572 
2 1 47 0.000 
2 1 48 0.000 
2 1 49 0.000 
2 1 50 0.000 
2 1 51 0.000 
2 1 52 0.623 
2 1 53 1.211 
2 1 54 0.995 
2 1 55 4.868 
2 1 56 1.037 
2 1 57 0.627 
2 1 58 0.645 
2 1 59 0.839 
2 1 60 0.906 
2 1 61 1.173 
2 1 62 1.389 
2 1 63 3.530 
2 1 64 1.385 
2 1 65 0.000 
2 1 66 0.000 
2 1 67 0.000 
2 1 68 0.000 
2 1 69 0.557 
2 1 70 0.800 
2 1 71 1.167 
2 1 72 1.028 
2 1 73 1.486 
2 1 74 2.454 
2 1 75 0.940 
2 1 76 0.605 
2 1 77 1.399 
2 1 78 1.406 
2 1 79 2.730 
2 1 80 1.019 
2 1 81 0.952 
2 1 82 2.232 
2 1 83 0.000 
2 1 84 0.000 
2 1 85 0.000 
2 1 86 1.000 
2 1 87 0.519 
2 1 88 1.270 
2 1 89 0.953 
2 1 90 0.983 
2 1 91 0.812 
2 1 92 0.852 
2 1 93 0.851 
2 1 94 1.524 
2 1 95 0.901 
2 1 96 0.955 
2 1 97 1.008 
2 1 98 0.977 
2 1 99 38.972 
2 1 100 48.733 
2 1 101 0.000 
2 1 102 0.000 
2 1 103 0.675 
2 1 104 0.850 
2 1 105 0.952 
2 1 106 0.571 
2 1 107 3.133 
2 1 108 0.843 
2 1 109 0.851 
2 1 110 0.115 
2 1 111 1.234 
2 1 112 0.885 
2 1 113 0.948 
2 1 114 0.964 
2 1 115 2.669 
2 1 116 4.881 
2 1 117 4.327 
2 1 118 4.271 
2 1 119 0.000 
2 1 120 0.704 
2 1 121 0.707 
2 1 122 1.106 
2 1 123 0.713 
2 1 124 1.240 
2 1 125 0.977 
2 1 126 0.779 
2 1 127 0.538 
2 1 128 1.177 
2 1 129 1.291 
2 1 130 0.878 
2 1 131 0.921 
2 1 132 1.410 
2 1 133 2.152 
2 1 134 3.930 
2 1 135 7.003 
2 1 136 1.383 
2 1 137 0.635 
2 1 138 0.435 
2 1 139 0.574 
2 1 140 0.396 
2 1 141 0.816 
2 1 142 0.494 
2 1 143 0.830 
2 1 144 0.635 
2 1 145 0.922 
2 1 146 0.864 
2 1 147 0.900 
2 1 148 0.932 
2 1 149 1.125 
2 1 150 2.671 
2 1 151 2.592 
2 1 152 2.956 
2 1 153 1.997 
2 1 154 0.000 
2 1 155 0.000 
2 1 156 0.000 
2 1 157 0.000 
2 1 158 0.000 
2 1 159 0.000 
2 1 160 0.000 
2 1 161 0.000 
2 1 162 0.729 
2 1 163 0.840 
2 1 164 15.616 
2 1 165 0.716 
2 1 166 0.879 
2 1 167 0.994 
2 1 168 2.068 
2 1 169 5.527 
2 1 170 1.300 
2 1 171 0.000 
2 1 172 0.000 
2 1 173 0.000 
2 1 174 0.000 
2 1 175 0.000 
2 1 176 0.000 
2 1 177 0.000 
2 1 178 0.000 
2 1 179 0.573 
2 1 180 3.281 
2 1 181 1.444 
2 1 182 0.487 
2 1 183 1.347 
2 1 184 1.326 
2 1 185 0.636 
2 1 186 0.862 
2 1 187 0.569 
2 1 188 0.000 
2 1 189 0.000 
2 1 190 0.000 
2 1 191 0.000 
2 1 192 0.000 
2 1 193 0.000 
2 1 194 0.000 
2 1 195 0.000 
2 1 196 0.601 
2 1 197 0.799 
2 1 198 0.651 
2 1 199 0.932 
2 1 200 1.224 
2 1 201 0.404 
2 1 202 1.021 
2 1 203 1.386 
2 1 204 1.668 
2 1 205 0.000 
2 1 206 0.000 
2 1 207 0.000 
2 1 208 0.000 
2 1 209 0.000 
2 1 210 0.000 
2 1 211 0.000 
2 1 212 0.000 
2 1 213 0.869 
2 1 214 1.115 
2 1 215 1.257 
2 1 216 4.574 
2 1 217 0.721 
2 1 218 0.933 
2 1 219 1.166 
2 1 220 1.124 
2 1 221 3.112 
2 1 222 0.000 
2 1 223 0.000 
2 1 224 0.000 
2 1 225 0.000 
2 1 226 0.000 
2 1 227 0.000 
2 1 228 0.000 
2 1 229 0.000 
2 1 230 0.655 
2 1 231 0.751 
2 1 232 1.000 
2 1 233 0.844 
2 1 234 0.713 
2 1 235 0.770 
2 1 236 2.577 
2 1 237 1.689 
2 1 238 0.889 
2 1 239 0.000 
2 1 240 0.000 
2 1 241 0.000 
2 1 242 0.000 
2 1 243 0.000 
2 1 244 0.000 
2 1 245 0.000 
2 1 246 0.000 
2 1 247 1.022 
2 1 248 0.531 
2 1 249 1.000 
2 1 250 0.804 
2 1 251 0.848 
2 1 252 0.428 
2 1 253 1.066 
2 1 254 1.835 
2 1 255 0.672 
2 1 256 0.000 
2 1 257 0.000 
2 1 258 0.000 
2 1 259 0.000 
2 1 260 0.000 
2 1 261 0.000 
2 1 262 0.000 
2 1 263 0.000 
2 1 264 0.874 
2 1 265 1.230 
2 1 266 0.759 
2 1 267 0.744 
2 1 268 0.520 
2 1 269 1.000 
2 1 270 1.474 
2 1 271 2.363 
2 1 272 0.780 
2 1 273 0.000 
2 1 274 0.000 
2 1 275 0.000 
2 1 276 0.000 
2 1 277 0.000 
2 1 278 0.000 
2 1 279 0.000 
2 1 280 0.000 
2 1 281 0.923 
2 1 282 1.485 
2 1 283 0.968 
2 1 284 2.955 
2 1 285 0.661 
2 1 286 1.062 
2 1 287 2.784 
2 1 288 2.853 
2 1 289 0.641 
2 1 290 0.000 
2 1 291 0.000 
2 1 292 0.000 
2 1 293 0.000 
2 1 294 0.000 
2 1 295 0.000 
2 1 296 0.000 
2 1 297 0.000 
2 1 298 0.699 
2 1 299 0.759 
2 1 300 1.230 
2 1 301 0.968 
2 1 302 1.214 
2 1 303 2.282 
2 1 304 1.894 
2 1 305 1.530 
2 1 306 0.627 
2 1 307 0.000 
2 1 308 0.000 
2 1 309 0.000 
2 1 310 0.000 
2 1 311 0.000 
2 1 312 0.000 
2 1 313 0.000 
2 1 314 0.000 
2 1 315 0.771 
2 1 316 0.747 
2 1 317 1.044 
2 1 318 1.603 
2 1 319 1.113 
2 1 320 1.747 
2 1 321 2.427 
2 1 322 3.636 
2 1 323 1.117 
2 1 324 0.000 
2 1 325 0.000 
2 1 326 0.000 
2 1 327 0.000 
2 1 328 0.000 
2 1 329 0.000 
2 1 330 0.000 
2 1 331 0.000 
2 1 332 0.660 
2 1 333 0.826 
2 1 334 0.721 
2 1 335 1.413 
2 1 336 0.974 
2 1 337 1.340 
2 1 338 0.880 
2 1 339 1.559 
2 1 340 0.636 
2 1 341 0.000 
2 1 342 0.000 
2 1 343 0.000 
2 1 344 0.000 
2 1 345 0.000 
2 1 346 0.000 
2 1 347 0.000 
2 1 348 0.000 
2 1 349 0.545 
2 1 350 0.901 
2 1 351 0.944 
2 1 352 1.110 
2 1 353 0.737 
2 1 354 3.085 
2 1 355 1.906 
2 1 356 1.200 
2 1 357 0.781 
2 1 358 0.000 
2 1 359 0.000 
2 1 360 0.000 
2 1 361 0.000 
2 1 362 0.000 
2 1 363 0.000 
2 1 364 0.000 
2 1 365 0.000 
2 1 366 0.856 
2 1 367 0.829 
2 1 368 1.138 
2 1 369 0.944 
2 1 370 0.774 
2 1 371 0.964 
2 1 372 3.661 
2 1 373 1.174 
2 1 374 1.437 
2 1 375 0.000 
2 1 376 0.000 
2 1 377 0.000 
2 1 378 0.000 
2 1 379 0.000 
2 1 380 0.000 
2 1 381 0.000 
2 1 382 0.000 
2 1 383 0.741 
2 1 384 0.775 
2 1 385 1.504 
2 1 386 1.352 
2 1 387 2.343 
2 1 388 1.603 
2 1 389 1.911 
2 1 390 2.909 
2 1 391 0.897 
2 1 392 0.000 
2 1 393 0.000 
2 1 394 0.000 
2 1 395 0.000 
2 1 396 0.000 
2 1 397 0.000 
2 1 398 0.000 
2 1 399 0.000 
2 1 400 0.654 
2 1 401 5.649 
2 1 402 0.471 
2 1 403 0.980 
2 1 404 1.053 
2 1 405 1.113 
2 1 406 0.870 
2 1 407 0.878 
2 1 408 1.004 
2 1 409 0.000 
2 1 410 0.000 
2 1 411 0.000 
2 1 412 0.000 
2 1 413 0.000 
2 1 414 0.000 
2 1 415 0.000 
2 1 416 0.000 
2 1 417 0.635 
2 1 418 2.004 
2 1 419 0.562 
2 1 420 1.058 
2 1 421 1.517 
2 1 422 1.116 
2 1 423 1.766 
2 1 424 1.462 
2 1 425 0.633 
2 1 426 0.781 
2 1 427 0.611 
2 1 428 2.933 
2 1 429 0.888 
2 1 430 0.841 
2 1 431 0.642 
2 1 432 0.777 
2 1 433 0.610 
2 1 434 0.965 
2 1 435 0.944 
2 1 436 0.865 
2 1 437 0.899 
2 1 438 1.155 
2 1 439 1.623 
2 1 440 1.032 
2 1 441 1.372 
2 1 442 0.807 
2 1 443 1.069 
2 1 444 1.825 
2 1 445 0.614 
2 1 446 0.645 
2 1 447 0.945 
2 1 448 0.966 
2 1 449 0.909 
2 1 450 0.750 
2 1 451 0.925 
2 1 452 0.805 
2 1 453 0.994 
2 1 454 0.922 
2 1 455 0.714 
2 1 456 0.936 
2 1 457 1.498 
2 1 458 4.415 
2 1 459 1.034 
2 1 460 1.194 
2 1 461 0.481 
2 1 462 0.855 
2 1 463 0.800 
2 1 464 1.123 
2 1 465 0.773 
2 1 466 0.788 
2 1 467 0.958 
2 1 468 3.953 
2 1 469 1.149 
2 1 470 1.566 
2 1 471 1.851 
2 1 472 1.303 
2 1 473 1.926 
2 1 474 3.706 
2 1 475 6.103 
2 1 476 0.000 
2 1 477 1.479 
2 1 478 0.938 
2 1 479 0.993 
2 1 480 0.935 
2 1 481 0.987 
2 1 482 1.067 
2 1 483 3.315 
2 1 484 0.941 
2 1 485 1.058 
2 1 486 0.905 
2 1 487 0.892 
2 1 488 1.394 
2 1 489 2.203 
2 1 490 1.374 
2 1 491 2.629 
2 1 492 0.000 
2 1 493 0.000 
2 1 494 0.818 
2 1 495 0.821 
2 1 496 1.160 
2 1 497 0.764 
2 1 498 1.393 
2 1 499 0.767 
2 1 500 2.877 
2 1 501 1.197 
2 1 502 1.078 
2 1 503 0.800 
2 1 504 0.896 
2 1 505 3.420 
2 1 506 0.907 
2 1 507 0.738 
2 1 508 0.000 
2 1 509 0.000 
2 1 510 0.000 
2 1 511 0.598 
2 1 512 0.886 
2 1 513 0.966 
2 1 514 0.962 
2 1 515 3.122 
2 1 516 1.102 
2 1 517 1.095 
2 1 518 2.109 
2 1 519 1.358 
2 1 520 1.722 
2 1 521 2.007 
2 1 522 0.753 
2 1 523 1.113 
2 1 524 0.000 
2 1 525 0.000 
2 1 526 0.000 
2 1 527 0.000 
2 1 528 1.330 
2 1 529 1.517 
2 1 530 1.195 
2 1 531 0.585 
2 1 532 2.691 
2 1 533 1.534 
2 1 534 1.175 
2 1 535 1.272 
2 1 536 0.848 
2 1 537 0.782 
2 1 538 1.055 
2 1 539 1.110 
2 1 540 0.000 
2 1 541 0.000 
2 1 542 0.000 
2 1 543 0.000 
2 1 544 0.000 
2 1 545 1.785 
2 1 546 1.605 
2 1 547 0.713 
2 1 548 2.039 
2 1 549 3.188 
2 1 550 1.106 
2 1 551 1.605 
2 1 552 1.952 
2 1 553 1.224 
2 1 554 1.628 
2 1 555 5.622 
2 1 556 0.000 
2 1 557 0.000 
2 1 558 0.000 
2 1 559 0.000 
2 1 560 0.000 
2 1 561 0.000 
2 1 562 0.436 
2 1 563 0.768 
2 1 564 0.731 
2 1 565 0.804 
2 1 566 1.739 
2 1 567 2.488 
2 1 568 0.543 
2 1 569 1.864 
2 1 570 1.061 
2 1 571 0.811 
2 1 572 0.000 
2 1 573 0.000 
2 1 574 0.000 
2 1 575 0.000 
2 1 576 0.000 
2 1 577 0.000 
2 1 578 0.000 
2 2 1 0.766 
2 2 2 1.126 
2 2 3 0.551 
2 2 4 0.558 
2 2 5 2.025 
2 2 6 0.652 
2 2 7 0.567 
2 2 8 1.152 
2 2 9 0.734 
2 2 10 0.983 
2 2 11 0.000 
2 2 12 0.000 
2 2 13 0.000 
2 2 14 0.000 
2 2 15 0.000 
2 2 16 0.000 
2 2 17 0.000 
2 2 18 0.573 
2 2 19 1.775 
2 2 20 1.281 
2 2 21 1.227 
2 2 22 0.586 
2 2 23 0.861 
2 2 24 0.650 
2 2 25 0.676 
2 2 26 0.984 
2 2 27 1.342 
2 2 28 4.741 
2 2 29 0.000 
2 2 30 0.000 
2 2 31 0.000 
2 2 32 0.000 
2 2 33 0.000 
2 2 34 0.000 
2 2 35 1.000 
2 2 36 1.129 
2 2 37 1.370 
2 2 38 0.889 
2 2 39 1.235 
2 2 40 0.803 
2 2 41 0.802 
2 2 42 0.765 
2 2 43 0.753 
2 2 44 2.343 
2 2 45 1.132 
2 2 46 0.752 
2 2 47 0.000 
2 2 48 0.000 
2 2 49 0.000 
2 2 50 0.000 
2 2 51 0.000 
2 2 52 1.326 
2 2 53 0.682 
2 2 54 0.985 
2 2 55 0.899 
2 2 56 1.013 
2 2 57 1.072 
2 2 58 0.949 
2 2 59 1.079 
2 2 60 0.806 
2 2 61 0.597 
2 2 62 1.304 
2 2 63 2.307 
2 2 64 1.649 
2 2 65 0.000 
2 2 66 0.000 
2 2 67 0.000 
2 2 68 0.000 
2 2 69 0.728 
2 2 70 0.457 
2 2 71 0.657 
2 2 72 0.816 
2 2 73 0.881 
2 2 74 0.715 
2 2 75 1.202 
2 2 76 0.503 
2 2 77 0.539 
2 2 78 1.997 
2 2 79 0.319 
2 2 80 0.718 
2 2 81 2.121 
2 2 82 0.785 
2 2 83 0.000 
2 2 84 0.000 
2 2 85 0.000 
2 2 86 0.926 
2 2 87 1.058 
2 2 88 1.182 
2 2 89 1.058 
2 2 90 1.100 
2 2 91 1.077 
2 2 92 0.789 
2 2 93 1.580 
2 2 94 1.009 
2 2 95 0.706 
2 2 96 0.683 
2 2 97 0.987 
2 2 98 1.391 
2 2 99 2.490 
2 2 100 1.539 
2 2 101 0.000 
2 2 102 0.000 
2 2 103 0.976 
2 2 104 1.008 
2 2 105 0.863 
2 2 106 0.739 
2 2 107 0.762 
2 2 108 0.544 
2 2 109 0.777 
2 2 110 0.908 
2 2 111 0.962 
2 2 112 5.885 
2 2 113 4.262 
2 2 114 0.679 
2 2 115 0.647 
2 2 116 2.629 
2 2 117 4.379 
2 2 118 2.536 
2 2 119 0.000 
2 2 120 0.567 
2 2 121 0.730 
2 2 122 0.795 
2 2 123 0.795 
2 2 124 0.660 
2 2 125 0.899 
2 2 126 0.710 
2 2 127 1.075 
2 2 128 1.030 
2 2 129 1.096 
2 2 130 0.892 
2 2 131 1.167 
2 2 132 0.801 
2 2 133 1.150 
2 2 134 3.147 
2 2 135 6.758 
2 2 136 1.362 
2 2 137 2.317 
2 2 138 0.747 
2 2 139 0.606 
2 2 140 0.789 
2 2 141 0.700 
2 2 142 0.476 
2 2 143 0.692 
2 2 144 0.421 
2 2 145 0.370 
2 2 146 0.569 
2 2 147 0.994 
2 2 148 0.893 
2 2 149 1.755 
2 2 150 13.446 
2 2 151 1.735 
2 2 152 4.508 
2 2 153 2.120 
2 2 154 0.000 
2 2 155 0.000 
2 2 156 0.000 
2 2 157 0.000 
2 2 158 0.000 
2 2 159 0.000 
2 2 160 0.000 
2 2 161 0.000 
2 2 162 0.422 
2 2 163 1.970 
2 2 164 1.349 
2 2 165 1.529 
2 2 166 0.972 
2 2 167 1.418 
2 2 168 3.360 
2 2 169 17.255 
2 2 170 0.904 
2 2 171 0.000 
2 2 172 0.000 
2 2 173 0.000 
2 2 174 0.000 
2 2 175 0.000 
2 2 176 0.000 
2 2 177 0.000 
2 2 178 0.000 
2 2 179 0.545 
2 2 180 0.985 
2 2 181 3.530 
2 2 182 2.138 
2 2 183 1.039 
2 2 184 1.109 
2 2 185 0.670 
2 2 186 1.610 
2 2 187 1.427 
2 2 188 0.000 
2 2 189 0.000 
2 2 190 0.000 
2 2 191 0.000 
2 2 192 0.000 
2 2 193 0.000 
2 2 194 0.000 
2 2 195 0.000 
2 2 196 0.977 
2 2 197 0.998 
2 2 198 0.953 
2 2 199 26.407 
2 2 200 1.072 
2 2 201 0.670 
2 2 202 5.557 
2 2 203 1.457 
2 2 204 0.841 
2 2 205 0.000 
2 2 206 0.000 
2 2 207 0.000 
2 2 208 0.000 
2 2 209 0.000 
2 2 210 0.000 
2 2 211 0.000 
2 2 212 0.000 
2 2 213 0.834 
2 2 214 3.134 
2 2 215 0.709 
2 2 216 1.480 
2 2 217 1.029 
2 2 218 1.285 
2 2 219 2.813 
2 2 220 4.383 
2 2 221 0.999 
2 2 222 0.000 
2 2 223 0.000 
2 2 224 0.000 
2 2 225 0.000 
2 2 226 0.000 
2 2 227 0.000 
2 2 228 0.000 
2 2 229 0.000 
2 2 230 0.665 
2 2 231 0.865 
2 2 232 1.007 
2 2 233 1.678 
2 2 234 2.461 
2 2 235 0.712 
2 2 236 1.664 
2 2 237 2.800 
2 2 238 0.817 
2 2 239 0.000 
2 2 240 0.000 
2 2 241 0.000 
2 2 242 0.000 
2 2 243 0.000 
2 2 244 0.000 
2 2 245 0.000 
2 2 246 0.000 
2 2 247 0.867 
2 2 248 0.772 
2 2 249 1.009 
2 2 250 1.225 
2 2 251 1.660 
2 2 252 4.264 
2 2 253 1.214 
2 2 254 1.000 
2 2 255 0.715 
2 2 256 0.000 
2 2 257 0.000 
2 2 258 0.000 
2 2 259 0.000 
2 2 260 0.000 
2 2 261 0.000 
2 2 262 0.000 
2 2 263 0.000 
2 2 264 0.957 
2 2 265 1.383 
2 2 266 2.116 
2 2 267 1.573 
2 2 268 0.668 
2 2 269 0.903 
2 2 270 0.714 
2 2 271 1.321 
2 2 272 0.917 
2 2 273 0.000 
2 2 274 0.000 
2 2 275 0.000 
2 2 276 0.000 
2 2 277 0.000 
2 2 278 0.000 
2 2 279 0.000 
2 2 280 0.000 
2 2 281 0.765 
2 2 282 1.005 
2 2 283 0.830 
2 2 284 0.571 
2 2 285 5.376 
2 2 286 1.976 
2 2 287 1.788 
2 2 288 1.090 
2 2 289 4.430 
2 2 290 0.000 
2 2 291 0.000 
2 2 292 0.000 
2 2 293 0.000 
2 2 294 0.000 
2 2 295 0.000 
2 2 296 0.000 
2 2 297 0.000 
2 2 298 1.225 
2 2 299 1.059 
2 2 300 0.696 
2 2 301 1.051 
2 2 302 1.386 
2 2 303 14.386 
2 2 304 1.657 
2 2 305 1.389 
2 2 306 0.949 
2 2 307 0.000 
2 2 308 0.000 
2 2 309 0.000 
2 2 310 0.000 
2 2 311 0.000 
2 2 312 0.000 
2 2 313 0.000 
2 2 314 0.000 
2 2 315 1.331 
2 2 316 1.203 
2 2 317 12.481 
2 2 318 0.367 
2 2 319 0.654 
2 2 320 1.347 
2 2 321 1.155 
2 2 322 0.974 
2 2 323 1.127 
2 2 324 0.000 
2 2 325 0.000 
2 2 326 0.000 
2 2 327 0.000 
2 2 328 0.000 
2 2 329 0.000 
2 2 330 0.000 
2 2 331 0.000 
2 2 332 1.389 
2 2 333 0.767 
2 2 334 0.923 
2 2 335 1.166 
2 2 336 1.179 
2 2 337 0.826 
2 2 338 1.631 
2 2 339 1.458 
2 2 340 0.807 
2 2 341 0.000 
2 2 342 0.000 
2 2 343 0.000 
2 2 344 0.000 
2 2 345 0.000 
2 2 346 0.000 
2 2 347 0.000 
2 2 348 0.000 
2 2 349 1.317 
2 2 350 0.953 
2 2 351 1.164 
2 2 352 4.055 
2 2 353 4.431 
2 2 354 0.322 
2 2 355 1.545 
2 2 356 5.323 
2 2 357 1.199 
2 2 358 0.000 
2 2 359 0.000 
2 2 360 0.000 
2 2 361 0.000 
2 2 362 0.000 
2 2 363 0.000 
2 2 364 0.000 
2 2 365 0.000 
2 2 366 0.775 
2 2 367 0.668 
2 2 368 0.681 
2 2 369 3.555 
2 2 370 1.437 
2 2 371 2.902 
2 2 372 4.223 
2 2 373 1.132 
2 2 374 0.429 
2 2 375 0.000 
2 2 376 0.000 
2 2 377 0.000 
2 2 378 0.000 
2 2 379 0.000 
2 2 380 0.000 
2 2 381 0.000 
2 2 382 0.000 
2 2 383 1.000 
2 2 384 0.564 
2 2 385 1.527 
2 2 386 1.163 
2 2 387 8.218 
2 2 388 1.042 
2 2 389 1.383 
2 2 390 25.522 
2 2 391 1.583 
2 2 392 0.000 
2 2 393 0.000 
2 2 394 0.000 
2 2 395 0.000 
2 2 396 0.000 
2 2 397 0.000 
2 2 398 0.000 
2 2 399 0.000 
2 2 400 1.166 
2 2 401 1.013 
2 2 402 1.199 
2 2 403 2.417 
2 2 404 1.282 
2 2 405 5.288 
2 2 406 0.949 
2 2 407 1.497 
2 2 408 1.397 
2 2 409 0.000 
2 2 410 0.000 
2 2 411 0.000 
2 2 412 0.000 
2 2 413 0.000 
2 2 414 0.000 
2 2 415 0.000 
2 2 416 0.000 
2 2 417 0.875 
2 2 418 1.074 
2 2 419 1.340 
2 2 420 0.984 
2 2 421 1.266 
2 2 422 3.145 
2 2 423 0.948 
2 2 424 1.144 
2 2 425 6.819 
2 2 426 1.194 
2 2 427 1.114 
2 2 428 0.984 
2 2 429 0.727 
2 2 430 0.850 
2 2 431 0.896 
2 2 432 0.935 
2 2 433 0.964 
2 2 434 0.958 
2 2 435 1.469 
2 2 436 1.014 
2 2 437 1.544 
2 2 438 0.594 
2 2 439 1.567 
2 2 440 2.171 
2 2 441 5.428 
2 2 442 2.004 
2 2 443 1.107 
2 2 444 0.911 
2 2 445 1.452 
2 2 446 0.917 
2 2 447 0.860 
2 2 448 0.600 
2 2 449 1.813 
2 2 450 1.181 
2 2 451 0.542 
2 2 452 8.521 
2 2 453 0.800 
2 2 454 1.812 
2 2 455 1.576 
2 2 456 2.115 
2 2 457 3.967 
2 2 458 4.315 
2 2 459 1.594 
2 2 460 0.861 
2 2 461 0.982 
2 2 462 1.558 
2 2 463 1.160 
2 2 464 0.997 
2 2 465 0.887 
2 2 466 0.956 
2 2 467 0.934 
2 2 468 1.031 
2 2 469 0.853 
2 2 470 1.134 
2 2 471 0.916 
2 2 472 2.340 
2 2 473 0.803 
2 2 474 1.585 
2 2 475 3.499 
2 2 476 0.000 
2 2 477 1.737 
2 2 478 1.139 
2 2 479 2.544 
2 2 480 2.115 
2 2 481 1.327 
2 2 482 0.876 
2 2 483 0.824 
2 2 484 12.500 
2 2 485 0.871 
2 2 486 0.852 
2 2 487 1.120 
2 2 488 2.978 
2 2 489 1.004 
2 2 490 1.632 
2 2 491 1.891 
2 2 492 0.000 
2 2 493 0.000 
2 2 494 1.257 
2 2 495 0.777 
2 2 496 1.049 
2 2 497 2.084 
2 2 498 1.420 
2 2 499 1.303 
2 2 500 1.926 
2 2 501 2.942 
2 2 502 2.418 
2 2 503 0.923 
2 2 504 3.944 
2 2 505 2.081 
2 2 506 1.837 
2 2 507 1.055 
2 2 508 0.000 
2 2 509 0.000 
2 2 510 0.000 
2 2 511 1.058 
2 2 512 1.031 
2 2 513 1.245 
2 2 514 1.009 
2 2 515 1.064 
2 2 516 0.778 
2 2 517 0.975 
2 2 518 1.540 
2 2 519 1.773 
2 2 520 2.293 
2 2 521 2.854 
2 2 522 1.233 
2 2 523 0.855 
2 2 524 0.000 
2 2 525 0.000 
2 2 526 0.000 
2 2 527 0.000 
2 2 528 0.820 
2 2 529 1.113 
2 2 530 1.781 
2 2 531 0.632 
2 2 532 2.320 
2 2 533 0.969 
2 2 534 1.165 
2 2 535 9.796 
2 2 536 1.380 
2 2 537 2.082 
2 2 538 2.932 
2 2 539 1.445 
2 2 540 0.000 
2 2 541 0.000 
2 2 542 0.000 
2 2 543 0.000 
2 2 544 0.000 
2 2 545 0.771 
2 2 546 1.304 
2 2 547 0.889 
2 2 548 0.854 
2 2 549 1.570 
2 2 550 1.261 
2 2 551 1.533 
2 2 552 2.695 
2 2 553 3.213 
2 2 554 56.440 
2 2 555 2.087 
2 2 556 0.000 
2 2 557 0.000 
2 2 558 0.000 
2 2 559 0.000 
2 2 560 0.000 
2 2 561 0.000 
2 2 562 0.984 
2 2 563 0.557 
2 2 564 0.733 
2 2 565 1.593 
2 2 566 0.941 
2 2 567 0.820 
2 2 568 0.900 
2 2 569 1.889 
2 2 570 2.850 
2 2 571 1.672 
2 2 572 0.000 
2 2 573 0.000 
2 2 574 0.000 
2 2 575 0.000 
2 2 576 0.000 
2 2 577 0.000 
2 2 578 0.000 
2 3 1 0.903 
2 3 2 0.762 
2 3 3 0.883 
2 3 4 0.747 
2 3 5 0.804 
2 3 6 0.815 
2 3 7 0.721 
2 3 8 0.762 
2 3 9 0.744 
2 3 10 1.045 
2 3 11 1.402 
2 3 12 0.691 
2 3 13 0.930 
2 3 14 0.830 
2 3 15 0.940 
2 3 16 1.035 
2 3 17 0.986 
2 3 18 1.387 
2 3 19 2.751 
2 3 20 1.286 
2 3 21 1.171 
2 3 22 1.123 
2 3 23 1.145 
2 3 24 1.229 
2 3 25 1.217 
2 3 26 0.999 
2 3 27 1.163 
2 3 28 0.775 
2 3 29 1.337 
2 3 30 1.115 
2 3 31 1.307 
2 3 32 1.252 
2 3 33 1.035 
2 3 34 0.979 
2 3 35 1.037 
2 3 36 0.676 
2 3 37 1.108 
2 3 38 1.090 
2 3 39 1.443 
2 3 40 1.179 
2 3 41 4.784 
2 3 42 1.596 
2 3 43 1.428 
2 3 44 1.207 
2 3 45 2.039 
2 3 46 0.998 
2 3 47 1.074 
2 3 48 0.940 
2 3 49 0.639 
2 3 50 0.878 
2 3 51 1.093 
2 3 52 0.841 
2 3 53 8.403 
2 3 54 0.764 
2 3 55 0.881 
2 3 56 0.912 
2 3 57 1.381 
2 3 58 1.134 
2 3 59 1.371 
2 3 60 1.077 
2 3 61 0.585 
2 3 62 0.480 
2 3 63 0.622 
2 3 64 0.593 
2 3 65 1.142 
2 3 66 0.629 
2 3 67 1.366 
2 3 68 1.780 
2 3 69 1.514 
2 3 70 1.334 
2 3 71 1.171 
2 3 72 1.423 
2 3 73 0.456 
2 3 74 0.471 
2 3 75 0.663 
2 3 76 0.557 
2 3 77 0.507 
2 3 78 0.880 
2 3 79 3.169 
2 3 80 1.466 
2 3 81 1.830 
2 3 82 1.224 
2 3 83 1.015 
2 3 84 0.900 
2 3 85 0.000 
2 3 86 0.000 
2 3 87 0.000 
2 3 88 0.000 
2 3 89 0.000 
2 3 90 5.069 
2 3 91 2.570 
2 3 92 1.878 
2 3 93 1.874 
2 3 94 1.769 
2 3 95 1.270 
2 3 96 1.178 
2 3 97 0.000 
2 3 98 0.000 
2 3 99 0.000 
2 3 100 0.000 
2 3 101 0.000 
2 3 102 0.516 
2 3 103 0.837 
2 3 104 0.788 
2 3 105 1.542 
2 3 106 1.655 
2 3 107 1.373 
2 3 108 0.889 
2 3 109 0.000 
2 3 110 0.000 
2 3 111 0.000 
2 3 112 0.000 
2 3 113 0.000 
2 3 114 0.613 
2 3 115 0.650 
2 3 116 0.856 
2 3 117 1.206 
2 3 118 1.283 
2 3 119 0.899 
2 3 120 0.100 
2 3 121 0.000 
2 3 122 0.000 
2 3 123 0.000 
2 3 124 0.000 
2 3 125 0.000 
2 3 126 0.527 
2 3 127 0.640 
2 3 128 0.705 
2 3 129 1.041 
2 3 130 1.043 
2 3 131 1.101 
2 3 132 1.206 
2 3 133 0.000 
2 3 134 0.000 
2 3 135 0.000 
2 3 136 0.000 
2 3 137 0.000 
2 3 138 0.315 
2 3 139 0.489 
2 3 140 0.569 
2 3 141 1.177 
2 3 142 1.175 
2 3 143 0.793 
2 3 144 0.691 
2 3 145 0.000 
2 3 146 0.000 
2 3 147 0.000 
2 3 148 0.000 
2 3 149 0.000 
2 3 150 0.578 
2 3 151 0.704 
2 3 152 0.849 
2 3 153 1.275 
2 3 154 0.940 
2 3 155 1.000 
2 3 156 0.705 
2 3 157 0.000 
2 3 158 0.000 
2 3 159 0.000 
2 3 160 0.000 
2 3 161 0.000 
2 3 162 0.513 
2 3 163 0.788 
2 3 164 0.878 
2 3 165 1.361 
2 3 166 1.573 
2 3 167 1.067 
2 3 168 1.428 
2 3 169 0.000 
2 3 170 0.000 
2 3 171 0.000 
2 3 172 0.000 
2 3 173 0.000 
2 3 174 0.582 
2 3 175 0.520 
2 3 176 0.783 
2 3 177 1.538 
2 3 178 1.250 
2 3 179 1.000 
2 3 180 0.659 
2 3 181 0.000 
2 3 182 0.000 
2 3 183 0.000 
2 3 184 0.000 
2 3 185 0.000 
2 3 186 0.687 
2 3 187 0.902 
2 3 188 1.457 
2 3 189 1.236 
2 3 190 1.142 
2 3 191 0.804 
2 3 192 1.121 
2 3 193 0.000 
2 3 194 0.000 
2 3 195 0.000 
2 3 196 0.000 
2 3 197 0.000 
2 3 198 1.000 
2 3 199 0.655 
2 3 200 1.165 
2 3 201 1.665 
2 3 202 0.903 
2 3 203 11.013 
2 3 204 0.469 
2 3 205 0.765 
2 3 206 0.331 
2 3 207 0.730 
2 3 208 0.688 
2 3 209 0.100 
2 3 210 1.000 
2 3 211 0.821 
2 3 212 0.920 
2 3 213 1.198 
2 3 214 1.153 
2 3 215 0.826 
2 3 216 0.827 
2 3 217 1.111 
2 3 218 0.896 
2 3 219 1.079 
2 3 220 1.082 
2 3 221 1.542 
2 3 222 4.871 
2 3 223 1.006 
2 3 224 1.550 
2 3 225 1.162 
2 3 226 1.335 
2 3 227 1.055 
2 3 228 0.963 
2 3 229 0.869 
2 3 230 1.915 
2 3 231 1.036 
2 3 232 1.000 
2 3 233 1.387 
2 3 234 1.173 
2 3 235 1.235 
2 3 236 0.957 
2 3 237 1.068 
2 3 238 1.011 
2 3 239 1.045 
2 3 240 0.990 
2 3 241 1.081 
2 3 242 1.190 
2 3 243 1.194 
2 3 244 1.026 
2 3 245 1.750 
2 3 246 1.012 
2 3 247 1.051 
2 3 248 1.227 
2 3 249 1.053 
2 3 250 0.917 
2 3 251 1.068 
2 3 252 1.018 
2 3 253 0.981 
2 3 254 1.183 
2 3 255 0.827 
2 3 256 1.262 
2 3 257 1.625 
2 3 258 1.310 
2 3 259 1.000 
2 3 260 1.287 
2 3 261 1.098 
2 3 262 1.160 
2 3 263 0.980 
2 3 264 1.132 
2 3 265 0.967 
2 3 266 1.042 
2 3 267 0.716 
2 3 268 0.771 
2 3 269 1.100 
2 3 270 0.942 
2 3 271 1.071 
2 3 272 0.956 
2 3 273 0.942 
2 3 274 0.904 
2 3 275 1.016 
2 3 276 0.835 
2 3 277 1.044 
2 3 278 1.176 
2 3 279 1.063 
2 3 280 1.248 
2 3 281 1.027 
2 3 282 1.150 
2 3 283 1.329 
2 3 284 1.015 
2 3 285 1.102 
2 3 286 1.003 
2 3 287 1.012 
2 3 288 1.144 
2 4 1 0.778 
2 4 2 1.125 
2 4 3 0.682 
2 4 4 1.222 
2 4 5 0.656 
2 4 6 1.550 
2 4 7 0.654 
2 4 8 5.497 
2 4 9 1.430 
2 4 10 1.090 
2 4 11 0.780 
2 4 12 0.706 
2 4 13 0.684 
2 4 14 1.220 
2 4 15 0.881 
2 4 16 1.225 
2 4 17 1.173 
2 4 18 2.335 
2 4 19 0.648 
2 4 20 1.004 
2 4 21 0.819 
2 4 22 1.035 
2 4 23 1.315 
2 4 24 0.659 
2 4 25 0.968 
2 4 26 1.258 
2 4 27 1.656 
2 4 28 1.010 
2 4 29 1.094 
2 4 30 1.166 
2 4 31 1.520 
2 4 32 1.533 
2 4 33 1.336 
2 4 34 0.974 
2 4 35 1.136 
2 4 36 1.391 
2 4 37 1.277 
2 4 38 1.144 
2 4 39 1.185 
2 4 40 1.416 
2 4 41 0.935 
2 4 42 0.918 
2 4 43 1.029 
2 4 44 0.953 
2 4 45 1.045 
2 4 46 0.968 
2 4 47 0.795 
2 4 48 0.943 
2 4 49 0.911 
2 4 50 1.092 
2 4 51 1.008 
2 4 52 1.376 
2 4 53 1.171 
2 4 54 1.340 
2 4 55 0.877 
2 4 56 1.517 
2 4 57 0.972 
2 4 58 1.650 
2 4 59 0.963 
2 4 60 1.480 
2 4 61 0.441 
2 4 62 0.486 
2 4 63 0.778 
2 4 64 0.906 
2 4 65 1.744 
2 4 66 1.853 
2 4 67 1.061 
2 4 68 1.608 
2 4 69 1.100 
2 4 70 1.045 
2 4 71 0.948 
2 4 72 0.866 
2 4 73 0.412 
2 4 74 0.524 
2 4 75 0.632 
2 4 76 0.424 
2 4 77 0.815 
2 4 78 1.121 
2 4 79 1.189 
2 4 80 0.250 
2 4 81 1.104 
2 4 82 0.858 
2 4 83 0.897 
2 4 84 1.004 
2 4 85 0.000 
2 4 86 0.000 
2 4 87 0.000 
2 4 88 0.000 
2 4 89 0.000 
2 4 90 0.796 
2 4 91 0.921 
2 4 92 1.510 
2 4 93 0.987 
2 4 94 0.982 
2 4 95 0.816 
2 4 96 0.944 
2 4 97 0.000 
2 4 98 0.000 
2 4 99 0.000 
2 4 100 0.000 
2 4 101 0.000 
2 4 102 0.711 
2 4 103 0.715 
2 4 104 2.409 
2 4 105 1.247 
2 4 106 1.377 
2 4 107 1.273 
2 4 108 0.921 
2 4 109 0.000 
2 4 110 0.000 
2 4 111 0.000 
2 4 112 0.000 
2 4 113 0.000 
2 4 114 0.557 
2 4 115 0.665 
2 4 116 2.272 
2 4 117 1.296 
2 4 118 1.155 
2 4 119 1.612 
2 4 120 1.079 
2 4 121 0.000 
2 4 122 0.000 
2 4 123 0.000 
2 4 124 0.000 
2 4 125 0.000 
2 4 126 0.515 
2 4 127 0.649 
2 4 128 1.046 
2 4 129 0.910 
2 4 130 1.006 
2 4 131 0.789 
2 4 132 1.213 
2 4 133 0.000 
2 4 134 0.000 
2 4 135 0.000 
2 4 136 0.000 
2 4 137 0.000 
2 4 138 0.409 
2 4 139 0.782 
2 4 140 1.216 
2 4 141 1.096 
2 4 142 0.879 
2 4 143 1.237 
2 4 144 0.754 
2 4 145 0.000 
2 4 146 0.000 
2 4 147 0.000 
2 4 148 0.000 
2 4 149 0.000 
2 4 150 0.443 
2 4 151 0.731 
2 4 152 1.280 
2 4 153 1.284 
2 4 154 1.835 
2 4 155 0.994 
2 4 156 0.770 
2 4 157 0.000 
2 4 158 0.000 
2 4 159 0.000 
2 4 160 0.000 
2 4 161 0.000 
2 4 162 0.502 
2 4 163 0.743 
2 4 164 1.474 
2 4 165 1.431 
2 4 166 1.038 
2 4 167 1.182 
2 4 168 0.979 
2 4 169 0.000 
2 4 170 0.000 
2 4 171 0.000 
2 4 172 0.000 
2 4 173 0.000 
2 4 174 0.533 
2 4 175 0.624 
2 4 176 1.159 
2 4 177 0.986 
2 4 178 1.426 
2 4 179 1.079 
2 4 180 1.181 
2 4 181 0.000 
2 4 182 0.000 
2 4 183 0.000 
2 4 184 0.000 
2 4 185 0.000 
2 4 186 0.772 
2 4 187 0.532 
2 4 188 1.112 
2 4 189 0.954 
2 4 190 1.111 
2 4 191 1.005 
2 4 192 0.893 
2 4 193 0.000 
2 4 194 0.000 
2 4 195 0.000 
2 4 196 0.000 
2 4 197 0.000 
2 4 198 1.000 
2 4 199 1.153 
2 4 200 1.064 
2 4 201 1.141 
2 4 202 1.025 
2 4 203 1.160 
2 4 204 1.709 
2 4 205 2.440 
2 4 206 0.515 
2 4 207 0.498 
2 4 208 1.215 
2 4 209 1.489 
2 4 210 1.321 
2 4 211 0.731 
2 4 212 1.276 
2 4 213 0.836 
2 4 214 1.259 
2 4 215 1.100 
2 4 216 0.626 
2 4 217 0.848 
2 4 218 0.885 
2 4 219 1.060 
2 4 220 0.451 
2 4 221 2.108 
2 4 222 1.737 
2 4 223 1.088 
2 4 224 1.172 
2 4 225 0.975 
2 4 226 1.043 
2 4 227 1.360 
2 4 228 0.963 
2 4 229 2.212 
2 4 230 1.166 
2 4 231 1.578 
2 4 232 47.900 
2 4 233 1.272 
2 4 234 0.817 
2 4 235 1.252 
2 4 236 0.765 
2 4 237 1.363 
2 4 238 1.343 
2 4 239 1.020 
2 4 240 1.110 
2 4 241 5.111 
2 4 242 1.048 
2 4 243 0.977 
2 4 244 1.482 
2 4 245 2.530 
2 4 246 1.037 
2 4 247 1.101 
2 4 248 0.871 
2 4 249 1.187 
2 4 250 1.091 
2 4 251 1.066 
2 4 252 1.127 
2 4 253 1.468 
2 4 254 0.978 
2 4 255 0.995 
2 4 256 1.412 
2 4 257 1.131 
2 4 258 0.885 
2 4 259 1.195 
2 4 260 1.230 
2 4 261 1.029 
2 4 262 1.191 
2 4 263 0.914 
2 4 264 0.921 
2 4 265 0.852 
2 4 266 1.409 
2 4 267 0.834 
2 4 268 1.385 
2 4 269 2.281 
2 4 270 0.778 
2 4 271 0.996 
2 4 272 1.073 
2 4 273 1.104 
2 4 274 1.046 
2 4 275 1.060 
2 4 276 0.790 
2 4 277 2.128 
2 4 278 1.711 
2 4 279 1.216 
2 4 280 1.755 
2 4 281 1.133 
2 4 282 2.224 
2 4 283 1.308 
2 4 284 1.001 
2 4 285 0.824 
2 4 286 0.732 
2 4 287 0.925 
2 4 288 0.941 
