1434309789 1   -1 
1434309789 2   0 
1434309789 3   0 
1434309789 4   1 
1434309789 5   0 
1434309789 6   0 
1434309789 7   -1 
1434309789 8   0 
1434309789 9   0 
1434309789 10   1 
1434309789 11   0 
1434309789 12   0 
1434309789 13   1 
1434309789 14   0 
1434309789 15   0 
1434309789 16   -1 
1434309789 17   0 
1434309789 18   0 
1434309789 19   1 
1434309789 20   0 
1434309789 21   0 
1434309789 22   -1 
1434309789 23   0 
1434309789 24   0 
1434309789 25   1 
1434309789 26   0 
1434309789 27   0 
1434309789 28   -1 
1434309789 29   0 
1434309789 30   0 
1434309789 31   1 
1434309789 32   0 
1434309789 33   0 
1434309789 34   -1 
1434309789 35   0 
1434309789 36   0 
1434309789 37   -1 
1434309789 38   0 
1434309789 39   0 
1434309789 40   1 
1434309789 41   0 
1434309789 42   0 
1434309789 43   -1 
1434309789 44   0 
1434309789 45   0 
1434309789 46   1 
1434309789 47   0 
1434309789 48   0 
1434309789 49   1 
1434309789 50   0 
1434309789 51   0 
1434309789 52   -1 
1434309789 53   0 
1434309789 54   0 
1434309789 55   1 
1434309789 56   0 
1434309789 57   0 
1434309789 58   -1 
1434309789 59   0 
1434309789 60   0 
1434309789 61   -1 
1434309789 62   0 
1434309789 63   0 
1434309789 64   1 
1434309789 65   0 
1434309789 66   0 
1434309789 67   -1 
1434309789 68   0 
1434309789 69   0 
1434309789 70   1 
1434309789 71   0 
1434309789 72   0 
1434309789 73   -1 
1434309789 74   0 
1434309789 75   0 
1434309789 76   1 
1434309789 77   0 
1434309789 78   0 
1434309789 79   -1 
1434309789 80   0 
1434309789 81   0 
1434309789 82   1 
1434309789 83   0 
1434309789 84   0 
1434309789 85   1 
1434309789 86   0 
1434309789 87   0 
1434309789 88   -1 
1434309789 89   0 
1434309789 90   0 
1434309789 91   1 
1434309789 92   0 
1434309789 93   0 
1434309789 94   -1 
1434309789 95   0 
1434309789 96   0 
1434309789 97   1 
1434309789 98   0 
1434309789 99   0 
1434309789 100   -1 
1434309789 101   0 
1434309789 102   0 
1434309789 103   1 
1434309789 104   0 
1434309789 105   0 
1434309789 106   -1 
1434309789 107   0 
1434309789 108   0 
1434309789 109   -1 
1434309789 110   0 
1434309789 111   0 
1434309789 112   1 
1434309789 113   0 
1434309789 114   0 
1434309789 115   -1 
1434309789 116   0 
1434309789 117   0 
1434309789 118   1 
1434309789 119   0 
1434309789 120   0 
1434309789 121   1 
1434309789 122   0 
1434309789 123   0 
1434309789 124   -1 
1434309789 125   0 
1434309789 126   0 
1434309789 127   1 
1434309789 128   0 
1434309789 129   0 
1434309789 130   -1 
1434309789 131   0 
1434309789 132   0 
1434309789 133   -1 
1434309789 134   0 
1434309789 135   0 
1434309789 136   1 
1434309789 137   0 
1434309789 138   0 
1434309789 139   -1 
1434309789 140   0 
1434309789 141   0 
1434309789 142   1 
1434309789 143   0 
1434309789 144   0 
1434309789 145   -1 
1434309789 146   0 
1434309789 147   0 
1434309789 148   1 
1434309789 149   0 
1434309789 150   0 
1434309789 151   -1 
1434309789 152   0 
1434309789 153   0 
1434309789 154   1 
1434309789 155   0 
1434309789 156   0 
1434309789 157   1 
1434309789 158   0 
1434309789 159   0 
1434309789 160   -1 
1434309789 161   0 
1434309789 162   0 
1434309789 163   1 
1434309789 164   0 
1434309789 165   0 
1434309789 166   -1 
1434309789 167   0 
1434309789 168   0 
1434309789 169   1 
1434309789 170   0 
1434309789 171   0 
1434309789 172   -1 
1434309789 173   0 
1434309789 174   0 
1434309789 175   1 
1434309789 176   0 
1434309789 177   0 
1434309789 178   -1 
1434309789 179   0 
1434309789 180   0 
1434309789 181   -1 
1434309789 182   0 
1434309789 183   0 
1434309789 184   1 
1434309789 185   0 
1434309789 186   0 
1434309789 187   -1 
1434309789 188   0 
1434309789 189   0 
1434309789 190   1 
1434309789 191   0 
1434309789 192   0 
1434309789 193   1 
1434309789 194   0 
1434309789 195   0 
1434309789 196   -1 
1434309789 197   0 
1434309789 198   0 
1434309789 199   1 
1434309789 200   0 
1434309789 201   0 
1434309789 202   -1 
1434309789 203   0 
1434309789 204   0 
1434309789 205   -1 
1434309789 206   0 
1434309789 207   0 
1434309789 208   1 
1434309789 209   0 
1434309789 210   0 
1434309789 211   -1 
1434309789 212   0 
1434309789 213   0 
1434309789 214   1 
1434309789 215   0 
1434309789 216   0 
1434309789 217   -1 
1434309789 218   0 
1434309789 219   0 
1434309789 220   1 
1434309789 221   0 
1434309789 222   0 
1434309789 223   -1 
1434309789 224   0 
1434309789 225   0 
1434309789 226   1 
1434309789 227   0 
1434309789 228   0 
1434309789 229   1 
1434309789 230   0 
1434309789 231   0 
1434309789 232   -1 
1434309789 233   0 
1434309789 234   0 
1434309789 235   1 
1434309789 236   0 
1434309789 237   0 
1434309789 238   -1 
1434309789 239   0 
1434309789 240   0 
1434309789 241   1 
1434309789 242   0 
1434309789 243   0 
1434309789 244   -1 
1434309789 245   0 
1434309789 246   0 
1434309789 247   1 
1434309789 248   0 
1434309789 249   0 
1434309789 250   -1 
1434309789 251   0 
1434309789 252   0 
1434309789 253   -1 
1434309789 254   0 
1434309789 255   0 
1434309789 256   1 
1434309789 257   0 
1434309789 258   0 
1434309789 259   -1 
1434309789 260   0 
1434309789 261   0 
1434309789 262   1 
1434309789 263   0 
1434309789 264   0 
1434309789 265   1 
1434309789 266   0 
1434309789 267   0 
1434309789 268   -1 
1434309789 269   0 
1434309789 270   0 
1434309789 271   1 
1434309789 272   0 
1434309789 273   0 
1434309789 274   -1 
1434309789 275   0 
1434309789 276   0 
1434309789 277   -1 
1434309789 278   0 
1434309789 279   0 
1434309789 280   1 
1434309789 281   0 
1434309789 282   0 
1434309789 283   -1 
1434309789 284   0 
1434309789 285   0 
1434309789 286   1 
1434309789 287   0 
1434309789 288   0 
1434309789 289   -1 
1434309789 290   0 
1434309789 291   0 
1434309789 292   1 
1434309789 293   0 
1434309789 294   0 
1434309789 295   -1 
1434309789 296   0 
1434309789 297   0 
1434309789 298   1 
1434309789 299   0 
1434309789 300   0 
1434309789 301   1 
1434309789 302   0 
1434309789 303   0 
1434309789 304   -1 
1434309789 305   0 
1434309789 306   0 
1434309789 307   1 
1434309789 308   0 
1434309789 309   0 
1434309789 310   -1 
1434309789 311   0 
1434309789 312   0 
1434309789 313   1 
1434309789 314   0 
1434309789 315   0 
1434309789 316   -1 
1434309789 317   0 
1434309789 318   0 
1434309789 319   1 
1434309789 320   0 
1434309789 321   0 
1434309789 322   -1 
1434309789 323   0 
1434309789 324   0 
1434309789 325   -1 
1434309789 326   0 
1434309789 327   0 
1434309789 328   1 
1434309789 329   0 
1434309789 330   0 
1434309789 331   -1 
1434309789 332   0 
1434309789 333   0 
1434309789 334   0 
1434309789 335   0 
1434309789 336   0 
1434309789 337   0 
1434309789 338   0 
1434309789 339   0 
1434309789 340   0 
1434309789 341   0 
1434309789 342   0 
1434309789 343   0 
1434309789 344   0 
1434309789 345   0 
1434309789 346   0 
1434309789 347   0 
1434309789 348   0 
1434309789 349   0 
1434309789 350   0 
1434309789 351   0 
1434309789 352   0 
1434309789 353   0 
1434309789 354   0 
1434309789 355   0 
1434309789 356   0 
1434309789 357   0 
1434309789 358   0 
1434309789 359   0 
1434309789 360   0 
