1426683705 1   -1 
1426683705 2   0 
1426683705 3   0 
1426683705 4   1 
1426683705 5   0 
1426683705 6   0 
1426683705 7   -1 
1426683705 8   0 
1426683705 9   0 
1426683705 10   1 
1426683705 11   0 
1426683705 12   0 
1426683705 13   1 
1426683705 14   0 
1426683705 15   0 
1426683705 16   -1 
1426683705 17   0 
1426683705 18   0 
1426683705 19   1 
1426683705 20   0 
1426683705 21   0 
1426683705 22   -1 
1426683705 23   0 
1426683705 24   0 
1426683705 25   1 
1426683705 26   0 
1426683705 27   0 
1426683705 28   -1 
1426683705 29   0 
1426683705 30   0 
1426683705 31   1 
1426683705 32   0 
1426683705 33   0 
1426683705 34   -1 
1426683705 35   0 
1426683705 36   0 
1426683705 37   -1 
1426683705 38   0 
1426683705 39   0 
1426683705 40   1 
1426683705 41   0 
1426683705 42   0 
1426683705 43   -1 
1426683705 44   0 
1426683705 45   0 
1426683705 46   1 
1426683705 47   0 
1426683705 48   0 
1426683705 49   1 
1426683705 50   0 
1426683705 51   0 
1426683705 52   -1 
1426683705 53   0 
1426683705 54   0 
1426683705 55   1 
1426683705 56   0 
1426683705 57   0 
1426683705 58   -1 
1426683705 59   0 
1426683705 60   0 
1426683705 61   -1 
1426683705 62   0 
1426683705 63   0 
1426683705 64   1 
1426683705 65   0 
1426683705 66   0 
1426683705 67   -1 
1426683705 68   0 
1426683705 69   0 
1426683705 70   1 
1426683705 71   0 
1426683705 72   0 
1426683705 73   -1 
1426683705 74   0 
1426683705 75   0 
1426683705 76   1 
1426683705 77   0 
1426683705 78   0 
1426683705 79   -1 
1426683705 80   0 
1426683705 81   0 
1426683705 82   1 
1426683705 83   0 
1426683705 84   0 
1426683705 85   1 
1426683705 86   0 
1426683705 87   0 
1426683705 88   -1 
1426683705 89   0 
1426683705 90   0 
1426683705 91   1 
1426683705 92   0 
1426683705 93   0 
1426683705 94   -1 
1426683705 95   0 
1426683705 96   0 
1426683705 97   1 
1426683705 98   0 
1426683705 99   0 
1426683705 100   -1 
1426683705 101   0 
1426683705 102   0 
1426683705 103   1 
1426683705 104   0 
1426683705 105   0 
1426683705 106   -1 
1426683705 107   0 
1426683705 108   0 
1426683705 109   -1 
1426683705 110   0 
1426683705 111   0 
1426683705 112   1 
1426683705 113   0 
1426683705 114   0 
1426683705 115   -1 
1426683705 116   0 
1426683705 117   0 
1426683705 118   1 
1426683705 119   0 
1426683705 120   0 
1426683705 121   1 
1426683705 122   0 
1426683705 123   0 
1426683705 124   -1 
1426683705 125   0 
1426683705 126   0 
1426683705 127   1 
1426683705 128   0 
1426683705 129   0 
1426683705 130   -1 
1426683705 131   0 
1426683705 132   0 
1426683705 133   -1 
1426683705 134   0 
1426683705 135   0 
1426683705 136   1 
1426683705 137   0 
1426683705 138   0 
1426683705 139   -1 
1426683705 140   0 
1426683705 141   0 
1426683705 142   1 
1426683705 143   0 
1426683705 144   0 
1426683705 145   -1 
1426683705 146   0 
1426683705 147   0 
1426683705 148   1 
1426683705 149   0 
1426683705 150   0 
1426683705 151   -1 
1426683705 152   0 
1426683705 153   0 
1426683705 154   1 
1426683705 155   0 
1426683705 156   0 
1426683705 157   1 
1426683705 158   0 
1426683705 159   0 
1426683705 160   -1 
1426683705 161   0 
1426683705 162   0 
1426683705 163   1 
1426683705 164   0 
1426683705 165   0 
1426683705 166   -1 
1426683705 167   0 
1426683705 168   0 
1426683705 169   1 
1426683705 170   0 
1426683705 171   0 
1426683705 172   -1 
1426683705 173   0 
1426683705 174   0 
1426683705 175   1 
1426683705 176   0 
1426683705 177   0 
1426683705 178   -1 
1426683705 179   0 
1426683705 180   0 
1426683705 181   -1 
1426683705 182   0 
1426683705 183   0 
1426683705 184   1 
1426683705 185   0 
1426683705 186   0 
1426683705 187   -1 
1426683705 188   0 
1426683705 189   0 
1426683705 190   1 
1426683705 191   0 
1426683705 192   0 
1426683705 193   1 
1426683705 194   0 
1426683705 195   0 
1426683705 196   -1 
1426683705 197   0 
1426683705 198   0 
1426683705 199   1 
1426683705 200   0 
1426683705 201   0 
1426683705 202   -1 
1426683705 203   0 
1426683705 204   0 
1426683705 205   -1 
1426683705 206   0 
1426683705 207   0 
1426683705 208   1 
1426683705 209   0 
1426683705 210   0 
1426683705 211   -1 
1426683705 212   0 
1426683705 213   0 
1426683705 214   1 
1426683705 215   0 
1426683705 216   0 
1426683705 217   -1 
1426683705 218   0 
1426683705 219   0 
1426683705 220   1 
1426683705 221   0 
1426683705 222   0 
1426683705 223   -1 
1426683705 224   0 
1426683705 225   0 
1426683705 226   1 
1426683705 227   0 
1426683705 228   0 
1426683705 229   1 
1426683705 230   0 
1426683705 231   0 
1426683705 232   -1 
1426683705 233   0 
1426683705 234   0 
1426683705 235   1 
1426683705 236   0 
1426683705 237   0 
1426683705 238   -1 
1426683705 239   0 
1426683705 240   0 
1426683705 241   1 
1426683705 242   0 
1426683705 243   0 
1426683705 244   -1 
1426683705 245   0 
1426683705 246   0 
1426683705 247   1 
1426683705 248   0 
1426683705 249   0 
1426683705 250   -1 
1426683705 251   0 
1426683705 252   0 
1426683705 253   -1 
1426683705 254   0 
1426683705 255   0 
1426683705 256   1 
1426683705 257   0 
1426683705 258   0 
1426683705 259   -1 
1426683705 260   0 
1426683705 261   0 
1426683705 262   1 
1426683705 263   0 
1426683705 264   0 
1426683705 265   1 
1426683705 266   0 
1426683705 267   0 
1426683705 268   -1 
1426683705 269   0 
1426683705 270   0 
1426683705 271   1 
1426683705 272   0 
1426683705 273   0 
1426683705 274   -1 
1426683705 275   0 
1426683705 276   0 
1426683705 277   -1 
1426683705 278   0 
1426683705 279   0 
1426683705 280   1 
1426683705 281   0 
1426683705 282   0 
1426683705 283   -1 
1426683705 284   0 
1426683705 285   0 
1426683705 286   1 
1426683705 287   0 
1426683705 288   0 
1426683705 289   -1 
1426683705 290   0 
1426683705 291   0 
1426683705 292   1 
1426683705 293   0 
1426683705 294   0 
1426683705 295   -1 
1426683705 296   0 
1426683705 297   0 
1426683705 298   1 
1426683705 299   0 
1426683705 300   0 
1426683705 301   1 
1426683705 302   0 
1426683705 303   0 
1426683705 304   -1 
1426683705 305   0 
1426683705 306   0 
1426683705 307   1 
1426683705 308   0 
1426683705 309   0 
1426683705 310   -1 
1426683705 311   0 
1426683705 312   0 
1426683705 313   1 
1426683705 314   0 
1426683705 315   0 
1426683705 316   -1 
1426683705 317   0 
1426683705 318   0 
1426683705 319   1 
1426683705 320   0 
1426683705 321   0 
1426683705 322   -1 
1426683705 323   0 
1426683705 324   0 
1426683705 325   -1 
1426683705 326   0 
1426683705 327   0 
1426683705 328   1 
1426683705 329   0 
1426683705 330   0 
1426683705 331   -1 
1426683705 332   0 
1426683705 333   0 
1426683705 334   0 
1426683705 335   0 
1426683705 336   0 
1426683705 337   0 
1426683705 338   0 
1426683705 339   0 
1426683705 340   0 
1426683705 341   0 
1426683705 342   0 
1426683705 343   0 
1426683705 344   0 
1426683705 345   0 
1426683705 346   0 
1426683705 347   0 
1426683705 348   0 
1426683705 349   0 
1426683705 350   0 
1426683705 351   0 
1426683705 352   0 
1426683705 353   0 
1426683705 354   0 
1426683705 355   0 
1426683705 356   0 
1426683705 357   0 
1426683705 358   0 
1426683705 359   0 
1426683705 360   0 
