1423908849 1   1 
1423908849 2   0 
1423908849 3   0 
1423908849 4   1 
1423908849 5   0 
1423908849 6   0 
1423908849 7   -1 
1423908849 8   0 
1423908849 9   0 
1423908849 10   -1 
1423908849 11   0 
1423908849 12   0 
1423908849 13   1 
1423908849 14   0 
1423908849 15   0 
1423908849 16   1 
1423908849 17   0 
1423908849 18   0 
1423908849 19   -1 
1423908849 20   0 
1423908849 21   0 
1423908849 22   -1 
1423908849 23   0 
1423908849 24   0 
1423908849 25   1 
1423908849 26   0 
1423908849 27   0 
1423908849 28   1 
1423908849 29   0 
1423908849 30   0 
1423908849 31   -1 
1423908849 32   0 
1423908849 33   0 
1423908849 34   -1 
1423908849 35   0 
1423908849 36   0 
1423908849 37   1 
1423908849 38   0 
1423908849 39   0 
1423908849 40   1 
1423908849 41   0 
1423908849 42   0 
1423908849 43   -1 
1423908849 44   0 
1423908849 45   0 
1423908849 46   -1 
1423908849 47   0 
1423908849 48   0 
1423908849 49   1 
1423908849 50   0 
1423908849 51   0 
1423908849 52   1 
1423908849 53   0 
1423908849 54   0 
1423908849 55   -1 
1423908849 56   0 
1423908849 57   0 
1423908849 58   -1 
1423908849 59   0 
1423908849 60   0 
1423908849 61   1 
1423908849 62   0 
1423908849 63   0 
1423908849 64   1 
1423908849 65   0 
1423908849 66   0 
1423908849 67   -1 
1423908849 68   0 
1423908849 69   0 
1423908849 70   -1 
1423908849 71   0 
1423908849 72   0 
1423908849 73   1 
1423908849 74   0 
1423908849 75   0 
1423908849 76   1 
1423908849 77   0 
1423908849 78   0 
1423908849 79   -1 
1423908849 80   0 
1423908849 81   0 
1423908849 82   -1 
1423908849 83   0 
1423908849 84   0 
1423908849 85   1 
1423908849 86   0 
1423908849 87   0 
1423908849 88   1 
1423908849 89   0 
1423908849 90   0 
1423908849 91   -1 
1423908849 92   0 
1423908849 93   0 
1423908849 94   -1 
1423908849 95   0 
1423908849 96   0 
1423908849 97   1 
1423908849 98   0 
1423908849 99   0 
1423908849 100   1 
1423908849 101   0 
1423908849 102   0 
1423908849 103   -1 
1423908849 104   0 
1423908849 105   0 
1423908849 106   -1 
1423908849 107   0 
1423908849 108   0 
1423908849 109   1 
1423908849 110   0 
1423908849 111   0 
1423908849 112   1 
1423908849 113   0 
1423908849 114   0 
1423908849 115   -1 
1423908849 116   0 
1423908849 117   0 
1423908849 118   -1 
1423908849 119   0 
1423908849 120   0 
1423908849 121   1 
1423908849 122   0 
1423908849 123   0 
1423908849 124   1 
1423908849 125   0 
1423908849 126   0 
1423908849 127   -1 
1423908849 128   0 
1423908849 129   0 
1423908849 130   -1 
1423908849 131   0 
1423908849 132   0 
1423908849 133   1 
1423908849 134   0 
1423908849 135   0 
1423908849 136   1 
1423908849 137   0 
1423908849 138   0 
1423908849 139   -1 
1423908849 140   0 
1423908849 141   0 
1423908849 142   -1 
1423908849 143   0 
1423908849 144   0 
1423908849 145   1 
1423908849 146   0 
1423908849 147   0 
1423908849 148   1 
1423908849 149   0 
1423908849 150   0 
1423908849 151   -1 
1423908849 152   0 
1423908849 153   0 
1423908849 154   -1 
1423908849 155   0 
1423908849 156   0 
1423908849 157   1 
1423908849 158   0 
1423908849 159   0 
1423908849 160   1 
1423908849 161   0 
1423908849 162   0 
1423908849 163   -1 
1423908849 164   0 
1423908849 165   0 
1423908849 166   -1 
1423908849 167   0 
1423908849 168   0 
1423908849 169   1 
1423908849 170   0 
1423908849 171   0 
1423908849 172   1 
1423908849 173   0 
1423908849 174   0 
1423908849 175   -1 
1423908849 176   0 
1423908849 177   0 
1423908849 178   -1 
1423908849 179   0 
1423908849 180   0 
1423908849 181   1 
1423908849 182   0 
1423908849 183   0 
1423908849 184   1 
1423908849 185   0 
1423908849 186   0 
1423908849 187   -1 
1423908849 188   0 
1423908849 189   0 
1423908849 190   -1 
1423908849 191   0 
1423908849 192   0 
1423908849 193   1 
1423908849 194   0 
1423908849 195   0 
1423908849 196   1 
1423908849 197   0 
1423908849 198   0 
1423908849 199   -1 
1423908849 200   0 
1423908849 201   0 
1423908849 202   -1 
1423908849 203   0 
1423908849 204   0 
1423908849 205   1 
1423908849 206   0 
1423908849 207   0 
1423908849 208   1 
1423908849 209   0 
1423908849 210   0 
1423908849 211   -1 
1423908849 212   0 
1423908849 213   0 
1423908849 214   -1 
1423908849 215   0 
1423908849 216   0 
1423908849 217   1 
1423908849 218   0 
1423908849 219   0 
1423908849 220   1 
1423908849 221   0 
1423908849 222   0 
1423908849 223   -1 
1423908849 224   0 
1423908849 225   0 
1423908849 226   -1 
1423908849 227   0 
1423908849 228   0 
1423908849 229   1 
1423908849 230   0 
1423908849 231   0 
1423908849 232   1 
1423908849 233   0 
1423908849 234   0 
1423908849 235   -1 
1423908849 236   0 
1423908849 237   0 
1423908849 238   -1 
1423908849 239   0 
1423908849 240   0 
1423908849 241   1 
1423908849 242   0 
1423908849 243   0 
1423908849 244   1 
1423908849 245   0 
1423908849 246   0 
1423908849 247   -1 
1423908849 248   0 
1423908849 249   0 
1423908849 250   -1 
1423908849 251   0 
1423908849 252   0 
1423908849 253   1 
1423908849 254   0 
1423908849 255   0 
1423908849 256   1 
1423908849 257   0 
1423908849 258   0 
1423908849 259   -1 
1423908849 260   0 
1423908849 261   0 
1423908849 262   -1 
1423908849 263   0 
1423908849 264   0 
1423908849 265   1 
1423908849 266   0 
1423908849 267   0 
1423908849 268   1 
1423908849 269   0 
1423908849 270   0 
1423908849 271   -1 
1423908849 272   0 
1423908849 273   0 
1423908849 274   -1 
1423908849 275   0 
1423908849 276   0 
1423908849 277   1 
1423908849 278   0 
1423908849 279   0 
1423908849 280   1 
1423908849 281   0 
1423908849 282   0 
1423908849 283   -1 
1423908849 284   0 
1423908849 285   0 
1423908849 286   -1 
1423908849 287   0 
1423908849 288   0 
1423908849 289   1 
1423908849 290   0 
1423908849 291   0 
1423908849 292   1 
1423908849 293   0 
1423908849 294   0 
1423908849 295   -1 
1423908849 296   0 
1423908849 297   0 
1423908849 298   -1 
1423908849 299   0 
1423908849 300   0 
1423908849 301   1 
1423908849 302   0 
1423908849 303   0 
1423908849 304   1 
1423908849 305   0 
1423908849 306   0 
1423908849 307   -1 
1423908849 308   0 
1423908849 309   0 
1423908849 310   -1 
1423908849 311   0 
1423908849 312   0 
1423908849 313   1 
1423908849 314   0 
1423908849 315   0 
1423908849 316   1 
1423908849 317   0 
1423908849 318   0 
1423908849 319   -1 
1423908849 320   0 
1423908849 321   0 
1423908849 322   -1 
1423908849 323   0 
1423908849 324   0 
1423908849 325   1 
1423908849 326   0 
1423908849 327   0 
1423908849 328   1 
1423908849 329   0 
1423908849 330   0 
1423908849 331   -1 
1423908849 332   0 
1423908849 333   0 
1423908849 334   0 
1423908849 335   0 
1423908849 336   0 
1423908849 337   0 
1423908849 338   0 
1423908849 339   0 
1423908849 340   0 
1423908849 341   0 
1423908849 342   0 
1423908849 343   0 
1423908849 344   0 
1423908849 345   0 
1423908849 346   0 
1423908849 347   0 
1423908849 348   0 
1423908849 349   0 
1423908849 350   0 
1423908849 351   0 
1423908849 352   0 
1423908849 353   0 
1423908849 354   0 
1423908849 355   0 
1423908849 356   0 
1423908849 357   0 
1423908849 358   0 
1423908849 359   0 
1423908849 360   0 
