1425443270 1   1 
1425443270 2   0 
1425443270 3   0 
1425443270 4   1 
1425443270 5   0 
1425443270 6   0 
1425443270 7   -1 
1425443270 8   0 
1425443270 9   0 
1425443270 10   -1 
1425443270 11   0 
1425443270 12   0 
1425443270 13   1 
1425443270 14   0 
1425443270 15   0 
1425443270 16   1 
1425443270 17   0 
1425443270 18   0 
1425443270 19   -1 
1425443270 20   0 
1425443270 21   0 
1425443270 22   -1 
1425443270 23   0 
1425443270 24   0 
1425443270 25   1 
1425443270 26   0 
1425443270 27   0 
1425443270 28   1 
1425443270 29   0 
1425443270 30   0 
1425443270 31   -1 
1425443270 32   0 
1425443270 33   0 
1425443270 34   -1 
1425443270 35   0 
1425443270 36   0 
1425443270 37   1 
1425443270 38   0 
1425443270 39   0 
1425443270 40   1 
1425443270 41   0 
1425443270 42   0 
1425443270 43   -1 
1425443270 44   0 
1425443270 45   0 
1425443270 46   -1 
1425443270 47   0 
1425443270 48   0 
1425443270 49   1 
1425443270 50   0 
1425443270 51   0 
1425443270 52   1 
1425443270 53   0 
1425443270 54   0 
1425443270 55   -1 
1425443270 56   0 
1425443270 57   0 
1425443270 58   -1 
1425443270 59   0 
1425443270 60   0 
1425443270 61   1 
1425443270 62   0 
1425443270 63   0 
1425443270 64   1 
1425443270 65   0 
1425443270 66   0 
1425443270 67   -1 
1425443270 68   0 
1425443270 69   0 
1425443270 70   -1 
1425443270 71   0 
1425443270 72   0 
1425443270 73   1 
1425443270 74   0 
1425443270 75   0 
1425443270 76   1 
1425443270 77   0 
1425443270 78   0 
1425443270 79   -1 
1425443270 80   0 
1425443270 81   0 
1425443270 82   -1 
1425443270 83   0 
1425443270 84   0 
1425443270 85   1 
1425443270 86   0 
1425443270 87   0 
1425443270 88   1 
1425443270 89   0 
1425443270 90   0 
1425443270 91   -1 
1425443270 92   0 
1425443270 93   0 
1425443270 94   -1 
1425443270 95   0 
1425443270 96   0 
1425443270 97   1 
1425443270 98   0 
1425443270 99   0 
1425443270 100   1 
1425443270 101   0 
1425443270 102   0 
1425443270 103   -1 
1425443270 104   0 
1425443270 105   0 
1425443270 106   -1 
1425443270 107   0 
1425443270 108   0 
1425443270 109   1 
1425443270 110   0 
1425443270 111   0 
1425443270 112   1 
1425443270 113   0 
1425443270 114   0 
1425443270 115   -1 
1425443270 116   0 
1425443270 117   0 
1425443270 118   -1 
1425443270 119   0 
1425443270 120   0 
1425443270 121   1 
1425443270 122   0 
1425443270 123   0 
1425443270 124   1 
1425443270 125   0 
1425443270 126   0 
1425443270 127   -1 
1425443270 128   0 
1425443270 129   0 
1425443270 130   -1 
1425443270 131   0 
1425443270 132   0 
1425443270 133   1 
1425443270 134   0 
1425443270 135   0 
1425443270 136   1 
1425443270 137   0 
1425443270 138   0 
1425443270 139   -1 
1425443270 140   0 
1425443270 141   0 
1425443270 142   -1 
1425443270 143   0 
1425443270 144   0 
1425443270 145   1 
1425443270 146   0 
1425443270 147   0 
1425443270 148   1 
1425443270 149   0 
1425443270 150   0 
1425443270 151   -1 
1425443270 152   0 
1425443270 153   0 
1425443270 154   -1 
1425443270 155   0 
1425443270 156   0 
1425443270 157   1 
1425443270 158   0 
1425443270 159   0 
1425443270 160   1 
1425443270 161   0 
1425443270 162   0 
1425443270 163   -1 
1425443270 164   0 
1425443270 165   0 
1425443270 166   -1 
1425443270 167   0 
1425443270 168   0 
1425443270 169   1 
1425443270 170   0 
1425443270 171   0 
1425443270 172   1 
1425443270 173   0 
1425443270 174   0 
1425443270 175   -1 
1425443270 176   0 
1425443270 177   0 
1425443270 178   -1 
1425443270 179   0 
1425443270 180   0 
1425443270 181   1 
1425443270 182   0 
1425443270 183   0 
1425443270 184   1 
1425443270 185   0 
1425443270 186   0 
1425443270 187   -1 
1425443270 188   0 
1425443270 189   0 
1425443270 190   -1 
1425443270 191   0 
1425443270 192   0 
1425443270 193   1 
1425443270 194   0 
1425443270 195   0 
1425443270 196   1 
1425443270 197   0 
1425443270 198   0 
1425443270 199   -1 
1425443270 200   0 
1425443270 201   0 
1425443270 202   -1 
1425443270 203   0 
1425443270 204   0 
1425443270 205   1 
1425443270 206   0 
1425443270 207   0 
1425443270 208   1 
1425443270 209   0 
1425443270 210   0 
1425443270 211   -1 
1425443270 212   0 
1425443270 213   0 
1425443270 214   -1 
1425443270 215   0 
1425443270 216   0 
1425443270 217   1 
1425443270 218   0 
1425443270 219   0 
1425443270 220   1 
1425443270 221   0 
1425443270 222   0 
1425443270 223   -1 
1425443270 224   0 
1425443270 225   0 
1425443270 226   -1 
1425443270 227   0 
1425443270 228   0 
1425443270 229   1 
1425443270 230   0 
1425443270 231   0 
1425443270 232   1 
1425443270 233   0 
1425443270 234   0 
1425443270 235   -1 
1425443270 236   0 
1425443270 237   0 
1425443270 238   -1 
1425443270 239   0 
1425443270 240   0 
1425443270 241   1 
1425443270 242   0 
1425443270 243   0 
1425443270 244   1 
1425443270 245   0 
1425443270 246   0 
1425443270 247   -1 
1425443270 248   0 
1425443270 249   0 
1425443270 250   -1 
1425443270 251   0 
1425443270 252   0 
1425443270 253   1 
1425443270 254   0 
1425443270 255   0 
1425443270 256   1 
1425443270 257   0 
1425443270 258   0 
1425443270 259   -1 
1425443270 260   0 
1425443270 261   0 
1425443270 262   -1 
1425443270 263   0 
1425443270 264   0 
1425443270 265   1 
1425443270 266   0 
1425443270 267   0 
1425443270 268   1 
1425443270 269   0 
1425443270 270   0 
1425443270 271   -1 
1425443270 272   0 
1425443270 273   0 
1425443270 274   -1 
1425443270 275   0 
1425443270 276   0 
1425443270 277   1 
1425443270 278   0 
1425443270 279   0 
1425443270 280   1 
1425443270 281   0 
1425443270 282   0 
1425443270 283   -1 
1425443270 284   0 
1425443270 285   0 
1425443270 286   -1 
1425443270 287   0 
1425443270 288   0 
1425443270 289   1 
1425443270 290   0 
1425443270 291   0 
1425443270 292   1 
1425443270 293   0 
1425443270 294   0 
1425443270 295   -1 
1425443270 296   0 
1425443270 297   0 
1425443270 298   -1 
1425443270 299   0 
1425443270 300   0 
1425443270 301   1 
1425443270 302   0 
1425443270 303   0 
1425443270 304   1 
1425443270 305   0 
1425443270 306   0 
1425443270 307   -1 
1425443270 308   0 
1425443270 309   0 
1425443270 310   -1 
1425443270 311   0 
1425443270 312   0 
1425443270 313   1 
1425443270 314   0 
1425443270 315   0 
1425443270 316   1 
1425443270 317   0 
1425443270 318   0 
1425443270 319   -1 
1425443270 320   0 
1425443270 321   0 
1425443270 322   -1 
1425443270 323   0 
1425443270 324   0 
1425443270 325   1 
1425443270 326   0 
1425443270 327   0 
1425443270 328   1 
1425443270 329   0 
1425443270 330   0 
1425443270 331   -1 
1425443270 332   0 
1425443270 333   0 
1425443270 334   0 
1425443270 335   0 
1425443270 336   0 
1425443270 337   0 
1425443270 338   0 
1425443270 339   0 
1425443270 340   0 
1425443270 341   0 
1425443270 342   0 
1425443270 343   0 
1425443270 344   0 
1425443270 345   0 
1425443270 346   0 
1425443270 347   0 
1425443270 348   0 
1425443270 349   0 
1425443270 350   0 
1425443270 351   0 
1425443270 352   0 
1425443270 353   0 
1425443270 354   0 
1425443270 355   0 
1425443270 356   0 
1425443270 357   0 
1425443270 358   0 
1425443270 359   0 
1425443270 360   0 
