1 1 1 1.000 
1 1 2 1.000 
1 1 3 1.000 
1 1 4 1.000 
1 1 5 1.000 
1 1 6 1.000 
1 1 7 1.000 
1 1 8 1.000 
1 1 9 1.000 
1 1 10 1.000 
1 1 11 1.000 
1 1 12 1.000 
1 1 13 1.000 
1 1 14 1.000 
1 1 15 1.000 
1 1 16 1.000 
1 1 17 1.000 
1 1 18 1.000 
1 1 19 1.000 
1 1 20 1.000 
1 1 21 1.000 
1 1 22 1.000 
1 1 23 1.000 
1 1 24 1.000 
1 1 25 1.000 
1 1 26 1.000 
1 1 27 1.000 
1 1 28 1.000 
1 1 29 1.000 
1 1 30 1.000 
1 1 31 1.000 
1 1 32 1.000 
1 1 33 1.000 
1 1 34 1.000 
1 1 35 1.000 
1 1 36 1.000 
1 1 37 1.000 
1 1 38 1.000 
1 1 39 1.000 
1 1 40 1.000 
1 1 41 1.000 
1 1 42 1.000 
1 1 43 1.000 
1 1 44 1.000 
1 1 45 1.000 
1 1 46 1.000 
1 1 47 1.000 
1 1 48 1.000 
1 1 49 1.000 
1 2 1 1.000 
1 2 2 1.000 
1 2 3 1.000 
1 2 4 1.000 
1 2 5 1.000 
1 2 6 1.000 
1 2 7 1.000 
1 2 8 1.000 
1 2 9 1.000 
1 2 10 1.000 
1 2 11 1.000 
1 2 12 1.000 
1 2 13 1.000 
1 2 14 1.000 
1 2 15 1.000 
1 2 16 1.000 
1 2 17 1.000 
1 2 18 1.000 
1 2 19 1.000 
1 2 20 1.000 
1 2 21 1.000 
1 2 22 1.000 
1 2 23 1.000 
1 2 24 1.000 
1 2 25 1.000 
1 2 26 1.000 
1 2 27 1.000 
1 2 28 1.000 
1 2 29 1.000 
1 2 30 1.000 
1 2 31 1.000 
1 2 32 1.000 
1 2 33 1.000 
1 2 34 1.000 
1 2 35 1.000 
1 2 36 1.000 
1 2 37 1.000 
1 2 38 1.000 
1 2 39 1.000 
1 2 40 1.000 
1 2 41 1.000 
1 2 42 1.000 
1 2 43 1.000 
1 2 44 1.000 
1 2 45 1.000 
1 2 46 1.000 
1 2 47 1.000 
1 2 48 1.000 
1 2 49 1.000 
1 3 1 0.000 
1 3 2 0.000 
1 3 3 0.000 
1 3 4 0.000 
1 3 5 0.000 
1 3 6 0.000 
1 3 7 0.000 
1 3 8 0.000 
1 3 9 0.000 
1 3 10 0.000 
1 3 11 0.000 
1 3 12 0.000 
1 3 13 0.000 
1 3 14 0.000 
1 3 15 0.000 
1 3 16 0.000 
1 3 17 0.000 
1 3 18 0.000 
1 3 19 0.000 
1 3 20 0.000 
1 3 21 0.000 
1 3 22 0.000 
1 3 23 0.000 
1 3 24 0.000 
1 3 25 0.000 
1 4 1 0.000 
1 4 2 0.000 
1 4 3 0.000 
1 4 4 0.000 
1 4 5 0.000 
1 4 6 0.000 
1 4 7 0.000 
1 4 8 0.000 
1 4 9 0.000 
1 4 10 0.000 
1 4 11 0.000 
1 4 12 0.000 
1 4 13 0.000 
1 4 14 0.000 
1 4 15 0.000 
1 4 16 0.000 
1 4 17 0.000 
1 4 18 0.000 
1 4 19 0.000 
1 4 20 0.000 
1 4 21 0.000 
1 4 22 0.000 
1 4 23 0.000 
1 4 24 0.000 
1 4 25 0.000 
1 5 1 1.000 
1 5 2 1.000 
1 5 3 1.000 
1 5 4 1.000 
1 5 5 1.000 
1 5 6 1.000 
1 5 7 1.000 
1 6 1 1.000 
1 6 2 1.000 
1 6 3 1.000 
1 6 4 1.000 
1 6 5 1.000 
1 6 6 1.000 
1 6 7 1.000 
2 1 1 165.500 
2 1 2 405.500 
2 1 3 111.500 
2 1 4 270.500 
2 1 5 2.500 
2 1 6 143.500 
2 1 7 304.500 
2 1 8 2.500 
2 1 9 1.500 
2 1 10 6.500 
2 1 11 0.000 
2 1 12 0.000 
2 1 13 0.000 
2 1 14 0.000 
2 1 15 0.000 
2 1 16 0.000 
2 1 17 0.000 
2 1 18 517.500 
2 1 19 320.500 
2 1 20 792.500 
2 1 21 345.500 
2 1 22 175.500 
2 1 23 488.500 
2 1 24 399.500 
2 1 25 126.500 
2 1 26 249.500 
2 1 27 955.500 
2 1 28 10.500 
2 1 29 0.000 
2 1 30 0.000 
2 1 31 0.000 
2 1 32 0.000 
2 1 33 0.000 
2 1 34 0.000 
2 1 35 431.500 
2 1 36 517.500 
2 1 37 440.500 
2 1 38 341.500 
2 1 39 490.500 
2 1 40 519.500 
2 1 41 432.500 
2 1 42 283.500 
2 1 43 744.500 
2 1 44 437.500 
2 1 45 43.500 
2 1 46 411.500 
2 1 47 0.000 
2 1 48 0.000 
2 1 49 0.000 
2 1 50 0.000 
2 1 51 0.000 
2 1 52 556.500 
2 1 53 419.500 
2 1 54 318.500 
2 1 55 425.500 
2 1 56 937.500 
2 1 57 422.500 
2 1 58 360.500 
2 1 59 400.500 
2 1 60 519.500 
2 1 61 550.500 
2 1 62 157.500 
2 1 63 406.500 
2 1 64 34.500 
2 1 65 0.000 
2 1 66 0.000 
2 1 67 0.000 
2 1 68 0.000 
2 1 69 543.500 
2 1 70 396.500 
2 1 71 383.500 
2 1 72 333.500 
2 1 73 459.500 
2 1 74 486.500 
2 1 75 524.500 
2 1 76 388.500 
2 1 77 469.500 
2 1 78 459.500 
2 1 79 292.500 
2 1 80 246.500 
2 1 81 288.500 
2 1 82 120.500 
2 1 83 0.000 
2 1 84 0.000 
2 1 85 0.000 
2 1 86 313.500 
2 1 87 426.500 
2 1 88 409.500 
2 1 89 404.500 
2 1 90 626.500 
2 1 91 415.500 
2 1 92 456.500 
2 1 93 482.500 
2 1 94 430.500 
2 1 95 360.500 
2 1 96 544.500 
2 1 97 261.500 
2 1 98 240.500 
2 1 99 884.500 
2 1 100 102.500 
2 1 101 0.000 
2 1 102 0.000 
2 1 103 428.500 
2 1 104 295.500 
2 1 105 361.500 
2 1 106 325.500 
2 1 107 338.500 
2 1 108 422.500 
2 1 109 552.500 
2 1 110 374.500 
2 1 111 438.500 
2 1 112 417.500 
2 1 113 488.500 
2 1 114 335.500 
2 1 115 351.500 
2 1 116 525.500 
2 1 117 668.500 
2 1 118 743.500 
2 1 119 0.000 
2 1 120 644.500 
2 1 121 583.500 
2 1 122 396.500 
2 1 123 408.500 
2 1 124 423.500 
2 1 125 395.500 
2 1 126 426.500 
2 1 127 630.500 
2 1 128 724.500 
2 1 129 503.500 
2 1 130 91.500 
2 1 131 372.500 
2 1 132 2534.500 
2 1 133 372.500 
2 1 134 692.500 
2 1 135 36.500 
2 1 136 35.500 
2 1 137 524.500 
2 1 138 474.500 
2 1 139 402.500 
2 1 140 473.500 
2 1 141 422.500 
2 1 142 510.500 
2 1 143 460.500 
2 1 144 438.500 
2 1 145 702.500 
2 1 146 392.500 
2 1 147 390.500 
2 1 148 453.500 
2 1 149 477.500 
2 1 150 447.500 
2 1 151 472.500 
2 1 152 815.500 
2 1 153 118.500 
2 1 154 0.000 
2 1 155 0.000 
2 1 156 0.000 
2 1 157 0.000 
2 1 158 0.000 
2 1 159 0.000 
2 1 160 0.000 
2 1 161 0.000 
2 1 162 528.500 
2 1 163 338.500 
2 1 164 672.500 
2 1 165 344.500 
2 1 166 456.500 
2 1 167 403.500 
2 1 168 560.500 
2 1 169 814.500 
2 1 170 63.500 
2 1 171 0.000 
2 1 172 0.000 
2 1 173 0.000 
2 1 174 0.000 
2 1 175 0.000 
2 1 176 0.000 
2 1 177 0.000 
2 1 178 0.000 
2 1 179 602.500 
2 1 180 760.500 
2 1 181 307.500 
2 1 182 411.500 
2 1 183 446.500 
2 1 184 170.500 
2 1 185 273.500 
2 1 186 418.500 
2 1 187 75.500 
2 1 188 0.000 
2 1 189 0.000 
2 1 190 0.000 
2 1 191 0.000 
2 1 192 0.000 
2 1 193 0.000 
2 1 194 0.000 
2 1 195 0.000 
2 1 196 472.500 
2 1 197 361.500 
2 1 198 369.500 
2 1 199 383.500 
2 1 200 447.500 
2 1 201 364.500 
2 1 202 397.500 
2 1 203 737.500 
2 1 204 53.500 
2 1 205 0.000 
2 1 206 0.000 
2 1 207 0.000 
2 1 208 0.000 
2 1 209 0.000 
2 1 210 0.000 
2 1 211 0.000 
2 1 212 0.000 
2 1 213 397.500 
2 1 214 706.500 
2 1 215 363.500 
2 1 216 396.500 
2 1 217 301.500 
2 1 218 358.500 
2 1 219 448.500 
2 1 220 823.500 
2 1 221 10.500 
2 1 222 0.000 
2 1 223 0.000 
2 1 224 0.000 
2 1 225 0.000 
2 1 226 0.000 
2 1 227 0.000 
2 1 228 0.000 
2 1 229 0.000 
2 1 230 518.500 
2 1 231 371.500 
2 1 232 492.500 
2 1 233 273.500 
2 1 234 417.500 
2 1 235 744.500 
2 1 236 632.500 
2 1 237 423.500 
2 1 238 49.500 
2 1 239 0.000 
2 1 240 0.000 
2 1 241 0.000 
2 1 242 0.000 
2 1 243 0.000 
2 1 244 0.000 
2 1 245 0.000 
2 1 246 0.000 
2 1 247 749.500 
2 1 248 444.500 
2 1 249 331.500 
2 1 250 383.500 
2 1 251 443.500 
2 1 252 383.500 
2 1 253 404.500 
2 1 254 361.500 
2 1 255 164.500 
2 1 256 0.000 
2 1 257 0.000 
2 1 258 0.000 
2 1 259 0.000 
2 1 260 0.000 
2 1 261 0.000 
2 1 262 0.000 
2 1 263 0.000 
2 1 264 374.500 
2 1 265 393.500 
2 1 266 408.500 
2 1 267 465.500 
2 1 268 394.500 
2 1 269 452.500 
2 1 270 354.500 
2 1 271 505.500 
2 1 272 204.500 
2 1 273 0.000 
2 1 274 0.000 
2 1 275 0.000 
2 1 276 0.000 
2 1 277 0.000 
2 1 278 0.000 
2 1 279 0.000 
2 1 280 0.000 
2 1 281 487.500 
2 1 282 496.500 
2 1 283 649.500 
2 1 284 353.500 
2 1 285 415.500 
2 1 286 561.500 
2 1 287 337.500 
2 1 288 482.500 
2 1 289 62.500 
2 1 290 0.000 
2 1 291 0.000 
2 1 292 0.000 
2 1 293 0.000 
2 1 294 0.000 
2 1 295 0.000 
2 1 296 0.000 
2 1 297 0.000 
2 1 298 376.500 
2 1 299 492.500 
2 1 300 553.500 
2 1 301 575.500 
2 1 302 567.500 
2 1 303 505.500 
2 1 304 552.500 
2 1 305 315.500 
2 1 306 67.500 
2 1 307 0.000 
2 1 308 0.000 
2 1 309 0.000 
2 1 310 0.000 
2 1 311 0.000 
2 1 312 0.000 
2 1 313 0.000 
2 1 314 0.000 
2 1 315 467.500 
2 1 316 624.500 
2 1 317 478.500 
2 1 318 391.500 
2 1 319 416.500 
2 1 320 592.500 
2 1 321 609.500 
2 1 322 455.500 
2 1 323 734.500 
2 1 324 0.000 
2 1 325 0.000 
2 1 326 0.000 
2 1 327 0.000 
2 1 328 0.000 
2 1 329 0.000 
2 1 330 0.000 
2 1 331 0.000 
2 1 332 628.500 
2 1 333 550.500 
2 1 334 434.500 
2 1 335 431.500 
2 1 336 460.500 
2 1 337 584.500 
2 1 338 301.500 
2 1 339 413.500 
2 1 340 335.500 
2 1 341 0.000 
2 1 342 0.000 
2 1 343 0.000 
2 1 344 0.000 
2 1 345 0.000 
2 1 346 0.000 
2 1 347 0.000 
2 1 348 0.000 
2 1 349 514.500 
2 1 350 938.500 
2 1 351 444.500 
2 1 352 643.500 
2 1 353 395.500 
2 1 354 483.500 
2 1 355 379.500 
2 1 356 458.500 
2 1 357 248.500 
2 1 358 0.000 
2 1 359 0.000 
2 1 360 0.000 
2 1 361 0.000 
2 1 362 0.000 
2 1 363 0.000 
2 1 364 0.000 
2 1 365 0.000 
2 1 366 339.500 
2 1 367 354.500 
2 1 368 339.500 
2 1 369 401.500 
2 1 370 395.500 
2 1 371 288.500 
2 1 372 507.500 
2 1 373 643.500 
2 1 374 179.500 
2 1 375 0.000 
2 1 376 0.000 
2 1 377 0.000 
2 1 378 0.000 
2 1 379 0.000 
2 1 380 0.000 
2 1 381 0.000 
2 1 382 0.000 
2 1 383 349.500 
2 1 384 538.500 
2 1 385 401.500 
2 1 386 472.500 
2 1 387 430.500 
2 1 388 466.500 
2 1 389 469.500 
2 1 390 419.500 
2 1 391 323.500 
2 1 392 0.000 
2 1 393 0.000 
2 1 394 0.000 
2 1 395 0.000 
2 1 396 0.000 
2 1 397 0.000 
2 1 398 0.000 
2 1 399 0.000 
2 1 400 375.500 
2 1 401 645.500 
2 1 402 374.500 
2 1 403 495.500 
2 1 404 402.500 
2 1 405 551.500 
2 1 406 472.500 
2 1 407 398.500 
2 1 408 241.500 
2 1 409 0.000 
2 1 410 0.000 
2 1 411 0.000 
2 1 412 0.000 
2 1 413 0.000 
2 1 414 0.000 
2 1 415 0.000 
2 1 416 0.000 
2 1 417 393.500 
2 1 418 480.500 
2 1 419 627.500 
2 1 420 475.500 
2 1 421 395.500 
2 1 422 351.500 
2 1 423 545.500 
2 1 424 385.500 
2 1 425 89.500 
2 1 426 586.500 
2 1 427 675.500 
2 1 428 401.500 
2 1 429 401.500 
2 1 430 418.500 
2 1 431 525.500 
2 1 432 361.500 
2 1 433 398.500 
2 1 434 395.500 
2 1 435 498.500 
2 1 436 634.500 
2 1 437 530.500 
2 1 438 524.500 
2 1 439 694.500 
2 1 440 370.500 
2 1 441 373.500 
2 1 442 455.500 
2 1 443 560.500 
2 1 444 853.500 
2 1 445 420.500 
2 1 446 468.500 
2 1 447 479.500 
2 1 448 427.500 
2 1 449 32.500 
2 1 450 490.500 
2 1 451 418.500 
2 1 452 336.500 
2 1 453 348.500 
2 1 454 446.500 
2 1 455 526.500 
2 1 456 401.500 
2 1 457 431.500 
2 1 458 664.500 
2 1 459 284.500 
2 1 460 510.500 
2 1 461 552.500 
2 1 462 350.500 
2 1 463 443.500 
2 1 464 534.500 
2 1 465 320.500 
2 1 466 350.500 
2 1 467 756.500 
2 1 468 571.500 
2 1 469 517.500 
2 1 470 467.500 
2 1 471 292.500 
2 1 472 710.500 
2 1 473 539.500 
2 1 474 32.500 
2 1 475 433.500 
2 1 476 0.000 
2 1 477 422.500 
2 1 478 339.500 
2 1 479 370.500 
2 1 480 386.500 
2 1 481 431.500 
2 1 482 527.500 
2 1 483 96.500 
2 1 484 347.500 
2 1 485 581.500 
2 1 486 534.500 
2 1 487 385.500 
2 1 488 832.500 
2 1 489 468.500 
2 1 490 568.500 
2 1 491 956.500 
2 1 492 0.000 
2 1 493 0.000 
2 1 494 493.500 
2 1 495 613.500 
2 1 496 403.500 
2 1 497 521.500 
2 1 498 421.500 
2 1 499 577.500 
2 1 500 407.500 
2 1 501 368.500 
2 1 502 391.500 
2 1 503 426.500 
2 1 504 503.500 
2 1 505 206.500 
2 1 506 271.500 
2 1 507 920.500 
2 1 508 0.000 
2 1 509 0.000 
2 1 510 0.000 
2 1 511 448.500 
2 1 512 615.500 
2 1 513 473.500 
2 1 514 491.500 
2 1 515 310.500 
2 1 516 283.500 
2 1 517 289.500 
2 1 518 248.500 
2 1 519 470.500 
2 1 520 453.500 
2 1 521 696.500 
2 1 522 160.500 
2 1 523 2850.500 
2 1 524 0.000 
2 1 525 0.000 
2 1 526 0.000 
2 1 527 0.000 
2 1 528 184.500 
2 1 529 422.500 
2 1 530 636.500 
2 1 531 236.500 
2 1 532 224.500 
2 1 533 135.500 
2 1 534 519.500 
2 1 535 606.500 
2 1 536 498.500 
2 1 537 222.500 
2 1 538 214.500 
2 1 539 1661.500 
2 1 540 0.000 
2 1 541 0.000 
2 1 542 0.000 
2 1 543 0.000 
2 1 544 0.000 
2 1 545 362.500 
2 1 546 375.500 
2 1 547 394.500 
2 1 548 323.500 
2 1 549 2021.500 
2 1 550 200.500 
2 1 551 427.500 
2 1 552 176.500 
2 1 553 373.500 
2 1 554 525.500 
2 1 555 933.500 
2 1 556 0.000 
2 1 557 0.000 
2 1 558 0.000 
2 1 559 0.000 
2 1 560 0.000 
2 1 561 0.000 
2 1 562 289.500 
2 1 563 384.500 
2 1 564 365.500 
2 1 565 1040.500 
2 1 566 1977.500 
2 1 567 1022.500 
2 1 568 411.500 
2 1 569 448.500 
2 1 570 577.500 
2 1 571 490.500 
2 1 572 0.000 
2 1 573 0.000 
2 1 574 0.000 
2 1 575 0.000 
2 1 576 0.000 
2 1 577 0.000 
2 1 578 0.000 
2 2 1 210.500 
2 2 2 124.500 
2 2 3 83.500 
2 2 4 202.500 
2 2 5 185.500 
2 2 6 142.500 
2 2 7 93.500 
2 2 8 135.500 
2 2 9 440.500 
2 2 10 104.500 
2 2 11 0.000 
2 2 12 0.000 
2 2 13 0.000 
2 2 14 0.000 
2 2 15 0.000 
2 2 16 0.000 
2 2 17 0.000 
2 2 18 540.500 
2 2 19 150.500 
2 2 20 575.500 
2 2 21 521.500 
2 2 22 433.500 
2 2 23 457.500 
2 2 24 552.500 
2 2 25 339.500 
2 2 26 273.500 
2 2 27 732.500 
2 2 28 437.500 
2 2 29 0.000 
2 2 30 0.000 
2 2 31 0.000 
2 2 32 0.000 
2 2 33 0.000 
2 2 34 0.000 
2 2 35 656.500 
2 2 36 335.500 
2 2 37 392.500 
2 2 38 305.500 
2 2 39 478.500 
2 2 40 377.500 
2 2 41 464.500 
2 2 42 584.500 
2 2 43 311.500 
2 2 44 391.500 
2 2 45 394.500 
2 2 46 2594.500 
2 2 47 0.000 
2 2 48 0.000 
2 2 49 0.000 
2 2 50 0.000 
2 2 51 0.000 
2 2 52 551.500 
2 2 53 408.500 
2 2 54 390.500 
2 2 55 377.500 
2 2 56 382.500 
2 2 57 304.500 
2 2 58 463.500 
2 2 59 1068.500 
2 2 60 518.500 
2 2 61 265.500 
2 2 62 469.500 
2 2 63 706.500 
2 2 64 167.500 
2 2 65 0.000 
2 2 66 0.000 
2 2 67 0.000 
2 2 68 0.000 
2 2 69 426.500 
2 2 70 379.500 
2 2 71 435.500 
2 2 72 346.500 
2 2 73 387.500 
2 2 74 587.500 
2 2 75 370.500 
2 2 76 339.500 
2 2 77 215.500 
2 2 78 168.500 
2 2 79 850.500 
2 2 80 1029.500 
2 2 81 319.500 
2 2 82 244.500 
2 2 83 0.000 
2 2 84 0.000 
2 2 85 0.000 
2 2 86 424.500 
2 2 87 354.500 
2 2 88 158.500 
2 2 89 356.500 
2 2 90 332.500 
2 2 91 466.500 
2 2 92 399.500 
2 2 93 405.500 
2 2 94 214.500 
2 2 95 408.500 
2 2 96 204.500 
2 2 97 387.500 
2 2 98 347.500 
2 2 99 296.500 
2 2 100 636.500 
2 2 101 0.000 
2 2 102 0.000 
2 2 103 468.500 
2 2 104 441.500 
2 2 105 551.500 
2 2 106 331.500 
2 2 107 505.500 
2 2 108 382.500 
2 2 109 548.500 
2 2 110 490.500 
2 2 111 793.500 
2 2 112 723.500 
2 2 113 252.500 
2 2 114 209.500 
2 2 115 425.500 
2 2 116 408.500 
2 2 117 695.500 
2 2 118 283.500 
2 2 119 0.000 
2 2 120 416.500 
2 2 121 353.500 
2 2 122 400.500 
2 2 123 469.500 
2 2 124 442.500 
2 2 125 1134.500 
2 2 126 270.500 
2 2 127 471.500 
2 2 128 537.500 
2 2 129 370.500 
2 2 130 389.500 
2 2 131 545.500 
2 2 132 657.500 
2 2 133 414.500 
2 2 134 342.500 
2 2 135 520.500 
2 2 136 75.500 
2 2 137 361.500 
2 2 138 398.500 
2 2 139 452.500 
2 2 140 304.500 
2 2 141 462.500 
2 2 142 434.500 
2 2 143 48.500 
2 2 144 423.500 
2 2 145 302.500 
2 2 146 400.500 
2 2 147 313.500 
2 2 148 382.500 
2 2 149 342.500 
2 2 150 121.500 
2 2 151 192.500 
2 2 152 836.500 
2 2 153 211.500 
2 2 154 0.000 
2 2 155 0.000 
2 2 156 0.000 
2 2 157 0.000 
2 2 158 0.000 
2 2 159 0.000 
2 2 160 0.000 
2 2 161 0.000 
2 2 162 357.500 
2 2 163 434.500 
2 2 164 467.500 
2 2 165 431.500 
2 2 166 439.500 
2 2 167 354.500 
2 2 168 427.500 
2 2 169 982.500 
2 2 170 267.500 
2 2 171 0.000 
2 2 172 0.000 
2 2 173 0.000 
2 2 174 0.000 
2 2 175 0.000 
2 2 176 0.000 
2 2 177 0.000 
2 2 178 0.000 
2 2 179 428.500 
2 2 180 644.500 
2 2 181 522.500 
2 2 182 418.500 
2 2 183 426.500 
2 2 184 397.500 
2 2 185 624.500 
2 2 186 731.500 
2 2 187 51.500 
2 2 188 0.000 
2 2 189 0.000 
2 2 190 0.000 
2 2 191 0.000 
2 2 192 0.000 
2 2 193 0.000 
2 2 194 0.000 
2 2 195 0.000 
2 2 196 522.500 
2 2 197 262.500 
2 2 198 339.500 
2 2 199 454.500 
2 2 200 362.500 
2 2 201 816.500 
2 2 202 322.500 
2 2 203 449.500 
2 2 204 80.500 
2 2 205 0.000 
2 2 206 0.000 
2 2 207 0.000 
2 2 208 0.000 
2 2 209 0.000 
2 2 210 0.000 
2 2 211 0.000 
2 2 212 0.000 
2 2 213 336.500 
2 2 214 260.500 
2 2 215 549.500 
2 2 216 436.500 
2 2 217 394.500 
2 2 218 462.500 
2 2 219 404.500 
2 2 220 256.500 
2 2 221 121.500 
2 2 222 0.000 
2 2 223 0.000 
2 2 224 0.000 
2 2 225 0.000 
2 2 226 0.000 
2 2 227 0.000 
2 2 228 0.000 
2 2 229 0.000 
2 2 230 526.500 
2 2 231 303.500 
2 2 232 350.500 
2 2 233 425.500 
2 2 234 326.500 
2 2 235 430.500 
2 2 236 307.500 
2 2 237 646.500 
2 2 238 84.500 
2 2 239 0.000 
2 2 240 0.000 
2 2 241 0.000 
2 2 242 0.000 
2 2 243 0.000 
2 2 244 0.000 
2 2 245 0.000 
2 2 246 0.000 
2 2 247 333.500 
2 2 248 510.500 
2 2 249 436.500 
2 2 250 399.500 
2 2 251 325.500 
2 2 252 478.500 
2 2 253 338.500 
2 2 254 293.500 
2 2 255 129.500 
2 2 256 0.000 
2 2 257 0.000 
2 2 258 0.000 
2 2 259 0.000 
2 2 260 0.000 
2 2 261 0.000 
2 2 262 0.000 
2 2 263 0.000 
2 2 264 314.500 
2 2 265 447.500 
2 2 266 305.500 
2 2 267 535.500 
2 2 268 424.500 
2 2 269 345.500 
2 2 270 651.500 
2 2 271 434.500 
2 2 272 294.500 
2 2 273 0.000 
2 2 274 0.000 
2 2 275 0.000 
2 2 276 0.000 
2 2 277 0.000 
2 2 278 0.000 
2 2 279 0.000 
2 2 280 0.000 
2 2 281 570.500 
2 2 282 741.500 
2 2 283 488.500 
2 2 284 426.500 
2 2 285 349.500 
2 2 286 653.500 
2 2 287 682.500 
2 2 288 634.500 
2 2 289 635.500 
2 2 290 0.000 
2 2 291 0.000 
2 2 292 0.000 
2 2 293 0.000 
2 2 294 0.000 
2 2 295 0.000 
2 2 296 0.000 
2 2 297 0.000 
2 2 298 403.500 
2 2 299 456.500 
2 2 300 487.500 
2 2 301 405.500 
2 2 302 724.500 
2 2 303 254.500 
2 2 304 467.500 
2 2 305 792.500 
2 2 306 408.500 
2 2 307 0.000 
2 2 308 0.000 
2 2 309 0.000 
2 2 310 0.000 
2 2 311 0.000 
2 2 312 0.000 
2 2 313 0.000 
2 2 314 0.000 
2 2 315 474.500 
2 2 316 498.500 
2 2 317 391.500 
2 2 318 679.500 
2 2 319 604.500 
2 2 320 1.500 
2 2 321 346.500 
2 2 322 510.500 
2 2 323 217.500 
2 2 324 0.000 
2 2 325 0.000 
2 2 326 0.000 
2 2 327 0.000 
2 2 328 0.000 
2 2 329 0.000 
2 2 330 0.000 
2 2 331 0.000 
2 2 332 309.500 
2 2 333 502.500 
2 2 334 517.500 
2 2 335 533.500 
2 2 336 326.500 
2 2 337 385.500 
2 2 338 721.500 
2 2 339 1090.500 
2 2 340 192.500 
2 2 341 0.000 
2 2 342 0.000 
2 2 343 0.000 
2 2 344 0.000 
2 2 345 0.000 
2 2 346 0.000 
2 2 347 0.000 
2 2 348 0.000 
2 2 349 548.500 
2 2 350 493.500 
2 2 351 481.500 
2 2 352 391.500 
2 2 353 322.500 
2 2 354 499.500 
2 2 355 992.500 
2 2 356 598.500 
2 2 357 123.500 
2 2 358 0.000 
2 2 359 0.000 
2 2 360 0.000 
2 2 361 0.000 
2 2 362 0.000 
2 2 363 0.000 
2 2 364 0.000 
2 2 365 0.000 
2 2 366 448.500 
2 2 367 556.500 
2 2 368 359.500 
2 2 369 417.500 
2 2 370 594.500 
2 2 371 409.500 
2 2 372 371.500 
2 2 373 357.500 
2 2 374 213.500 
2 2 375 0.000 
2 2 376 0.000 
2 2 377 0.000 
2 2 378 0.000 
2 2 379 0.000 
2 2 380 0.000 
2 2 381 0.000 
2 2 382 0.000 
2 2 383 521.500 
2 2 384 432.500 
2 2 385 507.500 
2 2 386 447.500 
2 2 387 546.500 
2 2 388 593.500 
2 2 389 653.500 
2 2 390 287.500 
2 2 391 199.500 
2 2 392 0.000 
2 2 393 0.000 
2 2 394 0.000 
2 2 395 0.000 
2 2 396 0.000 
2 2 397 0.000 
2 2 398 0.000 
2 2 399 0.000 
2 2 400 577.500 
2 2 401 363.500 
2 2 402 456.500 
2 2 403 524.500 
2 2 404 379.500 
2 2 405 521.500 
2 2 406 648.500 
2 2 407 322.500 
2 2 408 86.500 
2 2 409 0.000 
2 2 410 0.000 
2 2 411 0.000 
2 2 412 0.000 
2 2 413 0.000 
2 2 414 0.000 
2 2 415 0.000 
2 2 416 0.000 
2 2 417 326.500 
2 2 418 402.500 
2 2 419 473.500 
2 2 420 662.500 
2 2 421 592.500 
2 2 422 452.500 
2 2 423 324.500 
2 2 424 695.500 
2 2 425 200.500 
2 2 426 832.500 
2 2 427 472.500 
2 2 428 728.500 
2 2 429 711.500 
2 2 430 502.500 
2 2 431 788.500 
2 2 432 546.500 
2 2 433 478.500 
2 2 434 439.500 
2 2 435 466.500 
2 2 436 326.500 
2 2 437 476.500 
2 2 438 420.500 
2 2 439 372.500 
2 2 440 613.500 
2 2 441 595.500 
2 2 442 71.500 
2 2 443 597.500 
2 2 444 448.500 
2 2 445 618.500 
2 2 446 699.500 
2 2 447 447.500 
2 2 448 447.500 
2 2 449 457.500 
2 2 450 461.500 
2 2 451 403.500 
2 2 452 566.500 
2 2 453 565.500 
2 2 454 389.500 
2 2 455 427.500 
2 2 456 420.500 
2 2 457 315.500 
2 2 458 356.500 
2 2 459 183.500 
2 2 460 374.500 
2 2 461 428.500 
2 2 462 615.500 
2 2 463 386.500 
2 2 464 342.500 
2 2 465 421.500 
2 2 466 309.500 
2 2 467 464.500 
2 2 468 536.500 
2 2 469 470.500 
2 2 470 559.500 
2 2 471 555.500 
2 2 472 661.500 
2 2 473 430.500 
2 2 474 0.500 
2 2 475 606.500 
2 2 476 0.000 
2 2 477 445.500 
2 2 478 567.500 
2 2 479 405.500 
2 2 480 368.500 
2 2 481 462.500 
2 2 482 505.500 
2 2 483 441.500 
2 2 484 395.500 
2 2 485 394.500 
2 2 486 521.500 
2 2 487 302.500 
2 2 488 422.500 
2 2 489 261.500 
2 2 490 349.500 
2 2 491 430.500 
2 2 492 0.000 
2 2 493 0.000 
2 2 494 433.500 
2 2 495 379.500 
2 2 496 397.500 
2 2 497 389.500 
2 2 498 568.500 
2 2 499 398.500 
2 2 500 612.500 
2 2 501 328.500 
2 2 502 484.500 
2 2 503 469.500 
2 2 504 380.500 
2 2 505 568.500 
2 2 506 416.500 
2 2 507 221.500 
2 2 508 0.000 
2 2 509 0.000 
2 2 510 0.000 
2 2 511 558.500 
2 2 512 529.500 
2 2 513 445.500 
2 2 514 338.500 
2 2 515 568.500 
2 2 516 581.500 
2 2 517 355.500 
2 2 518 410.500 
2 2 519 342.500 
2 2 520 698.500 
2 2 521 427.500 
2 2 522 483.500 
2 2 523 385.500 
2 2 524 0.000 
2 2 525 0.000 
2 2 526 0.000 
2 2 527 0.000 
2 2 528 431.500 
2 2 529 413.500 
2 2 530 559.500 
2 2 531 403.500 
2 2 532 337.500 
2 2 533 374.500 
2 2 534 497.500 
2 2 535 498.500 
2 2 536 344.500 
2 2 537 369.500 
2 2 538 511.500 
2 2 539 464.500 
2 2 540 0.000 
2 2 541 0.000 
2 2 542 0.000 
2 2 543 0.000 
2 2 544 0.000 
2 2 545 422.500 
2 2 546 366.500 
2 2 547 472.500 
2 2 548 297.500 
2 2 549 527.500 
2 2 550 438.500 
2 2 551 528.500 
2 2 552 583.500 
2 2 553 303.500 
2 2 554 321.500 
2 2 555 417.500 
2 2 556 0.000 
2 2 557 0.000 
2 2 558 0.000 
2 2 559 0.000 
2 2 560 0.000 
2 2 561 0.000 
2 2 562 225.500 
2 2 563 223.500 
2 2 564 229.500 
2 2 565 413.500 
2 2 566 287.500 
2 2 567 247.500 
2 2 568 305.500 
2 2 569 299.500 
2 2 570 297.500 
2 2 571 284.500 
2 2 572 0.000 
2 2 573 0.000 
2 2 574 0.000 
2 2 575 0.000 
2 2 576 0.000 
2 2 577 0.000 
2 2 578 0.000 
2 3 1 789.500 
2 3 2 586.500 
2 3 3 801.500 
2 3 4 803.500 
2 3 5 579.500 
2 3 6 550.500 
2 3 7 2246.500 
2 3 8 1392.500 
2 3 9 0.500 
2 3 10 1840.500 
2 3 11 1084.500 
2 3 12 3448.500 
2 3 13 2174.500 
2 3 14 875.500 
2 3 15 682.500 
2 3 16 549.500 
2 3 17 750.500 
2 3 18 545.500 
2 3 19 1405.500 
2 3 20 3348.500 
2 3 21 1662.500 
2 3 22 2808.500 
2 3 23 3176.500 
2 3 24 1024.500 
2 3 25 932.500 
2 3 26 726.500 
2 3 27 560.500 
2 3 28 450.500 
2 3 29 682.500 
2 3 30 1784.500 
2 3 31 2416.500 
2 3 32 2122.500 
2 3 33 2844.500 
2 3 34 2005.500 
2 3 35 2403.500 
2 3 36 1124.500 
2 3 37 763.500 
2 3 38 1514.500 
2 3 39 831.500 
2 3 40 913.500 
2 3 41 395.500 
2 3 42 797.500 
2 3 43 1088.500 
2 3 44 1056.500 
2 3 45 886.500 
2 3 46 1135.500 
2 3 47 1.500 
2 3 48 0.500 
2 3 49 378.500 
2 3 50 787.500 
2 3 51 1384.500 
2 3 52 257.500 
2 3 53 1080.500 
2 3 54 719.500 
2 3 55 668.500 
2 3 56 532.500 
2 3 57 572.500 
2 3 58 2590.500 
2 3 59 3312.500 
2 3 60 2712.500 
2 3 61 1771.500 
2 3 62 366.500 
2 3 63 948.500 
2 3 64 337.500 
2 3 65 113.500 
2 3 66 892.500 
2 3 67 570.500 
2 3 68 575.500 
2 3 69 478.500 
2 3 70 2121.500 
2 3 71 2760.500 
2 3 72 2316.500 
2 3 73 1666.500 
2 3 74 516.500 
2 3 75 566.500 
2 3 76 429.500 
2 3 77 675.500 
2 3 78 562.500 
2 3 79 562.500 
2 3 80 990.500 
2 3 81 487.500 
2 3 82 694.500 
2 3 83 1408.500 
2 3 84 625.500 
2 3 85 0.000 
2 3 86 0.000 
2 3 87 0.000 
2 3 88 0.000 
2 3 89 0.000 
2 3 90 914.500 
2 3 91 658.500 
2 3 92 602.500 
2 3 93 734.500 
2 3 94 934.500 
2 3 95 779.500 
2 3 96 1179.500 
2 3 97 0.000 
2 3 98 0.000 
2 3 99 0.000 
2 3 100 0.000 
2 3 101 0.000 
2 3 102 591.500 
2 3 103 595.500 
2 3 104 651.500 
2 3 105 679.500 
2 3 106 706.500 
2 3 107 640.500 
2 3 108 739.500 
2 3 109 0.000 
2 3 110 0.000 
2 3 111 0.000 
2 3 112 0.000 
2 3 113 0.000 
2 3 114 445.500 
2 3 115 578.500 
2 3 116 624.500 
2 3 117 708.500 
2 3 118 522.500 
2 3 119 1237.500 
2 3 120 827.500 
2 3 121 0.000 
2 3 122 0.000 
2 3 123 0.000 
2 3 124 0.000 
2 3 125 0.000 
2 3 126 441.500 
2 3 127 521.500 
2 3 128 128.500 
2 3 129 610.500 
2 3 130 751.500 
2 3 131 726.500 
2 3 132 506.500 
2 3 133 0.000 
2 3 134 0.000 
2 3 135 0.000 
2 3 136 0.000 
2 3 137 0.000 
2 3 138 1076.500 
2 3 139 560.500 
2 3 140 444.500 
2 3 141 648.500 
2 3 142 582.500 
2 3 143 726.500 
2 3 144 784.500 
2 3 145 0.000 
2 3 146 0.000 
2 3 147 0.000 
2 3 148 0.000 
2 3 149 0.000 
2 3 150 602.500 
2 3 151 104.500 
2 3 152 373.500 
2 3 153 912.500 
2 3 154 0.500 
2 3 155 1316.500 
2 3 156 376.500 
2 3 157 0.000 
2 3 158 0.000 
2 3 159 0.000 
2 3 160 0.000 
2 3 161 0.000 
2 3 162 123.500 
2 3 163 452.500 
2 3 164 40.500 
2 3 165 584.500 
2 3 166 680.500 
2 3 167 863.500 
2 3 168 977.500 
2 3 169 0.000 
2 3 170 0.000 
2 3 171 0.000 
2 3 172 0.000 
2 3 173 0.000 
2 3 174 409.500 
2 3 175 200.500 
2 3 176 0.500 
2 3 177 371.500 
2 3 178 295.500 
2 3 179 502.500 
2 3 180 937.500 
2 3 181 0.000 
2 3 182 0.000 
2 3 183 0.000 
2 3 184 0.000 
2 3 185 0.000 
2 3 186 340.500 
2 3 187 396.500 
2 3 188 490.500 
2 3 189 522.500 
2 3 190 520.500 
2 3 191 488.500 
2 3 192 108.500 
2 3 193 0.000 
2 3 194 0.000 
2 3 195 0.000 
2 3 196 0.000 
2 3 197 0.000 
2 3 198 0.500 
2 3 199 0.500 
2 3 200 770.500 
2 3 201 586.500 
2 3 202 711.500 
2 3 203 0.500 
2 3 204 0.500 
2 3 205 824.500 
2 3 206 16.500 
2 3 207 10.500 
2 3 208 64.500 
2 3 209 32.500 
2 3 210 0.500 
2 3 211 469.500 
2 3 212 0.500 
2 3 213 626.500 
2 3 214 511.500 
2 3 215 0.500 
2 3 216 635.500 
2 3 217 240.500 
2 3 218 256.500 
2 3 219 859.500 
2 3 220 448.500 
2 3 221 440.500 
2 3 222 320.500 
2 3 223 919.500 
2 3 224 946.500 
2 3 225 998.500 
2 3 226 2824.500 
2 3 227 1936.500 
2 3 228 1190.500 
2 3 229 700.500 
2 3 230 1292.500 
2 3 231 384.500 
2 3 232 0.500 
2 3 233 711.500 
2 3 234 585.500 
2 3 235 878.500 
2 3 236 1295.500 
2 3 237 766.500 
2 3 238 2632.500 
2 3 239 1744.500 
2 3 240 2032.500 
2 3 241 96.500 
2 3 242 270.500 
2 3 243 462.500 
2 3 244 458.500 
2 3 245 774.500 
2 3 246 584.500 
2 3 247 688.500 
2 3 248 662.500 
2 3 249 624.500 
2 3 250 1373.500 
2 3 251 2326.500 
2 3 252 765.500 
2 3 253 744.500 
2 3 254 384.500 
2 3 255 505.500 
2 3 256 660.500 
2 3 257 593.500 
2 3 258 794.500 
2 3 259 2394.500 
2 3 260 2498.500 
2 3 261 1948.500 
2 3 262 32.500 
2 3 263 16.500 
2 3 264 928.500 
2 3 265 614.500 
2 3 266 1280.500 
2 3 267 609.500 
2 3 268 568.500 
2 3 269 919.500 
2 3 270 994.500 
2 3 271 984.500 
2 3 272 1718.500 
2 3 273 2136.500 
2 3 274 3896.500 
2 3 275 1804.500 
2 3 276 1368.500 
2 3 277 502.500 
2 3 278 1164.500 
2 3 279 647.500 
2 3 280 1183.500 
2 3 281 438.500 
2 3 282 978.500 
2 3 283 2410.500 
2 3 284 1832.500 
2 3 285 2550.500 
2 3 286 2856.500 
2 3 287 3092.500 
2 3 288 384.500 
2 4 1 571.500 
2 4 2 781.500 
2 4 3 841.500 
2 4 4 755.500 
2 4 5 39.500 
2 4 6 2090.500 
2 4 7 3376.500 
2 4 8 2968.500 
2 4 9 856.500 
2 4 10 2448.500 
2 4 11 946.500 
2 4 12 2944.500 
2 4 13 697.500 
2 4 14 676.500 
2 4 15 894.500 
2 4 16 677.500 
2 4 17 1083.500 
2 4 18 1301.500 
2 4 19 2108.500 
2 4 20 2009.500 
2 4 21 1914.500 
2 4 22 2992.500 
2 4 23 956.500 
2 4 24 1507.500 
2 4 25 631.500 
2 4 26 1006.500 
2 4 27 986.500 
2 4 28 830.500 
2 4 29 1006.500 
2 4 30 1149.500 
2 4 31 2640.500 
2 4 32 2502.500 
2 4 33 2366.500 
2 4 34 1953.500 
2 4 35 3788.500 
2 4 36 1660.500 
2 4 37 725.500 
2 4 38 185.500 
2 4 39 542.500 
2 4 40 623.500 
2 4 41 568.500 
2 4 42 1043.500 
2 4 43 463.500 
2 4 44 966.500 
2 4 45 1498.500 
2 4 46 1886.500 
2 4 47 3426.500 
2 4 48 3444.500 
2 4 49 645.500 
2 4 50 818.500 
2 4 51 718.500 
2 4 52 631.500 
2 4 53 574.500 
2 4 54 600.500 
2 4 55 591.500 
2 4 56 827.500 
2 4 57 734.500 
2 4 58 0.500 
2 4 59 2662.500 
2 4 60 2591.500 
2 4 61 944.500 
2 4 62 894.500 
2 4 63 573.500 
2 4 64 562.500 
2 4 65 1004.500 
2 4 66 1224.500 
2 4 67 881.500 
2 4 68 1229.500 
2 4 69 779.500 
2 4 70 2049.500 
2 4 71 3531.500 
2 4 72 3888.500 
2 4 73 180.500 
2 4 74 471.500 
2 4 75 435.500 
2 4 76 366.500 
2 4 77 226.500 
2 4 78 700.500 
2 4 79 426.500 
2 4 80 0.500 
2 4 81 1518.500 
2 4 82 1463.500 
2 4 83 1237.500 
2 4 84 2262.500 
2 4 85 0.000 
2 4 86 0.000 
2 4 87 0.000 
2 4 88 0.000 
2 4 89 0.000 
2 4 90 1003.500 
2 4 91 1311.500 
2 4 92 2036.500 
2 4 93 805.500 
2 4 94 1079.500 
2 4 95 1130.500 
2 4 96 773.500 
2 4 97 0.000 
2 4 98 0.000 
2 4 99 0.000 
2 4 100 0.000 
2 4 101 0.000 
2 4 102 536.500 
2 4 103 530.500 
2 4 104 736.500 
2 4 105 589.500 
2 4 106 1048.500 
2 4 107 677.500 
2 4 108 652.500 
2 4 109 0.000 
2 4 110 0.000 
2 4 111 0.000 
2 4 112 0.000 
2 4 113 0.000 
2 4 114 482.500 
2 4 115 516.500 
2 4 116 652.500 
2 4 117 671.500 
2 4 118 0.500 
2 4 119 854.500 
2 4 120 724.500 
2 4 121 0.000 
2 4 122 0.000 
2 4 123 0.000 
2 4 124 0.000 
2 4 125 0.000 
2 4 126 443.500 
2 4 127 538.500 
2 4 128 677.500 
2 4 129 558.500 
2 4 130 693.500 
2 4 131 785.500 
2 4 132 845.500 
2 4 133 0.000 
2 4 134 0.000 
2 4 135 0.000 
2 4 136 0.000 
2 4 137 0.000 
2 4 138 363.500 
2 4 139 550.500 
2 4 140 724.500 
2 4 141 683.500 
2 4 142 922.500 
2 4 143 833.500 
2 4 144 917.500 
2 4 145 0.000 
2 4 146 0.000 
2 4 147 0.000 
2 4 148 0.000 
2 4 149 0.000 
2 4 150 404.500 
2 4 151 547.500 
2 4 152 675.500 
2 4 153 701.500 
2 4 154 860.500 
2 4 155 948.500 
2 4 156 951.500 
2 4 157 0.000 
2 4 158 0.000 
2 4 159 0.000 
2 4 160 0.000 
2 4 161 0.000 
2 4 162 489.500 
2 4 163 454.500 
2 4 164 724.500 
2 4 165 725.500 
2 4 166 1107.500 
2 4 167 689.500 
2 4 168 628.500 
2 4 169 0.000 
2 4 170 0.000 
2 4 171 0.000 
2 4 172 0.000 
2 4 173 0.000 
2 4 174 440.500 
2 4 175 480.500 
2 4 176 500.500 
2 4 177 870.500 
2 4 178 890.500 
2 4 179 690.500 
2 4 180 670.500 
2 4 181 0.000 
2 4 182 0.000 
2 4 183 0.000 
2 4 184 0.000 
2 4 185 0.000 
2 4 186 649.500 
2 4 187 502.500 
2 4 188 792.500 
2 4 189 712.500 
2 4 190 694.500 
2 4 191 674.500 
2 4 192 889.500 
2 4 193 0.000 
2 4 194 0.000 
2 4 195 0.000 
2 4 196 0.000 
2 4 197 0.000 
2 4 198 0.500 
2 4 199 1224.500 
2 4 200 1504.500 
2 4 201 108.500 
2 4 202 1385.500 
2 4 203 625.500 
2 4 204 894.500 
2 4 205 864.500 
2 4 206 100.500 
2 4 207 688.500 
2 4 208 848.500 
2 4 209 176.500 
2 4 210 816.500 
2 4 211 697.500 
2 4 212 575.500 
2 4 213 809.500 
2 4 214 1104.500 
2 4 215 1041.500 
2 4 216 675.500 
2 4 217 1524.500 
2 4 218 568.500 
2 4 219 76.500 
2 4 220 944.500 
2 4 221 256.500 
2 4 222 684.500 
2 4 223 572.500 
2 4 224 527.500 
2 4 225 2.500 
2 4 226 1799.500 
2 4 227 1520.500 
2 4 228 1832.500 
2 4 229 703.500 
2 4 230 1246.500 
2 4 231 680.500 
2 4 232 256.500 
2 4 233 725.500 
2 4 234 1059.500 
2 4 235 1.500 
2 4 236 526.500 
2 4 237 961.500 
2 4 238 2729.500 
2 4 239 1696.500 
2 4 240 2892.500 
2 4 241 768.500 
2 4 242 568.500 
2 4 243 514.500 
2 4 244 832.500 
2 4 245 440.500 
2 4 246 341.500 
2 4 247 528.500 
2 4 248 597.500 
2 4 249 664.500 
2 4 250 1676.500 
2 4 251 1472.500 
2 4 252 1884.500 
2 4 253 756.500 
2 4 254 469.500 
2 4 255 730.500 
2 4 256 568.500 
2 4 257 792.500 
2 4 258 320.500 
2 4 259 1716.500 
2 4 260 2558.500 
2 4 261 1938.500 
2 4 262 1560.500 
2 4 263 2024.500 
2 4 264 1126.500 
2 4 265 1032.500 
2 4 266 722.500 
2 4 267 288.500 
2 4 268 739.500 
2 4 269 727.500 
2 4 270 762.500 
2 4 271 1755.500 
2 4 272 2169.500 
2 4 273 1898.500 
2 4 274 2992.500 
2 4 275 2986.500 
2 4 276 2249.500 
2 4 277 1221.500 
2 4 278 911.500 
2 4 279 1160.500 
2 4 280 834.500 
2 4 281 1.500 
2 4 282 3544.500 
2 4 283 3760.500 
2 4 284 2366.500 
2 4 285 1517.500 
2 4 286 3504.500 
2 4 287 0.500 
2 4 288 394.500 
