1425360075 1   -1 
1425360075 2   0 
1425360075 3   0 
1425360075 4   1 
1425360075 5   0 
1425360075 6   0 
1425360075 7   -1 
1425360075 8   0 
1425360075 9   0 
1425360075 10   1 
1425360075 11   0 
1425360075 12   0 
1425360075 13   1 
1425360075 14   0 
1425360075 15   0 
1425360075 16   -1 
1425360075 17   0 
1425360075 18   0 
1425360075 19   1 
1425360075 20   0 
1425360075 21   0 
1425360075 22   -1 
1425360075 23   0 
1425360075 24   0 
1425360075 25   1 
1425360075 26   0 
1425360075 27   0 
1425360075 28   -1 
1425360075 29   0 
1425360075 30   0 
1425360075 31   1 
1425360075 32   0 
1425360075 33   0 
1425360075 34   -1 
1425360075 35   0 
1425360075 36   0 
1425360075 37   -1 
1425360075 38   0 
1425360075 39   0 
1425360075 40   1 
1425360075 41   0 
1425360075 42   0 
1425360075 43   -1 
1425360075 44   0 
1425360075 45   0 
1425360075 46   1 
1425360075 47   0 
1425360075 48   0 
1425360075 49   1 
1425360075 50   0 
1425360075 51   0 
1425360075 52   -1 
1425360075 53   0 
1425360075 54   0 
1425360075 55   1 
1425360075 56   0 
1425360075 57   0 
1425360075 58   -1 
1425360075 59   0 
1425360075 60   0 
1425360075 61   -1 
1425360075 62   0 
1425360075 63   0 
1425360075 64   1 
1425360075 65   0 
1425360075 66   0 
1425360075 67   -1 
1425360075 68   0 
1425360075 69   0 
1425360075 70   1 
1425360075 71   0 
1425360075 72   0 
1425360075 73   -1 
1425360075 74   0 
1425360075 75   0 
1425360075 76   1 
1425360075 77   0 
1425360075 78   0 
1425360075 79   -1 
1425360075 80   0 
1425360075 81   0 
1425360075 82   1 
1425360075 83   0 
1425360075 84   0 
1425360075 85   1 
1425360075 86   0 
1425360075 87   0 
1425360075 88   -1 
1425360075 89   0 
1425360075 90   0 
1425360075 91   1 
1425360075 92   0 
1425360075 93   0 
1425360075 94   -1 
1425360075 95   0 
1425360075 96   0 
1425360075 97   1 
1425360075 98   0 
1425360075 99   0 
1425360075 100   -1 
1425360075 101   0 
1425360075 102   0 
1425360075 103   1 
1425360075 104   0 
1425360075 105   0 
1425360075 106   -1 
1425360075 107   0 
1425360075 108   0 
1425360075 109   -1 
1425360075 110   0 
1425360075 111   0 
1425360075 112   1 
1425360075 113   0 
1425360075 114   0 
1425360075 115   -1 
1425360075 116   0 
1425360075 117   0 
1425360075 118   1 
1425360075 119   0 
1425360075 120   0 
1425360075 121   1 
1425360075 122   0 
1425360075 123   0 
1425360075 124   -1 
1425360075 125   0 
1425360075 126   0 
1425360075 127   1 
1425360075 128   0 
1425360075 129   0 
1425360075 130   -1 
1425360075 131   0 
1425360075 132   0 
1425360075 133   -1 
1425360075 134   0 
1425360075 135   0 
1425360075 136   1 
1425360075 137   0 
1425360075 138   0 
1425360075 139   -1 
1425360075 140   0 
1425360075 141   0 
1425360075 142   1 
1425360075 143   0 
1425360075 144   0 
1425360075 145   -1 
1425360075 146   0 
1425360075 147   0 
1425360075 148   1 
1425360075 149   0 
1425360075 150   0 
1425360075 151   -1 
1425360075 152   0 
1425360075 153   0 
1425360075 154   1 
1425360075 155   0 
1425360075 156   0 
1425360075 157   1 
1425360075 158   0 
1425360075 159   0 
1425360075 160   -1 
1425360075 161   0 
1425360075 162   0 
1425360075 163   1 
1425360075 164   0 
1425360075 165   0 
1425360075 166   -1 
1425360075 167   0 
1425360075 168   0 
1425360075 169   1 
1425360075 170   0 
1425360075 171   0 
1425360075 172   -1 
1425360075 173   0 
1425360075 174   0 
1425360075 175   1 
1425360075 176   0 
1425360075 177   0 
1425360075 178   -1 
1425360075 179   0 
1425360075 180   0 
1425360075 181   -1 
1425360075 182   0 
1425360075 183   0 
1425360075 184   1 
1425360075 185   0 
1425360075 186   0 
1425360075 187   -1 
1425360075 188   0 
1425360075 189   0 
1425360075 190   1 
1425360075 191   0 
1425360075 192   0 
1425360075 193   1 
1425360075 194   0 
1425360075 195   0 
1425360075 196   -1 
1425360075 197   0 
1425360075 198   0 
1425360075 199   1 
1425360075 200   0 
1425360075 201   0 
1425360075 202   -1 
1425360075 203   0 
1425360075 204   0 
1425360075 205   -1 
1425360075 206   0 
1425360075 207   0 
1425360075 208   1 
1425360075 209   0 
1425360075 210   0 
1425360075 211   -1 
1425360075 212   0 
1425360075 213   0 
1425360075 214   1 
1425360075 215   0 
1425360075 216   0 
1425360075 217   -1 
1425360075 218   0 
1425360075 219   0 
1425360075 220   1 
1425360075 221   0 
1425360075 222   0 
1425360075 223   -1 
1425360075 224   0 
1425360075 225   0 
1425360075 226   1 
1425360075 227   0 
1425360075 228   0 
1425360075 229   1 
1425360075 230   0 
1425360075 231   0 
1425360075 232   -1 
1425360075 233   0 
1425360075 234   0 
1425360075 235   1 
1425360075 236   0 
1425360075 237   0 
1425360075 238   -1 
1425360075 239   0 
1425360075 240   0 
1425360075 241   1 
1425360075 242   0 
1425360075 243   0 
1425360075 244   -1 
1425360075 245   0 
1425360075 246   0 
1425360075 247   1 
1425360075 248   0 
1425360075 249   0 
1425360075 250   -1 
1425360075 251   0 
1425360075 252   0 
1425360075 253   -1 
1425360075 254   0 
1425360075 255   0 
1425360075 256   1 
1425360075 257   0 
1425360075 258   0 
1425360075 259   -1 
1425360075 260   0 
1425360075 261   0 
1425360075 262   1 
1425360075 263   0 
1425360075 264   0 
1425360075 265   1 
1425360075 266   0 
1425360075 267   0 
1425360075 268   -1 
1425360075 269   0 
1425360075 270   0 
1425360075 271   1 
1425360075 272   0 
1425360075 273   0 
1425360075 274   -1 
1425360075 275   0 
1425360075 276   0 
1425360075 277   -1 
1425360075 278   0 
1425360075 279   0 
1425360075 280   1 
1425360075 281   0 
1425360075 282   0 
1425360075 283   -1 
1425360075 284   0 
1425360075 285   0 
1425360075 286   1 
1425360075 287   0 
1425360075 288   0 
1425360075 289   -1 
1425360075 290   0 
1425360075 291   0 
1425360075 292   1 
1425360075 293   0 
1425360075 294   0 
1425360075 295   -1 
1425360075 296   0 
1425360075 297   0 
1425360075 298   1 
1425360075 299   0 
1425360075 300   0 
1425360075 301   1 
1425360075 302   0 
1425360075 303   0 
1425360075 304   -1 
1425360075 305   0 
1425360075 306   0 
1425360075 307   1 
1425360075 308   0 
1425360075 309   0 
1425360075 310   -1 
1425360075 311   0 
1425360075 312   0 
1425360075 313   1 
1425360075 314   0 
1425360075 315   0 
1425360075 316   -1 
1425360075 317   0 
1425360075 318   0 
1425360075 319   1 
1425360075 320   0 
1425360075 321   0 
1425360075 322   -1 
1425360075 323   0 
1425360075 324   0 
1425360075 325   -1 
1425360075 326   0 
1425360075 327   0 
1425360075 328   1 
1425360075 329   0 
1425360075 330   0 
1425360075 331   -1 
1425360075 332   0 
1425360075 333   0 
1425360075 334   0 
1425360075 335   0 
1425360075 336   0 
1425360075 337   0 
1425360075 338   0 
1425360075 339   0 
1425360075 340   0 
1425360075 341   0 
1425360075 342   0 
1425360075 343   0 
1425360075 344   0 
1425360075 345   0 
1425360075 346   0 
1425360075 347   0 
1425360075 348   0 
1425360075 349   0 
1425360075 350   0 
1425360075 351   0 
1425360075 352   0 
1425360075 353   0 
1425360075 354   0 
1425360075 355   0 
1425360075 356   0 
1425360075 357   0 
1425360075 358   0 
1425360075 359   0 
1425360075 360   0 
