1425120557 1   -1 
1425120557 2   0 
1425120557 3   0 
1425120557 4   1 
1425120557 5   0 
1425120557 6   0 
1425120557 7   -1 
1425120557 8   0 
1425120557 9   0 
1425120557 10   1 
1425120557 11   0 
1425120557 12   0 
1425120557 13   1 
1425120557 14   0 
1425120557 15   0 
1425120557 16   -1 
1425120557 17   0 
1425120557 18   0 
1425120557 19   1 
1425120557 20   0 
1425120557 21   0 
1425120557 22   -1 
1425120557 23   0 
1425120557 24   0 
1425120557 25   1 
1425120557 26   0 
1425120557 27   0 
1425120557 28   -1 
1425120557 29   0 
1425120557 30   0 
1425120557 31   1 
1425120557 32   0 
1425120557 33   0 
1425120557 34   -1 
1425120557 35   0 
1425120557 36   0 
1425120557 37   -1 
1425120557 38   0 
1425120557 39   0 
1425120557 40   1 
1425120557 41   0 
1425120557 42   0 
1425120557 43   -1 
1425120557 44   0 
1425120557 45   0 
1425120557 46   1 
1425120557 47   0 
1425120557 48   0 
1425120557 49   1 
1425120557 50   0 
1425120557 51   0 
1425120557 52   -1 
1425120557 53   0 
1425120557 54   0 
1425120557 55   1 
1425120557 56   0 
1425120557 57   0 
1425120557 58   -1 
1425120557 59   0 
1425120557 60   0 
1425120557 61   -1 
1425120557 62   0 
1425120557 63   0 
1425120557 64   1 
1425120557 65   0 
1425120557 66   0 
1425120557 67   -1 
1425120557 68   0 
1425120557 69   0 
1425120557 70   1 
1425120557 71   0 
1425120557 72   0 
1425120557 73   -1 
1425120557 74   0 
1425120557 75   0 
1425120557 76   1 
1425120557 77   0 
1425120557 78   0 
1425120557 79   -1 
1425120557 80   0 
1425120557 81   0 
1425120557 82   1 
1425120557 83   0 
1425120557 84   0 
1425120557 85   1 
1425120557 86   0 
1425120557 87   0 
1425120557 88   -1 
1425120557 89   0 
1425120557 90   0 
1425120557 91   1 
1425120557 92   0 
1425120557 93   0 
1425120557 94   -1 
1425120557 95   0 
1425120557 96   0 
1425120557 97   1 
1425120557 98   0 
1425120557 99   0 
1425120557 100   -1 
1425120557 101   0 
1425120557 102   0 
1425120557 103   1 
1425120557 104   0 
1425120557 105   0 
1425120557 106   -1 
1425120557 107   0 
1425120557 108   0 
1425120557 109   -1 
1425120557 110   0 
1425120557 111   0 
1425120557 112   1 
1425120557 113   0 
1425120557 114   0 
1425120557 115   -1 
1425120557 116   0 
1425120557 117   0 
1425120557 118   1 
1425120557 119   0 
1425120557 120   0 
1425120557 121   1 
1425120557 122   0 
1425120557 123   0 
1425120557 124   -1 
1425120557 125   0 
1425120557 126   0 
1425120557 127   1 
1425120557 128   0 
1425120557 129   0 
1425120557 130   -1 
1425120557 131   0 
1425120557 132   0 
1425120557 133   -1 
1425120557 134   0 
1425120557 135   0 
1425120557 136   1 
1425120557 137   0 
1425120557 138   0 
1425120557 139   -1 
1425120557 140   0 
1425120557 141   0 
1425120557 142   1 
1425120557 143   0 
1425120557 144   0 
1425120557 145   -1 
1425120557 146   0 
1425120557 147   0 
1425120557 148   1 
1425120557 149   0 
1425120557 150   0 
1425120557 151   -1 
1425120557 152   0 
1425120557 153   0 
1425120557 154   1 
1425120557 155   0 
1425120557 156   0 
1425120557 157   1 
1425120557 158   0 
1425120557 159   0 
1425120557 160   -1 
1425120557 161   0 
1425120557 162   0 
1425120557 163   1 
1425120557 164   0 
1425120557 165   0 
1425120557 166   -1 
1425120557 167   0 
1425120557 168   0 
1425120557 169   1 
1425120557 170   0 
1425120557 171   0 
1425120557 172   -1 
1425120557 173   0 
1425120557 174   0 
1425120557 175   1 
1425120557 176   0 
1425120557 177   0 
1425120557 178   -1 
1425120557 179   0 
1425120557 180   0 
1425120557 181   -1 
1425120557 182   0 
1425120557 183   0 
1425120557 184   1 
1425120557 185   0 
1425120557 186   0 
1425120557 187   -1 
1425120557 188   0 
1425120557 189   0 
1425120557 190   1 
1425120557 191   0 
1425120557 192   0 
1425120557 193   1 
1425120557 194   0 
1425120557 195   0 
1425120557 196   -1 
1425120557 197   0 
1425120557 198   0 
1425120557 199   1 
1425120557 200   0 
1425120557 201   0 
1425120557 202   -1 
1425120557 203   0 
1425120557 204   0 
1425120557 205   -1 
1425120557 206   0 
1425120557 207   0 
1425120557 208   1 
1425120557 209   0 
1425120557 210   0 
1425120557 211   -1 
1425120557 212   0 
1425120557 213   0 
1425120557 214   1 
1425120557 215   0 
1425120557 216   0 
1425120557 217   -1 
1425120557 218   0 
1425120557 219   0 
1425120557 220   1 
1425120557 221   0 
1425120557 222   0 
1425120557 223   -1 
1425120557 224   0 
1425120557 225   0 
1425120557 226   1 
1425120557 227   0 
1425120557 228   0 
1425120557 229   1 
1425120557 230   0 
1425120557 231   0 
1425120557 232   -1 
1425120557 233   0 
1425120557 234   0 
1425120557 235   1 
1425120557 236   0 
1425120557 237   0 
1425120557 238   -1 
1425120557 239   0 
1425120557 240   0 
1425120557 241   1 
1425120557 242   0 
1425120557 243   0 
1425120557 244   -1 
1425120557 245   0 
1425120557 246   0 
1425120557 247   1 
1425120557 248   0 
1425120557 249   0 
1425120557 250   -1 
1425120557 251   0 
1425120557 252   0 
1425120557 253   -1 
1425120557 254   0 
1425120557 255   0 
1425120557 256   1 
1425120557 257   0 
1425120557 258   0 
1425120557 259   -1 
1425120557 260   0 
1425120557 261   0 
1425120557 262   1 
1425120557 263   0 
1425120557 264   0 
1425120557 265   1 
1425120557 266   0 
1425120557 267   0 
1425120557 268   -1 
1425120557 269   0 
1425120557 270   0 
1425120557 271   1 
1425120557 272   0 
1425120557 273   0 
1425120557 274   -1 
1425120557 275   0 
1425120557 276   0 
1425120557 277   -1 
1425120557 278   0 
1425120557 279   0 
1425120557 280   1 
1425120557 281   0 
1425120557 282   0 
1425120557 283   -1 
1425120557 284   0 
1425120557 285   0 
1425120557 286   1 
1425120557 287   0 
1425120557 288   0 
1425120557 289   -1 
1425120557 290   0 
1425120557 291   0 
1425120557 292   1 
1425120557 293   0 
1425120557 294   0 
1425120557 295   -1 
1425120557 296   0 
1425120557 297   0 
1425120557 298   1 
1425120557 299   0 
1425120557 300   0 
1425120557 301   1 
1425120557 302   0 
1425120557 303   0 
1425120557 304   -1 
1425120557 305   0 
1425120557 306   0 
1425120557 307   1 
1425120557 308   0 
1425120557 309   0 
1425120557 310   -1 
1425120557 311   0 
1425120557 312   0 
1425120557 313   1 
1425120557 314   0 
1425120557 315   0 
1425120557 316   -1 
1425120557 317   0 
1425120557 318   0 
1425120557 319   1 
1425120557 320   0 
1425120557 321   0 
1425120557 322   -1 
1425120557 323   0 
1425120557 324   0 
1425120557 325   -1 
1425120557 326   0 
1425120557 327   0 
1425120557 328   1 
1425120557 329   0 
1425120557 330   0 
1425120557 331   -1 
1425120557 332   0 
1425120557 333   0 
1425120557 334   0 
1425120557 335   0 
1425120557 336   0 
1425120557 337   0 
1425120557 338   0 
1425120557 339   0 
1425120557 340   0 
1425120557 341   0 
1425120557 342   0 
1425120557 343   0 
1425120557 344   0 
1425120557 345   0 
1425120557 346   0 
1425120557 347   0 
1425120557 348   0 
1425120557 349   0 
1425120557 350   0 
1425120557 351   0 
1425120557 352   0 
1425120557 353   0 
1425120557 354   0 
1425120557 355   0 
1425120557 356   0 
1425120557 357   0 
1425120557 358   0 
1425120557 359   0 
1425120557 360   0 
