[
	{
		"user" : "Pelican Steve",
		"company" : "LittleSnippets",
		"testimonial" : "Calvin: Sometimes when I'm talking with others, my words can't keep up with my thoughts. I wonder why we think faster than we speak. Hobbes: Probably so we can think twice.",
		"profile" : "https://s3-us-west-2.amazonaws.com/s.cdpn.io/331810/sq-sample1.jpg"
	},
	{
		"user" : "Pelican Steve",
		"company" : "LittleSnippets",
		"testimonial" : "Calvin: Sometimes when I'm talking with others, my words can't keep up with my thoughts. I wonder why we think faster than we speak. Hobbes: Probably so we can think twice.",
		"profile" : "https://s3-us-west-2.amazonaws.com/s.cdpn.io/331810/sq-sample1.jpg"
	},
	{
		"user" : "Pelican Steve",
		"company" : "LittleSnippets",
		"testimonial" : "Calvin: Sometimes when I'm talking with others, my words can't keep up with my thoughts. I wonder why we think faster than we speak. Hobbes: Probably so we can think twice.",
		"profile" : "https://s3-us-west-2.amazonaws.com/s.cdpn.io/331810/sq-sample1.jpg"
	}	
]