%YAML 1.1
%TAG !u! tag:unity3d.com,2011:
--- !u!74 &7400000
AnimationClip:
  m_ObjectHideFlags: 0
  m_PrefabParentObject: {fileID: 0}
  m_PrefabInternal: {fileID: 0}
  m_Name: TouchdownLoop
  serializedVersion: 6
  m_Legacy: 0
  m_Compressed: 0
  m_UseHighQualityCurve: 1
  m_RotationCurves: []
  m_CompressedRotationCurves: []
  m_EulerCurves: []
  m_PositionCurves: []
  m_ScaleCurves: []
  m_FloatCurves: []
  m_PPtrCurves:
  - curve:
    - time: 0
      value: {fileID: 21300000, guid: 35aa76960c7a8054a99a082d9fcb1c34, type: 3}
    - time: 0.016666668
      value: {fileID: 21300000, guid: fb0ae97ff7417f747add00080096e538, type: 3}
    - time: 0.033333335
      value: {fileID: 21300000, guid: 5053739cdb1e0874cb9a4d3b09f28521, type: 3}
    - time: 0.05
      value: {fileID: 21300000, guid: bed7365aec3dfcb4fa3c84dacc9de7c2, type: 3}
    - time: 0.06666667
      value: {fileID: 21300000, guid: 6ff96e585091b704ba3505af2980dc45, type: 3}
    - time: 0.083333336
      value: {fileID: 21300000, guid: 9a46bf3b2ea3eea44a683df829839398, type: 3}
    - time: 0.1
      value: {fileID: 21300000, guid: a495590dafaeee84c9798c2235299a80, type: 3}
    - time: 0.11666667
      value: {fileID: 21300000, guid: 001da42ed6c0ec44293baefc684d0751, type: 3}
    - time: 0.13333334
      value: {fileID: 21300000, guid: fda0560b3e7b17c4db82542a01e3c207, type: 3}
    - time: 0.15
      value: {fileID: 21300000, guid: 33b510f65092d83468ab145aa6f342e1, type: 3}
    - time: 0.16666667
      value: {fileID: 21300000, guid: 88da98fec0e4eff459b22a1edb4f7e34, type: 3}
    - time: 0.18333334
      value: {fileID: 21300000, guid: f60c1ecbf2a92b542a43fe0354e8d2b9, type: 3}
    - time: 0.2
      value: {fileID: 21300000, guid: 165c0a8199f760c46964a53cb7ef9088, type: 3}
    - time: 0.21666667
      value: {fileID: 21300000, guid: b9976a9d9991720499615d7038770cd1, type: 3}
    - time: 0.23333333
      value: {fileID: 21300000, guid: dbe1ff5be61810044845e5d0175ed2e4, type: 3}
    - time: 0.25
      value: {fileID: 21300000, guid: 9d9ea171c63ad4148aa96362d3804543, type: 3}
    - time: 0.26666668
      value: {fileID: 21300000, guid: 0ed01e2f1a7b5be468de7d9a653a154b, type: 3}
    - time: 0.28333336
      value: {fileID: 21300000, guid: 25c07594b7d3c3b4b9770be99b13a0bd, type: 3}
    - time: 0.30000004
      value: {fileID: 21300000, guid: 3c4205e3c1ac22943a06234431a7daaf, type: 3}
    - time: 0.31666672
      value: {fileID: 21300000, guid: 325c476205ec0504db9bc88990ae52ea, type: 3}
    - time: 0.3333334
      value: {fileID: 21300000, guid: 2dcf3bcb62604b049a301b295f119ba6, type: 3}
    - time: 0.35000008
      value: {fileID: 21300000, guid: d4e9999b0aa52a84b86b01d5f6267561, type: 3}
    - time: 0.36666676
      value: {fileID: 21300000, guid: d299b5a726d67ee48a91c17fb4bb32c3, type: 3}
    - time: 0.38333344
      value: {fileID: 21300000, guid: 6f643b2e9730c01468d752521fb6a663, type: 3}
    - time: 0.40000013
      value: {fileID: 21300000, guid: 6640d132294b6c84d83a05ad805251b3, type: 3}
    - time: 0.4166668
      value: {fileID: 21300000, guid: a74737e1dea195940963d585149c6fb9, type: 3}
    - time: 0.4333335
      value: {fileID: 21300000, guid: d212a54ed2de11545a12ad6236ff4fa7, type: 3}
    - time: 0.45000017
      value: {fileID: 21300000, guid: 163512860d496e4428ba6d26816adce6, type: 3}
    - time: 0.46666685
      value: {fileID: 21300000, guid: 0d54bb4a9ca48834d8853f71142fb410, type: 3}
    - time: 0.48333353
      value: {fileID: 21300000, guid: 6bfbc679527baca4d946419974dd32df, type: 3}
    - time: 0.5000002
      value: {fileID: 21300000, guid: 75428d4e71d62cf49addcb5ea943682c, type: 3}
    - time: 0.5166668
      value: {fileID: 21300000, guid: c55e6a01b53527f40a6fd6ea57d907ce, type: 3}
    - time: 0.5333335
      value: {fileID: 21300000, guid: 90510ae576967b54ab0eb3d59ccffb62, type: 3}
    - time: 0.55000013
      value: {fileID: 21300000, guid: eb1628f33bc8c5643b5486fc96485a75, type: 3}
    - time: 0.5666668
      value: {fileID: 21300000, guid: 30118a557f8d152409ec130abc280c3b, type: 3}
    - time: 0.58333343
      value: {fileID: 21300000, guid: 4cd58e5738650e7449440fce545fa176, type: 3}
    - time: 0.6000001
      value: {fileID: 21300000, guid: c09a6da430072ad41bd17e4f586aebcc, type: 3}
    - time: 0.61666673
      value: {fileID: 21300000, guid: 16345d717dbb44a4dba4dd61bd8331a3, type: 3}
    - time: 0.6333334
      value: {fileID: 21300000, guid: 4b33d1112520585439ab5837f2e0fe1a, type: 3}
    - time: 0.65000004
      value: {fileID: 21300000, guid: bb0b80a7e566716499e620ed5ea95b53, type: 3}
    - time: 0.6666667
      value: {fileID: 21300000, guid: e9b2c5d05bee2394a8a3a1e0f8fac65c, type: 3}
    - time: 0.68333334
      value: {fileID: 21300000, guid: 0b0679ed6fa6d254fab45a095b54074f, type: 3}
    - time: 0.7
      value: {fileID: 21300000, guid: 0e53f19a2b2c6064fbe3ad0e8dde3f59, type: 3}
    - time: 0.71666664
      value: {fileID: 21300000, guid: cde4d8b2dea57da4683fb986bf343f43, type: 3}
    - time: 0.7333333
      value: {fileID: 21300000, guid: 366905279508bd047bd86a959a17b30e, type: 3}
    - time: 0.74999994
      value: {fileID: 21300000, guid: 30bb5d167ac091a48a01eb4847243721, type: 3}
    - time: 0.7666666
      value: {fileID: 21300000, guid: 61f38298c905fcb4c943be7b3a25f849, type: 3}
    - time: 0.78333324
      value: {fileID: 21300000, guid: 445985e58b1e9074cad090c134edefe5, type: 3}
    - time: 0.7999999
      value: {fileID: 21300000, guid: a4798d5fe02a6aa428b65221075fabd6, type: 3}
    - time: 0.81666654
      value: {fileID: 21300000, guid: cb94403cf98912f4e8009d18ab6e49b4, type: 3}
    - time: 0.8333332
      value: {fileID: 21300000, guid: 2d289d1a1151d8c41b8d14e697413120, type: 3}
    - time: 0.84999985
      value: {fileID: 21300000, guid: 5a5f1cdf4dc3ab341b7327a0f197d638, type: 3}
    - time: 0.8666665
      value: {fileID: 21300000, guid: 8900491047295b24681964b237939845, type: 3}
    - time: 0.88333315
      value: {fileID: 21300000, guid: fef31edad61eaba4b9c5a119d2c1f3b3, type: 3}
    - time: 0.8999998
      value: {fileID: 21300000, guid: 180503611a3961d48b2011b1b2f96342, type: 3}
    - time: 0.91666645
      value: {fileID: 21300000, guid: 4e0fb9682c7935841a028a4b325ca145, type: 3}
    - time: 0.9333331
      value: {fileID: 21300000, guid: eb4c05dfd39c2c942be6a83ba494e3f6, type: 3}
    - time: 0.94999975
      value: {fileID: 21300000, guid: 3d59e3b110ed76642b01221f96fd1bd2, type: 3}
    attribute: m_Sprite
    path: 
    classID: 212
    script: {fileID: 0}
  m_SampleRate: 60
  m_WrapMode: 0
  m_Bounds:
    m_Center: {x: 0, y: 0, z: 0}
    m_Extent: {x: 0, y: 0, z: 0}
  m_ClipBindingConstant:
    genericBindings:
    - serializedVersion: 2
      path: 0
      attribute: 0
      script: {fileID: 0}
      typeID: 212
      customType: 23
      isPPtrCurve: 1
    pptrCurveMapping:
    - {fileID: 21300000, guid: 35aa76960c7a8054a99a082d9fcb1c34, type: 3}
    - {fileID: 21300000, guid: fb0ae97ff7417f747add00080096e538, type: 3}
    - {fileID: 21300000, guid: 5053739cdb1e0874cb9a4d3b09f28521, type: 3}
    - {fileID: 21300000, guid: bed7365aec3dfcb4fa3c84dacc9de7c2, type: 3}
    - {fileID: 21300000, guid: 6ff96e585091b704ba3505af2980dc45, type: 3}
    - {fileID: 21300000, guid: 9a46bf3b2ea3eea44a683df829839398, type: 3}
    - {fileID: 21300000, guid: a495590dafaeee84c9798c2235299a80, type: 3}
    - {fileID: 21300000, guid: 001da42ed6c0ec44293baefc684d0751, type: 3}
    - {fileID: 21300000, guid: fda0560b3e7b17c4db82542a01e3c207, type: 3}
    - {fileID: 21300000, guid: 33b510f65092d83468ab145aa6f342e1, type: 3}
    - {fileID: 21300000, guid: 88da98fec0e4eff459b22a1edb4f7e34, type: 3}
    - {fileID: 21300000, guid: f60c1ecbf2a92b542a43fe0354e8d2b9, type: 3}
    - {fileID: 21300000, guid: 165c0a8199f760c46964a53cb7ef9088, type: 3}
    - {fileID: 21300000, guid: b9976a9d9991720499615d7038770cd1, type: 3}
    - {fileID: 21300000, guid: dbe1ff5be61810044845e5d0175ed2e4, type: 3}
    - {fileID: 21300000, guid: 9d9ea171c63ad4148aa96362d3804543, type: 3}
    - {fileID: 21300000, guid: 0ed01e2f1a7b5be468de7d9a653a154b, type: 3}
    - {fileID: 21300000, guid: 25c07594b7d3c3b4b9770be99b13a0bd, type: 3}
    - {fileID: 21300000, guid: 3c4205e3c1ac22943a06234431a7daaf, type: 3}
    - {fileID: 21300000, guid: 325c476205ec0504db9bc88990ae52ea, type: 3}
    - {fileID: 21300000, guid: 2dcf3bcb62604b049a301b295f119ba6, type: 3}
    - {fileID: 21300000, guid: d4e9999b0aa52a84b86b01d5f6267561, type: 3}
    - {fileID: 21300000, guid: d299b5a726d67ee48a91c17fb4bb32c3, type: 3}
    - {fileID: 21300000, guid: 6f643b2e9730c01468d752521fb6a663, type: 3}
    - {fileID: 21300000, guid: 6640d132294b6c84d83a05ad805251b3, type: 3}
    - {fileID: 21300000, guid: a74737e1dea195940963d585149c6fb9, type: 3}
    - {fileID: 21300000, guid: d212a54ed2de11545a12ad6236ff4fa7, type: 3}
    - {fileID: 21300000, guid: 163512860d496e4428ba6d26816adce6, type: 3}
    - {fileID: 21300000, guid: 0d54bb4a9ca48834d8853f71142fb410, type: 3}
    - {fileID: 21300000, guid: 6bfbc679527baca4d946419974dd32df, type: 3}
    - {fileID: 21300000, guid: 75428d4e71d62cf49addcb5ea943682c, type: 3}
    - {fileID: 21300000, guid: c55e6a01b53527f40a6fd6ea57d907ce, type: 3}
    - {fileID: 21300000, guid: 90510ae576967b54ab0eb3d59ccffb62, type: 3}
    - {fileID: 21300000, guid: eb1628f33bc8c5643b5486fc96485a75, type: 3}
    - {fileID: 21300000, guid: 30118a557f8d152409ec130abc280c3b, type: 3}
    - {fileID: 21300000, guid: 4cd58e5738650e7449440fce545fa176, type: 3}
    - {fileID: 21300000, guid: c09a6da430072ad41bd17e4f586aebcc, type: 3}
    - {fileID: 21300000, guid: 16345d717dbb44a4dba4dd61bd8331a3, type: 3}
    - {fileID: 21300000, guid: 4b33d1112520585439ab5837f2e0fe1a, type: 3}
    - {fileID: 21300000, guid: bb0b80a7e566716499e620ed5ea95b53, type: 3}
    - {fileID: 21300000, guid: e9b2c5d05bee2394a8a3a1e0f8fac65c, type: 3}
    - {fileID: 21300000, guid: 0b0679ed6fa6d254fab45a095b54074f, type: 3}
    - {fileID: 21300000, guid: 0e53f19a2b2c6064fbe3ad0e8dde3f59, type: 3}
    - {fileID: 21300000, guid: cde4d8b2dea57da4683fb986bf343f43, type: 3}
    - {fileID: 21300000, guid: 366905279508bd047bd86a959a17b30e, type: 3}
    - {fileID: 21300000, guid: 30bb5d167ac091a48a01eb4847243721, type: 3}
    - {fileID: 21300000, guid: 61f38298c905fcb4c943be7b3a25f849, type: 3}
    - {fileID: 21300000, guid: 445985e58b1e9074cad090c134edefe5, type: 3}
    - {fileID: 21300000, guid: a4798d5fe02a6aa428b65221075fabd6, type: 3}
    - {fileID: 21300000, guid: cb94403cf98912f4e8009d18ab6e49b4, type: 3}
    - {fileID: 21300000, guid: 2d289d1a1151d8c41b8d14e697413120, type: 3}
    - {fileID: 21300000, guid: 5a5f1cdf4dc3ab341b7327a0f197d638, type: 3}
    - {fileID: 21300000, guid: 8900491047295b24681964b237939845, type: 3}
    - {fileID: 21300000, guid: fef31edad61eaba4b9c5a119d2c1f3b3, type: 3}
    - {fileID: 21300000, guid: 180503611a3961d48b2011b1b2f96342, type: 3}
    - {fileID: 21300000, guid: 4e0fb9682c7935841a028a4b325ca145, type: 3}
    - {fileID: 21300000, guid: eb4c05dfd39c2c942be6a83ba494e3f6, type: 3}
    - {fileID: 21300000, guid: 3d59e3b110ed76642b01221f96fd1bd2, type: 3}
  m_AnimationClipSettings:
    serializedVersion: 2
    m_AdditiveReferencePoseClip: {fileID: 0}
    m_AdditiveReferencePoseTime: 0
    m_StartTime: 0
    m_StopTime: 0.9666664
    m_OrientationOffsetY: 0
    m_Level: 0
    m_CycleOffset: 0
    m_HasAdditiveReferencePose: 0
    m_LoopTime: 1
    m_LoopBlend: 0
    m_LoopBlendOrientation: 0
    m_LoopBlendPositionY: 0
    m_LoopBlendPositionXZ: 0
    m_KeepOriginalOrientation: 0
    m_KeepOriginalPositionY: 1
    m_KeepOriginalPositionXZ: 0
    m_HeightFromFeet: 0
    m_Mirror: 0
  m_EditorCurves: []
  m_EulerEditorCurves: []
  m_HasGenericRootTransform: 0
  m_HasMotionFloatCurves: 0
  m_GenerateMotionCurves: 0
  m_Events: []
