{
  "project_info": {
    "project_number": "519142814586",
    "firebase_url": "https://ninponix-kinetix.firebaseio.com",
    "project_id": "ninponix-kinetix",
    "storage_bucket": "ninponix-kinetix.appspot.com"
  },
  "client": [
    {
      "client_info": {
        "mobilesdk_app_id": "1:519142814586:android:09036557f3b6193d",
        "android_client_info": {
          "package_name": "com.ninponix.kinetix"
        }
      },
      "oauth_client": [
        {
          "client_id": "519142814586-j78dfrc772tk305007he3u37iekluo3v.apps.googleusercontent.com",
          "client_type": 3
        }
      ],
      "api_key": [
        {
          "current_key": "AIzaSyARJTBbn1krHzxn2TsQdsJdqYNY0YzQePw"
        }
      ],
      "services": {
        "analytics_service": {
          "status": 1
        },
        "appinvite_service": {
          "status": 1,
          "other_platform_oauth_client": []
        },
        "ads_service": {
          "status": 2
        }
      }
    }
  ],
  "configuration_version": "1"
}