%YAML 1.1
%TAG !u! tag:unity3d.com,2011:
--- !u!74 &7400000
AnimationClip:
  m_ObjectHideFlags: 0
  m_PrefabParentObject: {fileID: 0}
  m_PrefabInternal: {fileID: 0}
  m_Name: PreloaderAnimation
  serializedVersion: 6
  m_Legacy: 0
  m_Compressed: 0
  m_UseHighQualityCurve: 1
  m_RotationCurves: []
  m_CompressedRotationCurves: []
  m_EulerCurves: []
  m_PositionCurves: []
  m_ScaleCurves: []
  m_FloatCurves: []
  m_PPtrCurves:
  - curve:
    - time: 0
      value: {fileID: 21300000, guid: a66ab6ecfe9d3544682413150a9dc133, type: 3}
    - time: 0.016666668
      value: {fileID: 21300000, guid: b65082394057b164c9be54b5ecf6f839, type: 3}
    - time: 0.033333335
      value: {fileID: 21300000, guid: a3dd1799dec39874196d7d6f574e4f74, type: 3}
    - time: 0.05
      value: {fileID: 21300000, guid: e26bcded64f730f4392c0045aebeb988, type: 3}
    - time: 0.06666667
      value: {fileID: 21300000, guid: 174c399e1e5009c44b71793d40f64726, type: 3}
    - time: 0.083333336
      value: {fileID: 21300000, guid: a74a6faeba48d2c499e1b9efa547ec4a, type: 3}
    - time: 0.1
      value: {fileID: 21300000, guid: ffab95737c998fe45819b43ac0548e30, type: 3}
    - time: 0.11666667
      value: {fileID: 21300000, guid: c085cf40a9ae21f4fb08f3fc44757abd, type: 3}
    - time: 0.13333334
      value: {fileID: 21300000, guid: 63d5ac726b89308489f6679da2212d37, type: 3}
    - time: 0.15
      value: {fileID: 21300000, guid: 25a0bb48958df514d86e6a3d86e86022, type: 3}
    - time: 0.16666667
      value: {fileID: 21300000, guid: bba6220c517dda2418de813595c6ae5d, type: 3}
    - time: 0.18333334
      value: {fileID: 21300000, guid: f221840d02cb25e4fb56b50ceb335a8a, type: 3}
    - time: 0.2
      value: {fileID: 21300000, guid: 78dbbf359094ff74aaeeb1812f22bf3f, type: 3}
    - time: 0.21666667
      value: {fileID: 21300000, guid: 525240862add1c8458fd96a9eca5c33c, type: 3}
    - time: 0.23333333
      value: {fileID: 21300000, guid: 1bab802bf5ee9a94e9f591ea4e0ae5dd, type: 3}
    - time: 0.25
      value: {fileID: 21300000, guid: b64742eccec0d6842ad666acaa13ffeb, type: 3}
    - time: 0.26666668
      value: {fileID: 21300000, guid: aa2d6194d25ac464f9f253141b01b937, type: 3}
    - time: 0.28333336
      value: {fileID: 21300000, guid: d7f69ab91bb8e3646bf8b4f1f455d3f0, type: 3}
    - time: 0.30000004
      value: {fileID: 21300000, guid: 71f494871b883ce46b4fed25d1570006, type: 3}
    - time: 0.31666672
      value: {fileID: 21300000, guid: 7bb72d92743808a4585feec38325be67, type: 3}
    - time: 0.3333334
      value: {fileID: 21300000, guid: 3053e68fa2999394481ddb0723a56d23, type: 3}
    - time: 0.35000008
      value: {fileID: 21300000, guid: 50c9dc2b0b5b1834ca31925157afedb3, type: 3}
    - time: 0.36666676
      value: {fileID: 21300000, guid: 2b74701f89e31124d92b4087c99475fd, type: 3}
    - time: 0.38333344
      value: {fileID: 21300000, guid: 1ec9488524f0d1e438b304d1c26855c9, type: 3}
    - time: 0.40000013
      value: {fileID: 21300000, guid: 4ce6da8ba4f983b49b5673765f278cb8, type: 3}
    - time: 0.4166668
      value: {fileID: 21300000, guid: 5db2e793d1180c14497b38bd25ea4d70, type: 3}
    - time: 0.4333335
      value: {fileID: 21300000, guid: 0b060311a74c1544cb3061e2ac082045, type: 3}
    - time: 0.45000017
      value: {fileID: 21300000, guid: 33546bcad6f09fa40adf64b66abeeb28, type: 3}
    - time: 0.46666685
      value: {fileID: 21300000, guid: 21fa2ed0e96b66d48bf089336dea720e, type: 3}
    - time: 0.48333353
      value: {fileID: 21300000, guid: ab2d3d0161080f14eb35a42b88cdeac1, type: 3}
    - time: 0.5000002
      value: {fileID: 21300000, guid: d221e72a3e8a2074b8a50d8137a44b90, type: 3}
    - time: 0.5166668
      value: {fileID: 21300000, guid: 4acc6545bb405e94f98b59086824d61a, type: 3}
    - time: 0.5333335
      value: {fileID: 21300000, guid: f264b1908e762ac4296e67ed51007e5a, type: 3}
    - time: 0.55000013
      value: {fileID: 21300000, guid: 4cac7d472185c974498973ec536ed6f4, type: 3}
    - time: 0.5666668
      value: {fileID: 21300000, guid: 716c8a5b245a0a446a5dbbbc6a9e388e, type: 3}
    - time: 0.58333343
      value: {fileID: 21300000, guid: 98de5be34d8b8d24893d4315559a9d10, type: 3}
    - time: 0.6000001
      value: {fileID: 21300000, guid: d1be340476a176b46ac8b7e89a02412b, type: 3}
    - time: 0.61666673
      value: {fileID: 21300000, guid: 956efc449b1a64f499bf9abdb98a2a80, type: 3}
    - time: 0.6333334
      value: {fileID: 21300000, guid: 563da85af649b7e4fb787c1a6178eeba, type: 3}
    - time: 0.65000004
      value: {fileID: 21300000, guid: d599d1c802d0ed148ad5d2b3b22c3cde, type: 3}
    - time: 0.6666667
      value: {fileID: 21300000, guid: 09234fa9873c6ea428d7f5c7ef3f7d4d, type: 3}
    - time: 0.68333334
      value: {fileID: 21300000, guid: 8c21926218ec6cf428f60a5e3186a86a, type: 3}
    - time: 0.7
      value: {fileID: 21300000, guid: 0d0ef8c1205b7fe4281c61c4f6065f14, type: 3}
    - time: 0.71666664
      value: {fileID: 21300000, guid: 31991a9bbc18d964ca1abc26ed7053ad, type: 3}
    - time: 0.7333333
      value: {fileID: 21300000, guid: 4e0da61d05b69da4793bf6956e73fdb7, type: 3}
    - time: 0.74999994
      value: {fileID: 21300000, guid: 975d3613d50a9c94184ec70dffeeee83, type: 3}
    - time: 0.7666666
      value: {fileID: 21300000, guid: 1572b44438220d4478467dc08c27faf9, type: 3}
    - time: 0.78333324
      value: {fileID: 21300000, guid: f7b2f7d1f6a7d494e9b8e6c1a942c906, type: 3}
    - time: 0.7999999
      value: {fileID: 21300000, guid: 58afaf9fbb8928443abfa58a770eaa5a, type: 3}
    - time: 0.81666654
      value: {fileID: 21300000, guid: 41110b6795e45604c8b2149cc217297a, type: 3}
    - time: 0.8333332
      value: {fileID: 21300000, guid: 8917cd3989e51aa48ba39130bf13d527, type: 3}
    - time: 0.84999985
      value: {fileID: 21300000, guid: a5a2e384fe372fc479c6a2e033c493d5, type: 3}
    - time: 0.8666665
      value: {fileID: 21300000, guid: 26c00854073027644915e36a154cf569, type: 3}
    - time: 0.88333315
      value: {fileID: 21300000, guid: 1dc0160203b529c45a19d92c5aee9740, type: 3}
    - time: 0.8999998
      value: {fileID: 21300000, guid: 7f478d8e23a8540409abf55a824a47ef, type: 3}
    - time: 0.91666645
      value: {fileID: 21300000, guid: 9271d619f6b28a842bdd40b40fc2740e, type: 3}
    - time: 0.9333331
      value: {fileID: 21300000, guid: 2d27b18b4b4df364ea5c05c9898bd29c, type: 3}
    - time: 0.94999975
      value: {fileID: 21300000, guid: 7e3b51f9cff61734db0fa35f99271247, type: 3}
    - time: 0.9666664
      value: {fileID: 21300000, guid: cc7e8bd9429c5984bb666b5a9f3b548d, type: 3}
    - time: 0.98333305
      value: {fileID: 21300000, guid: 1ac88b364a7e01a48abfd36cc0f23ad5, type: 3}
    attribute: m_Sprite
    path: 
    classID: 114
    script: {fileID: -765806418, guid: f70555f144d8491a825f0804e09c671c, type: 3}
  m_SampleRate: 60
  m_WrapMode: 0
  m_Bounds:
    m_Center: {x: 0, y: 0, z: 0}
    m_Extent: {x: 0, y: 0, z: 0}
  m_ClipBindingConstant:
    genericBindings:
    - serializedVersion: 2
      path: 0
      attribute: 2015549526
      script: {fileID: -765806418, guid: f70555f144d8491a825f0804e09c671c, type: 3}
      typeID: 114
      customType: 0
      isPPtrCurve: 1
    pptrCurveMapping:
    - {fileID: 21300000, guid: a66ab6ecfe9d3544682413150a9dc133, type: 3}
    - {fileID: 21300000, guid: b65082394057b164c9be54b5ecf6f839, type: 3}
    - {fileID: 21300000, guid: a3dd1799dec39874196d7d6f574e4f74, type: 3}
    - {fileID: 21300000, guid: e26bcded64f730f4392c0045aebeb988, type: 3}
    - {fileID: 21300000, guid: 174c399e1e5009c44b71793d40f64726, type: 3}
    - {fileID: 21300000, guid: a74a6faeba48d2c499e1b9efa547ec4a, type: 3}
    - {fileID: 21300000, guid: ffab95737c998fe45819b43ac0548e30, type: 3}
    - {fileID: 21300000, guid: c085cf40a9ae21f4fb08f3fc44757abd, type: 3}
    - {fileID: 21300000, guid: 63d5ac726b89308489f6679da2212d37, type: 3}
    - {fileID: 21300000, guid: 25a0bb48958df514d86e6a3d86e86022, type: 3}
    - {fileID: 21300000, guid: bba6220c517dda2418de813595c6ae5d, type: 3}
    - {fileID: 21300000, guid: f221840d02cb25e4fb56b50ceb335a8a, type: 3}
    - {fileID: 21300000, guid: 78dbbf359094ff74aaeeb1812f22bf3f, type: 3}
    - {fileID: 21300000, guid: 525240862add1c8458fd96a9eca5c33c, type: 3}
    - {fileID: 21300000, guid: 1bab802bf5ee9a94e9f591ea4e0ae5dd, type: 3}
    - {fileID: 21300000, guid: b64742eccec0d6842ad666acaa13ffeb, type: 3}
    - {fileID: 21300000, guid: aa2d6194d25ac464f9f253141b01b937, type: 3}
    - {fileID: 21300000, guid: d7f69ab91bb8e3646bf8b4f1f455d3f0, type: 3}
    - {fileID: 21300000, guid: 71f494871b883ce46b4fed25d1570006, type: 3}
    - {fileID: 21300000, guid: 7bb72d92743808a4585feec38325be67, type: 3}
    - {fileID: 21300000, guid: 3053e68fa2999394481ddb0723a56d23, type: 3}
    - {fileID: 21300000, guid: 50c9dc2b0b5b1834ca31925157afedb3, type: 3}
    - {fileID: 21300000, guid: 2b74701f89e31124d92b4087c99475fd, type: 3}
    - {fileID: 21300000, guid: 1ec9488524f0d1e438b304d1c26855c9, type: 3}
    - {fileID: 21300000, guid: 4ce6da8ba4f983b49b5673765f278cb8, type: 3}
    - {fileID: 21300000, guid: 5db2e793d1180c14497b38bd25ea4d70, type: 3}
    - {fileID: 21300000, guid: 0b060311a74c1544cb3061e2ac082045, type: 3}
    - {fileID: 21300000, guid: 33546bcad6f09fa40adf64b66abeeb28, type: 3}
    - {fileID: 21300000, guid: 21fa2ed0e96b66d48bf089336dea720e, type: 3}
    - {fileID: 21300000, guid: ab2d3d0161080f14eb35a42b88cdeac1, type: 3}
    - {fileID: 21300000, guid: d221e72a3e8a2074b8a50d8137a44b90, type: 3}
    - {fileID: 21300000, guid: 4acc6545bb405e94f98b59086824d61a, type: 3}
    - {fileID: 21300000, guid: f264b1908e762ac4296e67ed51007e5a, type: 3}
    - {fileID: 21300000, guid: 4cac7d472185c974498973ec536ed6f4, type: 3}
    - {fileID: 21300000, guid: 716c8a5b245a0a446a5dbbbc6a9e388e, type: 3}
    - {fileID: 21300000, guid: 98de5be34d8b8d24893d4315559a9d10, type: 3}
    - {fileID: 21300000, guid: d1be340476a176b46ac8b7e89a02412b, type: 3}
    - {fileID: 21300000, guid: 956efc449b1a64f499bf9abdb98a2a80, type: 3}
    - {fileID: 21300000, guid: 563da85af649b7e4fb787c1a6178eeba, type: 3}
    - {fileID: 21300000, guid: d599d1c802d0ed148ad5d2b3b22c3cde, type: 3}
    - {fileID: 21300000, guid: 09234fa9873c6ea428d7f5c7ef3f7d4d, type: 3}
    - {fileID: 21300000, guid: 8c21926218ec6cf428f60a5e3186a86a, type: 3}
    - {fileID: 21300000, guid: 0d0ef8c1205b7fe4281c61c4f6065f14, type: 3}
    - {fileID: 21300000, guid: 31991a9bbc18d964ca1abc26ed7053ad, type: 3}
    - {fileID: 21300000, guid: 4e0da61d05b69da4793bf6956e73fdb7, type: 3}
    - {fileID: 21300000, guid: 975d3613d50a9c94184ec70dffeeee83, type: 3}
    - {fileID: 21300000, guid: 1572b44438220d4478467dc08c27faf9, type: 3}
    - {fileID: 21300000, guid: f7b2f7d1f6a7d494e9b8e6c1a942c906, type: 3}
    - {fileID: 21300000, guid: 58afaf9fbb8928443abfa58a770eaa5a, type: 3}
    - {fileID: 21300000, guid: 41110b6795e45604c8b2149cc217297a, type: 3}
    - {fileID: 21300000, guid: 8917cd3989e51aa48ba39130bf13d527, type: 3}
    - {fileID: 21300000, guid: a5a2e384fe372fc479c6a2e033c493d5, type: 3}
    - {fileID: 21300000, guid: 26c00854073027644915e36a154cf569, type: 3}
    - {fileID: 21300000, guid: 1dc0160203b529c45a19d92c5aee9740, type: 3}
    - {fileID: 21300000, guid: 7f478d8e23a8540409abf55a824a47ef, type: 3}
    - {fileID: 21300000, guid: 9271d619f6b28a842bdd40b40fc2740e, type: 3}
    - {fileID: 21300000, guid: 2d27b18b4b4df364ea5c05c9898bd29c, type: 3}
    - {fileID: 21300000, guid: 7e3b51f9cff61734db0fa35f99271247, type: 3}
    - {fileID: 21300000, guid: cc7e8bd9429c5984bb666b5a9f3b548d, type: 3}
    - {fileID: 21300000, guid: 1ac88b364a7e01a48abfd36cc0f23ad5, type: 3}
  m_AnimationClipSettings:
    serializedVersion: 2
    m_AdditiveReferencePoseClip: {fileID: 0}
    m_AdditiveReferencePoseTime: 0
    m_StartTime: 0
    m_StopTime: 0.9999997
    m_OrientationOffsetY: 0
    m_Level: 0
    m_CycleOffset: 0
    m_HasAdditiveReferencePose: 0
    m_LoopTime: 1
    m_LoopBlend: 0
    m_LoopBlendOrientation: 0
    m_LoopBlendPositionY: 0
    m_LoopBlendPositionXZ: 0
    m_KeepOriginalOrientation: 0
    m_KeepOriginalPositionY: 1
    m_KeepOriginalPositionXZ: 0
    m_HeightFromFeet: 0
    m_Mirror: 0
  m_EditorCurves: []
  m_EulerEditorCurves: []
  m_HasGenericRootTransform: 0
  m_HasMotionFloatCurves: 0
  m_GenerateMotionCurves: 0
  m_Events: []
