{
  "dsJWTClientId": "878485a4-7bac-47c2-afcf-26cf246a6f39",
  "impersonatedUserGuid": "436e9bba-6b57-4fcf-9c63-db3b150cd900",
  "privateKeyLocation":  "./private.key",
  "dsOauthServer": "https://account-d.docusign.com"
}