{
  "project_info": {
    "project_number": "480615757969",
    "project_id": "aplikasi-pesan-makanan-e4420",
    "storage_bucket": "aplikasi-pesan-makanan-e4420.appspot.com"
  },
  "client": [
    {
      "client_info": {
        "mobilesdk_app_id": "1:480615757969:android:bbbdcfb8724813f60ca730",
        "android_client_info": {
          "package_name": "com.example.aplikasipesanmakanan"
        }
      },
      "oauth_client": [],
      "api_key": [
        {
          "current_key": "AIzaSyB2Sj4elsVlYeqfPM1UJwVKfXmj7rgukjk"
        }
      ],
      "services": {
        "appinvite_service": {
          "other_platform_oauth_client": []
        }
      }
    }
  ],
  "configuration_version": "1"
}