[
 {"bn": "urn:dev:mac:0024befffe804ff1/"},
 [ { "n": "voltage", "t": 0, "u": "V", "v": 120.1 },
   { "n": "current", "t": 0, "u": "A", "v": 1.2 }
 ],
 {"bn": "http://demohost/ambient/", "l":{"x":{}, "bn": "//", "data":[[[[[[]]]]]]}},
 [
   {"n": "r"},
   {"n": "w", "v":42},
   {"n": "//otherhost/y"},
   {"n": "//demohost/spot1/r"}
 ],
 {"bn": "http://demohost/spot2/"},
 [
   {"v": "not really bright"},
   {"n": "r", "v": 1},
   {"n": "../spot2/g", "v": 0.00002e5},
   {"n": "b", "v": 300000000000000000000000e-23}
 ]
]
