M48
; DRILL file {KiCad (5.1.12)-1} date 09/08/24 18:09:21
; FORMAT={2:4/ absolute / inch / suppress leading zeros}
; #@! TF.CreationDate,2024-09-08T18:09:21+02:00
; #@! TF.GenerationSoftware,Kicad,Pcbnew,(5.1.12)-1
; #@! TF.FileFunction,Plated,1,2,PTH
FMAT,2
INCH,TZ
T1C0.0157
T2C0.0256
T3C0.0276
T4C0.0300
T5C0.0315
T6C0.0394
T7C0.0550
T8C0.1260
%
G90
G05
T1
X11800Y-52200
X12600Y-50000
X12600Y-50400
X12600Y-51800
X12600Y-52200
X12750Y-57700
X12800Y-55800
X13650Y-56900
X15200Y-55100
X15225Y-57075
X16000Y-49900
X17100Y-53300
X17350Y-56050
X17700Y-59600
X19150Y-49900
X19200Y-58800
X20200Y-58800
X21100Y-58800
X21750Y-57350
X22650Y-59600
X23400Y-52800
X23400Y-57050
X24100Y-53500
X24500Y-57000
X24650Y-51000
X25000Y-52000
X25150Y-53800
X25150Y-54800
X25400Y-52000
X25450Y-56250
X25650Y-52500
X25650Y-52500
X26000Y-55300
X26100Y-50800
X26850Y-56650
X27150Y-51000
X27300Y-53400
X27500Y-58500
X27600Y-59600
X27650Y-56300
X27700Y-49900
X28200Y-58600
X29500Y-57225
X29800Y-57800
X29800Y-58200
X30100Y-52700
X30100Y-56700
X30500Y-57000
X31050Y-54900
X31100Y-55400
X31100Y-55900
X31100Y-56300
X31200Y-54450
X31450Y-58350
X31600Y-53000
X31600Y-56000
X31650Y-54450
X31950Y-54150
X32000Y-56300
X32300Y-55400
X32400Y-50550
X32400Y-54150
X32750Y-52900
X32800Y-54100
X32900Y-56100
X33150Y-55100
X33150Y-58650
X34000Y-53700
X34300Y-55400
X34300Y-59350
X34450Y-53400
X34500Y-56000
X34800Y-53600
X34900Y-51400
X35100Y-55800
X35300Y-52400
X35400Y-53000
X35400Y-56400
X35600Y-55400
X35600Y-55950
X35750Y-59350
X36000Y-54900
X36550Y-51450
X37150Y-58800
X37400Y-52600
X37450Y-53150
X38000Y-56700
X38100Y-58800
X38300Y-54950
X38450Y-50700
X39000Y-56700
X39500Y-52400
X39500Y-53150
X40350Y-54350
X40400Y-54950
X40500Y-55750
X40750Y-55250
X40900Y-56100
X40950Y-53550
X41300Y-54150
X41550Y-59700
X41950Y-54000
X41950Y-55750
X42100Y-54750
X42850Y-59700
X43800Y-50000
X43900Y-53000
X44200Y-57200
X44200Y-57600
X44200Y-59700
X45000Y-57400
T2
X27000Y-57400
X27000Y-57900
X27500Y-57400
X27500Y-57900
X28000Y-57400
X28000Y-57900
X28500Y-57400
X28500Y-57900
X29000Y-57400
X29000Y-57900
T3
X42650Y-50300
X42650Y-52300
X42650Y-53300
T4
X42650Y-54300
X42650Y-55300
X42650Y-56300
X42650Y-57300
T5
X31406Y-50700
X33327Y-50700
T6
X13650Y-59300
X14650Y-59300
X15650Y-59300
X16650Y-59300
X18650Y-58300
X18650Y-59300
X19650Y-58300
X19650Y-59300
X20650Y-50300
X20650Y-51300
X20650Y-52300
X20650Y-58300
X20650Y-59300
X21650Y-50300
X21650Y-51300
X21650Y-52300
X21650Y-58300
X21650Y-59300
X23650Y-50300
X23650Y-59300
X24650Y-50300
X24650Y-59300
X25650Y-50300
X25650Y-59300
X26650Y-50300
X26650Y-59300
X28650Y-59300
X29650Y-59300
X30650Y-59300
X31650Y-59300
X32650Y-59300
X33650Y-59300
X35000Y-58676
X35000Y-59700
X36650Y-57300
X36650Y-58300
X36650Y-59300
X37650Y-57300
X37650Y-58300
X37650Y-59300
X38650Y-57300
X38650Y-58300
X38650Y-59300
X39650Y-57300
X39650Y-58300
X39650Y-59300
T7
X13048Y-54080
X14033Y-55065
X16000Y-54081
X17967Y-55065
X18952Y-54080
T8
X10900Y-51050
X45900Y-58550
T0
M30
