EESchema Schematic File Version 4
EELAYER 30 0
EELAYER END
$Descr A4 11693 8268
encoding utf-8
Sheet 1 1
Title ""
Date ""
Rev ""
Comp ""
Comment1 ""
Comment2 ""
Comment3 ""
Comment4 ""
$EndDescr
$Comp
L Device:C C17
U 1 1 65CC5430
P 8975 4525
F 0 "C17" H 8975 4625 50  0000 L CNN
F 1 "100nF" H 8975 4425 50  0000 L CNN
F 2 "Capacitor_SMD:C_0603_1608Metric" H 9013 4375 50  0001 C CNN
F 3 "~" H 8975 4525 50  0001 C CNN
	1    8975 4525
	1    0    0    -1  
$EndComp
$Comp
L Switch:SW_Push BTN1
U 1 1 65D34828
P 7725 4525
F 0 "BTN1" H 7625 4625 50  0000 C CNN
F 1 "SW_Push" H 7925 4625 50  0000 C CNN
F 2 "Button_Switch_SMD:SW_SPST_REED_CT05-XXXX-G1" H 7725 4725 50  0001 C CNN
F 3 "~" H 7725 4725 50  0001 C CNN
	1    7725 4525
	0    1    1    0   
$EndComp
$Comp
L Switch:SW_Push BTN2
U 1 1 65D34DB0
P 7925 4525
F 0 "BTN2" H 7825 4625 50  0000 C CNN
F 1 "SW_Push" H 8125 4625 50  0000 C CNN
F 2 "Button_Switch_SMD:SW_SPST_REED_CT05-XXXX-G1" H 7925 4725 50  0001 C CNN
F 3 "~" H 7925 4725 50  0001 C CNN
	1    7925 4525
	0    1    1    0   
$EndComp
$Comp
L Device:LED D6
U 1 1 65D3574B
P 4775 1350
F 0 "D6" H 4600 1400 50  0000 L CNN
F 1 "LED" H 4850 1400 50  0000 L CNN
F 2 "LED_SMD:LED_1206_3216Metric_Pad1.42x1.75mm_HandSolder" H 4775 1350 50  0001 C CNN
F 3 "~" H 4775 1350 50  0001 C CNN
	1    4775 1350
	1    0    0    -1  
$EndComp
$Comp
L Device:LED D7
U 1 1 65D369C4
P 4775 1550
F 0 "D7" H 4600 1600 50  0000 L CNN
F 1 "LED" H 4850 1600 50  0000 L CNN
F 2 "LED_SMD:LED_1206_3216Metric_Pad1.42x1.75mm_HandSolder" H 4775 1550 50  0001 C CNN
F 3 "~" H 4775 1550 50  0001 C CNN
	1    4775 1550
	1    0    0    -1  
$EndComp
$Comp
L Connector:DIN-5_180degree J2
U 1 1 65D0886D
P 2585 4835
F 0 "J2" H 2585 4560 50  0000 C CNN
F 1 "MIDI_OUT" H 2585 4469 50  0000 C CNN
F 2 "kmKicadFootprint:kmMIDI_DIN5_180_sup5mm" H 2585 4835 50  0001 C CNN
F 3 "http://www.mouser.com/ds/2/18/40_c091_abd_e-75918.pdf" H 2585 4835 50  0001 C CNN
	1    2585 4835
	1    0    0    -1  
$EndComp
$Comp
L Device:R R6
U 1 1 65D0A5C6
P 2985 4535
F 0 "R6" V 2885 4535 50  0000 C CNN
F 1 "220R" V 2985 4535 50  0000 C CNN
F 2 "Resistor_SMD:R_0805_2012Metric" V 2915 4535 50  0001 C CNN
F 3 "~" H 2985 4535 50  0001 C CNN
	1    2985 4535
	-1   0    0    1   
$EndComp
Wire Wire Line
	2885 4735 2985 4735
Wire Wire Line
	2985 4735 2985 4685
$Comp
L Device:R R5
U 1 1 65D0F8CA
P 2235 4535
F 0 "R5" V 2135 4535 50  0000 C CNN
F 1 "220R" V 2235 4535 50  0000 C CNN
F 2 "Resistor_SMD:R_0805_2012Metric" V 2165 4535 50  0001 C CNN
F 3 "~" H 2235 4535 50  0001 C CNN
	1    2235 4535
	-1   0    0    1   
$EndComp
Wire Wire Line
	2235 4685 2235 4735
Wire Wire Line
	2235 4735 2285 4735
Text GLabel 1985 4335 0    50   Input ~ 0
VCC
Wire Wire Line
	1985 4335 2235 4335
Wire Wire Line
	2235 4335 2235 4385
Wire Wire Line
	2985 4385 2985 4335
Wire Wire Line
	2985 4335 3635 4335
Wire Wire Line
	2885 4135 3035 4135
Wire Wire Line
	3635 4135 3635 4335
$Comp
L power:GNDD #PWR07
U 1 1 65D32C8A
P 2785 4435
F 0 "#PWR07" H 2785 4185 50  0001 C CNN
F 1 "GNDD" H 2789 4280 50  0000 C CNN
F 2 "" H 2785 4435 50  0001 C CNN
F 3 "" H 2785 4435 50  0001 C CNN
	1    2785 4435
	1    0    0    -1  
$EndComp
Wire Wire Line
	2585 4535 2585 4335
Wire Wire Line
	2585 4335 2785 4335
Wire Wire Line
	2785 4335 2785 4435
NoConn ~ 2885 4835
NoConn ~ 2285 4835
Text GLabel 1985 4135 0    50   Input ~ 0
TXD0
Wire Wire Line
	1985 4135 2285 4135
$Comp
L Connector:Conn_01x06_Female J8
U 1 1 6607971D
P 9275 1425
F 0 "J8" H 9275 1025 50  0000 C CNN
F 1 "AIRPORT" H 9125 1725 50  0000 C CNN
F 2 "Connector_PinSocket_2.54mm:PinSocket_1x06_P2.54mm_Vertical" H 9275 1425 50  0001 C CNN
F 3 "~" H 9275 1425 50  0001 C CNN
	1    9275 1425
	-1   0    0    1   
$EndComp
$Comp
L Connector:Conn_01x04_Male J10
U 1 1 660727C2
P 10250 2725
F 0 "J10" H 10275 2875 50  0000 C CNN
F 1 "ADC" H 10300 2475 50  0000 C CNN
F 2 "Connector_PinHeader_2.54mm:PinHeader_1x04_P2.54mm_Vertical" H 10250 2725 50  0001 C CNN
F 3 "~" H 10250 2725 50  0001 C CNN
	1    10250 2725
	1    0    0    -1  
$EndComp
Text GLabel 9825 1625 2    50   Input ~ 0
VCC
Wire Wire Line
	9825 1625 9475 1625
$Comp
L power:GNDD #PWR019
U 1 1 6609A1EB
P 10475 1625
F 0 "#PWR019" H 10475 1375 50  0001 C CNN
F 1 "GNDD" H 10479 1470 50  0000 C CNN
F 2 "" H 10475 1625 50  0001 C CNN
F 3 "" H 10475 1625 50  0001 C CNN
	1    10475 1625
	1    0    0    -1  
$EndComp
Text GLabel 9825 1125 2    50   Input ~ 0
~RESET~
Wire Wire Line
	9825 1125 9475 1125
Text GLabel 9600 3875 2    50   Input ~ 0
VCC
Text GLabel 4425 1350 0    50   Input ~ 0
LED1
Text GLabel 4425 1150 0    50   Input ~ 0
LED2
$Comp
L power:GNDD #PWR08
U 1 1 6613605B
P 4525 1675
F 0 "#PWR08" H 4525 1425 50  0001 C CNN
F 1 "GNDD" H 4529 1520 50  0000 C CNN
F 2 "" H 4525 1675 50  0001 C CNN
F 3 "" H 4525 1675 50  0001 C CNN
	1    4525 1675
	1    0    0    -1  
$EndComp
$Comp
L Device:R_Pack04 RN1
U 1 1 66150C72
P 5725 1250
F 0 "RN1" V 5425 1200 50  0000 L CNN
F 1 "1.2K" V 5925 1150 50  0000 L CNN
F 2 "Resistor_SMD:R_Array_Convex_4x0603" V 6000 1250 50  0001 C CNN
F 3 "~" H 5725 1250 50  0001 C CNN
	1    5725 1250
	0    1    1    0   
$EndComp
Wire Wire Line
	5075 1350 5075 1550
Wire Wire Line
	5075 1550 4925 1550
Wire Wire Line
	5975 1350 5925 1350
Wire Wire Line
	5975 1000 5975 1050
Wire Wire Line
	5925 1050 5975 1050
Connection ~ 5975 1050
Wire Wire Line
	5975 1050 5975 1150
Wire Wire Line
	5925 1150 5975 1150
Connection ~ 5975 1150
Wire Wire Line
	5975 1150 5975 1250
Wire Wire Line
	5925 1250 5975 1250
Connection ~ 5975 1250
Wire Wire Line
	5975 1250 5975 1350
Text GLabel 4425 950  0    50   Input ~ 0
LED3
Wire Wire Line
	4525 1675 4525 1550
Wire Wire Line
	4525 1550 4625 1550
Wire Wire Line
	4425 950  4625 950 
Wire Wire Line
	4425 1150 4625 1150
Wire Wire Line
	4425 1350 4625 1350
$Comp
L Device:R_Pack04 RN2
U 1 1 6622ACC9
P 9275 4175
F 0 "RN2" V 8975 4075 50  0000 L CNN
F 1 "10K" V 9475 4075 50  0000 L CNN
F 2 "Resistor_SMD:R_Array_Convex_4x0603" V 9550 4175 50  0001 C CNN
F 3 "~" H 9275 4175 50  0001 C CNN
	1    9275 4175
	0    1    1    0   
$EndComp
$Comp
L Device:C C16
U 1 1 6622F009
P 8725 4525
F 0 "C16" H 8725 4625 50  0000 L CNN
F 1 "100nF" H 8725 4425 50  0000 L CNN
F 2 "Capacitor_SMD:C_0603_1608Metric" H 8763 4375 50  0001 C CNN
F 3 "~" H 8725 4525 50  0001 C CNN
	1    8725 4525
	1    0    0    -1  
$EndComp
$Comp
L Device:C C15
U 1 1 6622FB8B
P 8475 4525
F 0 "C15" H 8475 4625 50  0000 L CNN
F 1 "100nF" H 8475 4425 50  0000 L CNN
F 2 "Capacitor_SMD:C_0603_1608Metric" H 8513 4375 50  0001 C CNN
F 3 "~" H 8475 4525 50  0001 C CNN
	1    8475 4525
	1    0    0    -1  
$EndComp
$Comp
L Device:C C14
U 1 1 6622FF2D
P 8225 4525
F 0 "C14" H 8225 4625 50  0000 L CNN
F 1 "100nF" H 8225 4425 50  0000 L CNN
F 2 "Capacitor_SMD:C_0603_1608Metric" H 8263 4375 50  0001 C CNN
F 3 "~" H 8225 4525 50  0001 C CNN
	1    8225 4525
	1    0    0    -1  
$EndComp
$Comp
L power:GNDD #PWR016
U 1 1 662301B0
P 8225 5075
F 0 "#PWR016" H 8225 4825 50  0001 C CNN
F 1 "GNDD" H 8229 4920 50  0000 C CNN
F 2 "" H 8225 5075 50  0001 C CNN
F 3 "" H 8225 5075 50  0001 C CNN
	1    8225 5075
	1    0    0    -1  
$EndComp
Wire Wire Line
	9075 4275 8975 4275
Wire Wire Line
	8975 4275 8975 4375
Wire Wire Line
	9075 4175 8725 4175
Wire Wire Line
	8725 4175 8725 4375
Wire Wire Line
	9075 4075 8475 4075
Wire Wire Line
	8475 4075 8475 4375
Wire Wire Line
	9075 3975 8225 3975
Wire Wire Line
	8225 3975 8225 4375
Wire Wire Line
	9475 4275 9525 4275
Wire Wire Line
	9525 4275 9525 4175
Wire Wire Line
	9525 3975 9475 3975
Connection ~ 9525 3975
Wire Wire Line
	9475 4075 9525 4075
Connection ~ 9525 4075
Wire Wire Line
	9525 4075 9525 3975
Wire Wire Line
	9475 4175 9525 4175
Connection ~ 9525 4175
Wire Wire Line
	9525 4175 9525 4075
Text GLabel 5975 1000 1    50   Input ~ 0
VCC
Connection ~ 8225 3975
Wire Wire Line
	8475 4075 7925 4075
Connection ~ 8475 4075
Wire Wire Line
	7725 3975 8225 3975
Text GLabel 7575 4275 0    50   Input ~ 0
BTN4
Text GLabel 7575 4175 0    50   Input ~ 0
BTN3
Text GLabel 7575 4075 0    50   Input ~ 0
BTN2
Text GLabel 7575 3975 0    50   Input ~ 0
BTN1
Wire Wire Line
	7575 3975 7725 3975
Connection ~ 7725 3975
Connection ~ 7925 4075
Connection ~ 8725 4175
Wire Wire Line
	7575 4175 8725 4175
Wire Wire Line
	7575 4275 8975 4275
Connection ~ 8975 4275
Wire Wire Line
	7575 4075 7925 4075
Wire Wire Line
	7725 3975 7725 4325
Wire Wire Line
	7925 4075 7925 4325
Wire Wire Line
	8225 4675 8225 4925
Wire Wire Line
	7725 4725 7725 4925
Wire Wire Line
	7725 4925 7925 4925
Connection ~ 8225 4925
Wire Wire Line
	8225 4925 8225 5075
Wire Wire Line
	8225 4925 8475 4925
Wire Wire Line
	8975 4675 8975 4925
Wire Wire Line
	8725 4675 8725 4925
Connection ~ 8725 4925
Wire Wire Line
	8725 4925 8975 4925
Wire Wire Line
	8475 4675 8475 4925
Connection ~ 8475 4925
Wire Wire Line
	8475 4925 8725 4925
Wire Wire Line
	7925 4725 7925 4925
Connection ~ 7925 4925
Wire Wire Line
	7925 4925 8225 4925
$Comp
L Connector:Conn_01x04_Male J11
U 1 1 663AB5BB
P 10775 4375
F 0 "J11" H 10975 4525 50  0000 C CNN
F 1 "BTN" H 10775 4525 50  0000 C CNN
F 2 "Connector_PinHeader_2.54mm:PinHeader_1x04_P2.54mm_Vertical" H 10775 4375 50  0001 C CNN
F 3 "~" H 10775 4375 50  0001 C CNN
	1    10775 4375
	-1   0    0    1   
$EndComp
Text GLabel 10275 4475 0    50   Input ~ 0
BTN4
Text GLabel 10275 4375 0    50   Input ~ 0
BTN3
Text GLabel 10275 4275 0    50   Input ~ 0
BTN2
Text GLabel 10275 4175 0    50   Input ~ 0
BTN1
Wire Wire Line
	10575 4175 10275 4175
Wire Wire Line
	10575 4275 10275 4275
Wire Wire Line
	10575 4375 10275 4375
Wire Wire Line
	10575 4475 10275 4475
Text GLabel 10800 2625 2    50   Input ~ 0
ADC0
Text GLabel 10800 2725 2    50   Input ~ 0
ADC1
Text GLabel 10800 2825 2    50   Input ~ 0
ADC2
Text GLabel 10800 2925 2    50   Input ~ 0
ADC3
Wire Wire Line
	10450 2925 10800 2925
Wire Wire Line
	10450 2825 10800 2825
Wire Wire Line
	10450 2725 10800 2725
Wire Wire Line
	10450 2625 10800 2625
Text GLabel 9825 1225 2    50   Input ~ 0
MOSI
Text GLabel 9825 1325 2    50   Input ~ 0
MISO
Wire Wire Line
	9475 1225 9825 1225
Wire Wire Line
	9825 1325 9475 1325
$Comp
L Connector:Conn_01x04_Male J3
U 1 1 665708B4
P 5275 4070
F 0 "J3" H 5275 4270 50  0000 C CNN
F 1 "MIDI-USART" H 5480 3820 50  0000 C CNN
F 2 "Connector_PinHeader_2.54mm:PinHeader_1x04_P2.54mm_Vertical" H 5275 4070 50  0001 C CNN
F 3 "~" H 5275 4070 50  0001 C CNN
	1    5275 4070
	1    0    0    -1  
$EndComp
$Comp
L power:GNDD #PWR013
U 1 1 66571EFF
P 6175 4220
F 0 "#PWR013" H 6175 3970 50  0001 C CNN
F 1 "GNDD" H 6179 4065 50  0000 C CNN
F 2 "" H 6175 4220 50  0001 C CNN
F 3 "" H 6175 4220 50  0001 C CNN
	1    6175 4220
	1    0    0    -1  
$EndComp
Text GLabel 5825 3970 2    50   Input ~ 0
VCC
Wire Wire Line
	5475 3970 5825 3970
Text GLabel 5825 4170 2    50   Input ~ 0
RXD0
Wire Wire Line
	5475 4170 5825 4170
Text GLabel 10500 6200 2    50   Input ~ 0
SDA
Text GLabel 10500 6100 2    50   Input ~ 0
SCL
Text GLabel 10800 5550 2    50   Input ~ 0
VCC
$Comp
L power:GNDD #PWR020
U 1 1 666F3F4D
P 10850 6300
F 0 "#PWR020" H 10850 6050 50  0001 C CNN
F 1 "GNDD" H 10854 6145 50  0000 C CNN
F 2 "" H 10850 6300 50  0001 C CNN
F 3 "" H 10850 6300 50  0001 C CNN
	1    10850 6300
	1    0    0    -1  
$EndComp
Wire Wire Line
	10850 6000 10850 6300
Wire Wire Line
	10050 5900 10100 5900
$Comp
L Connector:Conn_01x04_Male J9
U 1 1 666F2C85
P 9850 6000
F 0 "J9" H 9900 6150 50  0000 C CNN
F 1 "TWI" H 9900 5750 50  0000 C CNN
F 2 "Connector_PinHeader_2.54mm:PinHeader_1x04_P2.54mm_Vertical" H 9850 6000 50  0001 C CNN
F 3 "~" H 9850 6000 50  0001 C CNN
	1    9850 6000
	1    0    0    -1  
$EndComp
Text GLabel 3035 4735 2    50   Input ~ 0
MCON5
Text GLabel 2185 4735 0    50   Input ~ 0
MCON4
Wire Wire Line
	2185 4735 2235 4735
Connection ~ 2235 4735
Wire Wire Line
	2985 4735 3035 4735
Connection ~ 2985 4735
Text GLabel 9125 2725 0    50   Input ~ 0
GPIO1
Text GLabel 9125 2925 0    50   Input ~ 0
GPIO3
Text GLabel 9900 2625 2    50   Input ~ 0
ADC0
Text GLabel 9900 2725 2    50   Input ~ 0
ADC1
Text GLabel 9900 2825 2    50   Input ~ 0
ADC2
Text GLabel 9900 2925 2    50   Input ~ 0
ADC3
Text GLabel 9125 2625 0    50   Input ~ 0
GPIO0
Text GLabel 9125 2825 0    50   Input ~ 0
GPIO2
Text GLabel 10175 1525 2    50   Input ~ 0
SCK
Wire Wire Line
	9475 1525 9725 1525
Wire Wire Line
	10025 1525 10175 1525
Wire Wire Line
	10475 1425 10475 1625
Wire Wire Line
	9475 1425 10475 1425
Text GLabel 5825 4270 2    50   Input ~ 0
TXD0
Wire Wire Line
	6175 4070 6175 4220
Wire Wire Line
	5475 4070 6175 4070
Wire Wire Line
	5475 4270 5825 4270
$Comp
L Jumper:SolderJumper_2_Open JP6
U 1 1 65E87D62
P 9450 2925
F 0 "JP6" H 9225 2975 50  0000 C CNN
F 1 "IO-ADC3" H 9725 2975 50  0000 C CNN
F 2 "Jumper:SolderJumper-2_P1.3mm_Open_RoundedPad1.0x1.5mm" H 9450 2925 50  0001 C CNN
F 3 "~" H 9450 2925 50  0001 C CNN
	1    9450 2925
	1    0    0    -1  
$EndComp
$Comp
L Jumper:SolderJumper_2_Open JP5
U 1 1 65E8C9F4
P 9450 2825
F 0 "JP5" H 9225 2875 50  0000 C CNN
F 1 "IO-ADC2" H 9725 2875 50  0000 C CNN
F 2 "Jumper:SolderJumper-2_P1.3mm_Open_RoundedPad1.0x1.5mm" H 9450 2825 50  0001 C CNN
F 3 "~" H 9450 2825 50  0001 C CNN
	1    9450 2825
	1    0    0    -1  
$EndComp
$Comp
L Jumper:SolderJumper_2_Open JP4
U 1 1 65E8CD9F
P 9450 2725
F 0 "JP4" H 9225 2775 50  0000 C CNN
F 1 "IO-ADC1" H 9725 2775 50  0000 C CNN
F 2 "Jumper:SolderJumper-2_P1.3mm_Open_RoundedPad1.0x1.5mm" H 9450 2725 50  0001 C CNN
F 3 "~" H 9450 2725 50  0001 C CNN
	1    9450 2725
	1    0    0    -1  
$EndComp
$Comp
L Jumper:SolderJumper_2_Open JP3
U 1 1 65E8D0F8
P 9450 2625
F 0 "JP3" H 9225 2675 50  0000 C CNN
F 1 "IO-ADC0" H 9725 2675 50  0000 C CNN
F 2 "Jumper:SolderJumper-2_P1.3mm_Open_RoundedPad1.0x1.5mm" H 9450 2625 50  0001 C CNN
F 3 "~" H 9450 2625 50  0001 C CNN
	1    9450 2625
	1    0    0    -1  
$EndComp
$Comp
L Jumper:SolderJumper_2_Open JP7
U 1 1 660B5A5D
P 9875 1525
F 0 "JP7" H 10100 1475 50  0000 C CNN
F 1 "JP_SCK" H 10050 1575 50  0000 C CNN
F 2 "Jumper:SolderJumper-2_P1.3mm_Open_RoundedPad1.0x1.5mm" H 9875 1525 50  0001 C CNN
F 3 "~" H 9875 1525 50  0001 C CNN
	1    9875 1525
	1    0    0    -1  
$EndComp
$Comp
L Device:R R11
U 1 1 65E8BF85
P 10400 5750
F 0 "R11" V 10300 5750 50  0000 C CNN
F 1 "4K7" V 10400 5750 50  0000 C CNN
F 2 "Resistor_SMD:R_0805_2012Metric" V 10330 5750 50  0001 C CNN
F 3 "~" H 10400 5750 50  0001 C CNN
	1    10400 5750
	-1   0    0    1   
$EndComp
$Comp
L Device:R R10
U 1 1 65E782EA
P 10250 5750
F 0 "R10" V 10350 5750 50  0000 C CNN
F 1 "4K7" V 10250 5750 50  0000 C CNN
F 2 "Resistor_SMD:R_0805_2012Metric" V 10180 5750 50  0001 C CNN
F 3 "~" H 10250 5750 50  0001 C CNN
	1    10250 5750
	-1   0    0    1   
$EndComp
Wire Wire Line
	10050 6000 10850 6000
Wire Wire Line
	10050 6100 10400 6100
Wire Wire Line
	10050 6200 10250 6200
Wire Wire Line
	10250 5900 10250 6200
Connection ~ 10250 6200
Wire Wire Line
	10250 6200 10500 6200
Wire Wire Line
	10400 5900 10400 6100
Connection ~ 10400 6100
Wire Wire Line
	10400 6100 10500 6100
Wire Wire Line
	10100 5550 10250 5550
Wire Wire Line
	10250 5600 10250 5550
Connection ~ 10250 5550
Wire Wire Line
	10250 5550 10400 5550
Wire Wire Line
	10400 5600 10400 5550
Connection ~ 10400 5550
Wire Wire Line
	10400 5550 10800 5550
Wire Wire Line
	10100 5550 10100 5900
Wire Wire Line
	5000 1250 5000 1350
Wire Wire Line
	5000 1350 4925 1350
Wire Wire Line
	5000 1050 5000 950 
Wire Wire Line
	5000 950  4925 950 
Text GLabel 8150 5600 2    50   Input ~ 0
VCC
$Comp
L power:GNDD #PWR015
U 1 1 65D313A6
P 7750 6300
F 0 "#PWR015" H 7750 6050 50  0001 C CNN
F 1 "GNDD" H 7754 6145 50  0000 C CNN
F 2 "" H 7750 6300 50  0001 C CNN
F 3 "" H 7750 6300 50  0001 C CNN
	1    7750 6300
	1    0    0    -1  
$EndComp
Wire Wire Line
	7750 6300 7750 6200
Wire Wire Line
	7750 6200 7350 6200
$Comp
L Interface_Optical:TSOP312xx U3
U 1 1 65D685DD
P 5600 3050
F 0 "U3" H 5134 3100 50  0000 R CNN
F 1 "TSOP312xx" H 5134 3009 50  0000 R CNN
F 2 "OptoDevice:Vishay_CAST-3Pin" H 5550 2675 50  0001 C CNN
F 3 "http://www.vishay.com/docs/82492/tsop312.pdf" H 6250 3350 50  0001 C CNN
	1    5600 3050
	-1   0    0    -1  
$EndComp
Text GLabel 4950 2200 2    50   Input ~ 0
VCC
$Comp
L power:GNDD #PWR09
U 1 1 65D97EE7
P 4650 3375
F 0 "#PWR09" H 4650 3125 50  0001 C CNN
F 1 "GNDD" H 4654 3220 50  0000 C CNN
F 2 "" H 4650 3375 50  0001 C CNN
F 3 "" H 4650 3375 50  0001 C CNN
	1    4650 3375
	1    0    0    -1  
$EndComp
$Comp
L Device:R R7
U 1 1 65D98ED2
P 4650 2450
F 0 "R7" V 4600 2600 50  0000 C CNN
F 1 "180R" V 4650 2450 50  0000 C CNN
F 2 "Resistor_SMD:R_0805_2012Metric" V 4580 2450 50  0001 C CNN
F 3 "~" H 4650 2450 50  0001 C CNN
	1    4650 2450
	-1   0    0    1   
$EndComp
Wire Wire Line
	4650 2300 4650 2200
$Comp
L Device:C C10
U 1 1 65DE2D10
P 4650 3050
F 0 "C10" H 4650 3150 50  0000 L CNN
F 1 "100nF" H 4650 2950 50  0000 L CNN
F 2 "Capacitor_SMD:C_0603_1608Metric" H 4688 2900 50  0001 C CNN
F 3 "~" H 4650 3050 50  0001 C CNN
	1    4650 3050
	1    0    0    -1  
$EndComp
Wire Wire Line
	4650 2600 4650 2850
Wire Wire Line
	4650 3200 4650 3250
Wire Wire Line
	4650 3250 5200 3250
Connection ~ 4650 2850
Wire Wire Line
	4650 2850 4650 2900
Wire Wire Line
	4650 3250 4650 3375
Connection ~ 4650 3250
Wire Wire Line
	4850 3050 5200 3050
$Comp
L Jumper:SolderJumper_2_Open JP2
U 1 1 65E7A617
P 5150 2700
F 0 "JP2" H 5025 2750 50  0000 C CNN
F 1 "ICP" H 5275 2750 50  0000 C CNN
F 2 "Jumper:SolderJumper-2_P1.3mm_Open_RoundedPad1.0x1.5mm" H 5150 2700 50  0001 C CNN
F 3 "~" H 5150 2700 50  0001 C CNN
	1    5150 2700
	1    0    0    -1  
$EndComp
Wire Wire Line
	4850 2700 5000 2700
Text GLabel 5400 2700 2    50   Input ~ 0
BTN4
Wire Wire Line
	5300 2700 5400 2700
$Comp
L power:PWR_FLAG #FLG03
U 1 1 65EB1722
P 4550 2850
F 0 "#FLG03" H 4550 2925 50  0001 C CNN
F 1 "PWR_FLAG" V 4550 2977 50  0000 L CNN
F 2 "" H 4550 2850 50  0001 C CNN
F 3 "~" H 4550 2850 50  0001 C CNN
	1    4550 2850
	0    -1   -1   0   
$EndComp
Wire Wire Line
	4650 2850 4550 2850
Wire Wire Line
	6000 4750 6050 4750
Wire Wire Line
	6185 4850 6185 5080
Text GLabel 5415 4850 0    50   Input ~ 0
VCC
$Comp
L power:GNDD #PWR010
U 1 1 66331401
P 6185 5080
F 0 "#PWR010" H 6185 4830 50  0001 C CNN
F 1 "GNDD" H 6189 4925 50  0000 C CNN
F 2 "" H 6185 5080 50  0001 C CNN
F 3 "" H 6185 5080 50  0001 C CNN
	1    6185 5080
	1    0    0    -1  
$EndComp
$Comp
L Connector_Generic:Conn_02x04_Counter_Clockwise J5
U 1 1 661030B8
P 7700 5850
F 0 "J5" H 7850 5450 50  0000 C CNN
F 1 "VCC_GNDD" H 7500 5450 50  0000 C CNN
F 2 "Connector_PinHeader_2.54mm:PinHeader_2x04_P2.54mm_Vertical" H 7700 5850 50  0001 C CNN
F 3 "~" H 7700 5850 50  0001 C CNN
	1    7700 5850
	1    0    0    -1  
$EndComp
Wire Wire Line
	7450 5600 8050 5600
Wire Wire Line
	7350 6050 7500 6050
Wire Wire Line
	7500 5850 7350 5850
Wire Wire Line
	7350 5850 7350 6050
Wire Wire Line
	7450 5600 7450 5750
Wire Wire Line
	7450 5750 7500 5750
Wire Wire Line
	7450 5750 7450 5950
Wire Wire Line
	7450 5950 7500 5950
Connection ~ 7450 5750
Wire Wire Line
	8000 5850 8050 5850
Connection ~ 8050 5600
Wire Wire Line
	8050 5600 8150 5600
Wire Wire Line
	8050 6050 8000 6050
Connection ~ 8050 5850
Text Label 9525 1525 0    50   ~ 0
O-SCK
Wire Wire Line
	5000 1050 5525 1050
Wire Wire Line
	4925 1150 5525 1150
Wire Wire Line
	5000 1250 5525 1250
Wire Wire Line
	5075 1350 5525 1350
Text Label 5175 1350 0    50   ~ 0
A-LED0
Text Label 5175 1250 0    50   ~ 0
A-LED1
Text Label 5175 1150 0    50   ~ 0
A-LED2
Text Label 5175 1050 0    50   ~ 0
A-LED3
Text Label 2885 4135 0    50   ~ 0
~TXD0~
Text Label 3235 4335 0    50   ~ 0
MIDI-OUT
Text Label 4900 3050 0    50   ~ 0
IR-OUT
Wire Wire Line
	4850 2700 4850 3050
Wire Wire Line
	5200 2850 4650 2850
Text Label 4900 2850 0    50   ~ 0
IR-VSS
Connection ~ 9350 5950
Wire Wire Line
	9350 5750 9350 5950
Wire Wire Line
	9200 5750 9350 5750
Connection ~ 8950 6200
Wire Wire Line
	9350 5950 9200 5950
Wire Wire Line
	9350 6200 9350 5950
Wire Wire Line
	8950 6200 9350 6200
Wire Wire Line
	8600 6050 8600 6200
Connection ~ 8600 6050
Wire Wire Line
	8700 6050 8600 6050
Wire Wire Line
	8600 6200 8950 6200
Wire Wire Line
	8600 5850 8600 6050
Wire Wire Line
	8700 5850 8600 5850
Wire Wire Line
	8950 6250 8950 6200
$Comp
L Connector_Generic:Conn_02x04_Counter_Clockwise J7
U 1 1 65FE05D5
P 8900 5850
F 0 "J7" H 9050 5450 50  0000 C CNN
F 1 "AREF_GNDA" H 8650 5450 50  0000 C CNN
F 2 "Connector_PinHeader_2.54mm:PinHeader_2x04_P2.54mm_Vertical" H 8900 5850 50  0001 C CNN
F 3 "~" H 8900 5850 50  0001 C CNN
	1    8900 5850
	1    0    0    -1  
$EndComp
Connection ~ 8650 5750
Wire Wire Line
	8650 5950 8700 5950
Wire Wire Line
	8650 5750 8650 5950
Wire Wire Line
	8650 5750 8700 5750
Wire Wire Line
	8650 5600 8650 5750
Wire Wire Line
	9250 5600 8650 5600
Connection ~ 9250 5850
Wire Wire Line
	9250 6050 9200 6050
Wire Wire Line
	9250 5850 9250 6050
Wire Wire Line
	9250 5850 9250 5600
Wire Wire Line
	9200 5850 9250 5850
Text GLabel 9350 5600 2    50   Input ~ 0
AREF
$Comp
L power:GNDA #PWR018
U 1 1 65D31BF9
P 8950 6250
F 0 "#PWR018" H 8950 6000 50  0001 C CNN
F 1 "GNDA" H 8955 6077 50  0000 C CNN
F 2 "" H 8950 6250 50  0001 C CNN
F 3 "" H 8950 6250 50  0001 C CNN
	1    8950 6250
	1    0    0    -1  
$EndComp
$Comp
L Device:Crystal Y1
U 1 1 65CC442B
P 1425 1675
F 0 "Y1" V 1275 1625 50  0000 C CNN
F 1 "16MHz" H 1425 1825 50  0000 C CNN
F 2 "kmKicadFootprint:kmCrystal_SMD_THC_HC49-SD" H 1425 1675 50  0001 C CNN
F 3 "~" H 1425 1675 50  0001 C CNN
	1    1425 1675
	0    1    1    0   
$EndComp
$Comp
L Device:C C1
U 1 1 65CC4FEC
P 1125 1475
F 0 "C1" V 1075 1325 50  0000 L CNN
F 1 "22pF" V 975 1425 50  0000 L CNN
F 2 "Capacitor_SMD:C_0603_1608Metric" H 1163 1325 50  0001 C CNN
F 3 "~" H 1125 1475 50  0001 C CNN
	1    1125 1475
	0    1    1    0   
$EndComp
$Comp
L Device:C C3
U 1 1 65D05A65
P 2025 2975
F 0 "C3" H 2025 3075 50  0000 L CNN
F 1 "100nF" H 2025 2875 50  0000 L CNN
F 2 "Capacitor_SMD:C_0603_1608Metric" H 2063 2825 50  0001 C CNN
F 3 "~" H 2025 2975 50  0001 C CNN
	1    2025 2975
	1    0    0    -1  
$EndComp
Text GLabel 1175 2775 0    50   Input ~ 0
AREF
$Comp
L power:GNDD #PWR06
U 1 1 65D25066
P 2575 3175
F 0 "#PWR06" H 2575 2925 50  0001 C CNN
F 1 "GNDD" H 2579 3020 50  0000 C CNN
F 2 "" H 2575 3175 50  0001 C CNN
F 3 "" H 2575 3175 50  0001 C CNN
	1    2575 3175
	1    0    0    -1  
$EndComp
Wire Wire Line
	2575 2975 2575 3025
Wire Wire Line
	2575 3025 2675 3025
Wire Wire Line
	2675 3025 2675 2975
Connection ~ 2575 3025
Wire Wire Line
	2575 3025 2575 3175
Text GLabel 2725 825  2    50   Input ~ 0
AVCC
Text GLabel 2425 825  0    50   Input ~ 0
VCC
Wire Wire Line
	2425 825  2575 825 
Wire Wire Line
	2575 825  2575 975 
Wire Wire Line
	2725 825  2675 825 
Wire Wire Line
	2675 825  2675 975 
$Comp
L Device:C C2
U 1 1 65E0ADFF
P 1125 1875
F 0 "C2" V 1075 1725 50  0000 L CNN
F 1 "22pF" V 975 1825 50  0000 L CNN
F 2 "Capacitor_SMD:C_0603_1608Metric" H 1163 1725 50  0001 C CNN
F 3 "~" H 1125 1875 50  0001 C CNN
	1    1125 1875
	0    1    1    0   
$EndComp
Wire Wire Line
	1275 1875 1425 1875
Wire Wire Line
	2075 1775 1625 1775
Wire Wire Line
	1625 1775 1625 1475
Wire Wire Line
	1625 1475 1425 1475
Text GLabel 1975 2075 0    50   Input ~ 0
ADC1
Text GLabel 1975 2175 0    50   Input ~ 0
ADC2
Text GLabel 1975 2275 0    50   Input ~ 0
ADC3
Wire Wire Line
	1975 2075 2075 2075
Wire Wire Line
	1975 2175 2075 2175
Wire Wire Line
	1975 2275 2075 2275
$Comp
L power:GNDD #PWR01
U 1 1 65E420F4
P 975 1925
F 0 "#PWR01" H 975 1675 50  0001 C CNN
F 1 "GNDD" H 979 1770 50  0000 C CNN
F 2 "" H 975 1925 50  0001 C CNN
F 3 "" H 975 1925 50  0001 C CNN
	1    975  1925
	1    0    0    -1  
$EndComp
Wire Wire Line
	975  1475 975  1875
Connection ~ 975  1875
Wire Wire Line
	975  1875 975  1925
Text GLabel 2025 2575 0    50   Input ~ 0
~RESET~
Wire Wire Line
	2025 2575 2075 2575
Wire Wire Line
	1425 1525 1425 1475
Connection ~ 1425 1475
Wire Wire Line
	1425 1475 1275 1475
Wire Wire Line
	1425 1825 1425 1875
Connection ~ 1425 1875
Wire Wire Line
	1425 1875 2075 1875
$Comp
L power:GNDD #PWR03
U 1 1 65F2D69C
P 2025 3175
F 0 "#PWR03" H 2025 2925 50  0001 C CNN
F 1 "GNDD" H 2029 3020 50  0000 C CNN
F 2 "" H 2025 3175 50  0001 C CNN
F 3 "" H 2025 3175 50  0001 C CNN
	1    2025 3175
	1    0    0    -1  
$EndComp
Wire Wire Line
	2025 3125 2025 3175
Wire Wire Line
	1525 2775 2025 2775
Wire Wire Line
	2025 2825 2025 2775
Connection ~ 2025 2775
Wire Wire Line
	2025 2775 2075 2775
Wire Wire Line
	1225 2775 1175 2775
Text GLabel 2975 2175 2    50   Input ~ 0
D-
Text GLabel 1975 1575 0    50   Input ~ 0
MISO
Wire Wire Line
	2875 2275 2975 2275
Wire Wire Line
	2875 2175 2975 2175
$Comp
L dk_Embedded-Microcontrollers:ATMEGA328PB-AU U2
U 1 1 65CBE73E
P 2575 1575
F 0 "U2" H 2775 2125 60  0000 C CNN
F 1 "ATMEGA328PB-AU" H 2075 2125 60  0000 C CNN
F 2 "digikey-footprints:TQFP-32_7x7mm" H 2775 1775 60  0001 L CNN
F 3 "http://www.microchip.com/mymicrochip/filehandler.aspx?ddocname=en589666" H 2775 1875 60  0001 L CNN
F 4 "ATMEGA328PB-AU-ND" H 2775 1975 60  0001 L CNN "Digi-Key_PN"
F 5 "ATMEGA328PB-AU" H 2775 2075 60  0001 L CNN "MPN"
F 6 "Integrated Circuits (ICs)" H 2775 2175 60  0001 L CNN "Category"
F 7 "Embedded - Microcontrollers" H 2775 2275 60  0001 L CNN "Family"
F 8 "http://www.microchip.com/mymicrochip/filehandler.aspx?ddocname=en589666" H 2775 2375 60  0001 L CNN "DK_Datasheet_Link"
F 9 "/product-detail/en/microchip-technology/ATMEGA328PB-AU/ATMEGA328PB-AU-ND/5638812" H 2775 2475 60  0001 L CNN "DK_Detail_Page"
F 10 "IC MCU 8BIT 32KB FLASH 32TQFP" H 2775 2575 60  0001 L CNN "Description"
F 11 "Microchip Technology" H 2775 2675 60  0001 L CNN "Manufacturer"
F 12 "Active" H 2775 2775 60  0001 L CNN "Status"
	1    2575 1575
	1    0    0    -1  
$EndComp
Wire Wire Line
	2075 1475 1975 1475
Wire Wire Line
	2075 1575 1975 1575
Text GLabel 2975 2475 2    50   Input ~ 0
TXD0
Wire Wire Line
	2875 2475 2975 2475
Text GLabel 2975 2275 2    50   Input ~ 0
D+
Text GLabel 1975 1975 0    50   Input ~ 0
ADC0
Wire Wire Line
	1975 1975 2075 1975
Text GLabel 1975 1675 0    50   Input ~ 0
SCK
Wire Wire Line
	1975 1675 2075 1675
Text GLabel 1975 1475 0    50   Input ~ 0
MOSI
Text GLabel 2975 1775 2    50   Input ~ 0
BTN4
Text GLabel 2975 1675 2    50   Input ~ 0
BTN3
Text GLabel 2975 1575 2    50   Input ~ 0
BTN2
Text GLabel 2975 1475 2    50   Input ~ 0
BTN1
Wire Wire Line
	2875 1475 2975 1475
Wire Wire Line
	2975 1575 2875 1575
Wire Wire Line
	2975 1675 2875 1675
Wire Wire Line
	2975 1775 2875 1775
Text GLabel 1975 1175 0    50   Input ~ 0
LED1
Text GLabel 1975 1275 0    50   Input ~ 0
LED2
Text GLabel 1975 1375 0    50   Input ~ 0
LED3
Wire Wire Line
	2875 2075 2975 2075
Wire Wire Line
	2875 1975 2975 1975
Wire Wire Line
	2875 1875 2975 1875
Wire Wire Line
	2875 2375 2975 2375
Text GLabel 2975 2575 2    50   Input ~ 0
RXD0
Wire Wire Line
	2975 2575 2875 2575
Wire Wire Line
	1975 1175 2075 1175
Wire Wire Line
	1975 1275 2075 1275
Wire Wire Line
	1975 1375 2075 1375
Text GLabel 2975 2375 2    50   Input ~ 0
GPIO0
Text GLabel 2975 1875 2    50   Input ~ 0
GPIO1
Text GLabel 2975 2075 2    50   Input ~ 0
GPIO3
Text GLabel 1975 2375 0    50   Input ~ 0
SDA
Text GLabel 1975 2475 0    50   Input ~ 0
SCL
Wire Wire Line
	1975 2375 2075 2375
Wire Wire Line
	1975 2475 2075 2475
Text GLabel 2975 1975 2    50   Input ~ 0
GPIO2
$Comp
L Jumper:SolderJumper_2_Open JP1
U 1 1 65E58EE8
P 1375 2775
F 0 "JP1" H 1225 2825 50  0000 C CNN
F 1 "O-AREF" H 1575 2825 50  0000 C CNN
F 2 "Jumper:SolderJumper-2_P1.3mm_Open_RoundedPad1.0x1.5mm" H 1375 2775 50  0001 C CNN
F 3 "~" H 1375 2775 50  0001 C CNN
	1    1375 2775
	1    0    0    -1  
$EndComp
Text Label 1475 1475 0    50   ~ 0
XTAL1
Text Label 1475 1875 0    50   ~ 0
XTAL2
Text Label 1725 2775 0    50   ~ 0
O-AREF
Wire Wire Line
	7350 6050 7350 6200
Connection ~ 7350 6050
Wire Wire Line
	8050 5600 8050 5850
Wire Wire Line
	8050 5850 8050 6050
Wire Wire Line
	8150 5750 8150 5950
Wire Wire Line
	8000 5950 8150 5950
Connection ~ 8150 5950
Wire Wire Line
	8150 5950 8150 6200
Wire Wire Line
	8150 5750 8000 5750
Wire Wire Line
	7750 6200 8150 6200
Connection ~ 7750 6200
Wire Wire Line
	9350 5600 9250 5600
Connection ~ 9250 5600
NoConn ~ 7825 1425
NoConn ~ 7825 1325
NoConn ~ 8325 1425
Wire Wire Line
	8875 1525 8875 1625
Connection ~ 8875 1525
Wire Wire Line
	8325 1525 8875 1525
Text GLabel 7625 1525 0    50   Input ~ 0
MOSI
Text GLabel 8525 1325 2    50   Input ~ 0
~RESET~
Text GLabel 8525 1225 2    50   Input ~ 0
VCC
Text GLabel 7625 1225 0    50   Input ~ 0
MISO
Wire Wire Line
	8325 1125 8875 1125
Wire Wire Line
	8875 1125 8875 1525
$Comp
L power:GNDD #PWR017
U 1 1 65F2BAAF
P 8875 1625
F 0 "#PWR017" H 8875 1375 50  0001 C CNN
F 1 "GNDD" H 8879 1470 50  0000 C CNN
F 2 "" H 8875 1625 50  0001 C CNN
F 3 "" H 8875 1625 50  0001 C CNN
	1    8875 1625
	1    0    0    -1  
$EndComp
Text GLabel 7625 1125 0    50   Input ~ 0
SCK
Wire Wire Line
	8325 1325 8525 1325
Wire Wire Line
	8325 1225 8525 1225
Wire Wire Line
	7825 1525 7625 1525
Wire Wire Line
	7825 1225 7625 1225
Wire Wire Line
	7825 1125 7625 1125
$Comp
L Connector_Generic:Conn_02x05_Odd_Even J6
U 1 1 65DD9048
P 8025 1325
F 0 "J6" H 8075 1625 50  0000 C CNN
F 1 "uISP" H 8075 1025 50  0000 C CNN
F 2 "Connector_PinHeader_1.27mm:PinHeader_2x05_P1.27mm_Vertical" H 8025 1325 50  0001 C CNN
F 3 "~" H 8025 1325 50  0001 C CNN
	1    8025 1325
	1    0    0    -1  
$EndComp
$Comp
L power:GNDD #PWR04
U 1 1 661022CB
P 1275 4915
F 0 "#PWR04" H 1275 4665 50  0001 C CNN
F 1 "GNDD" H 1279 4760 50  0000 C CNN
F 2 "" H 1275 4915 50  0001 C CNN
F 3 "" H 1275 4915 50  0001 C CNN
	1    1275 4915
	1    0    0    -1  
$EndComp
Wire Wire Line
	1275 4865 1275 4915
Wire Wire Line
	1275 3815 1325 3815
Wire Wire Line
	1275 3865 1275 3815
Text GLabel 1325 3815 2    50   Input ~ 0
VCC
Wire Notes Line
	6975 5400 6975 6500
Wire Notes Line
	6975 6500 9675 6500
Wire Notes Line
	9675 6500 9675 5400
Wire Notes Line
	9675 5400 6975 5400
Wire Notes Line
	9775 5400 9775 6500
Wire Notes Line
	9775 6500 11200 6500
Wire Notes Line
	11200 6500 11200 5400
Wire Notes Line
	11200 5400 9775 5400
Wire Notes Line
	775  5400 775  7375
Wire Notes Line
	6875 5400 6875 7375
Text Notes 800  5500 0    50   ~ 0
POWER SECTION & USB
Wire Notes Line
	6875 7375 775  7375
Wire Notes Line
	775  5400 6875 5400
Text Label 1575 6175 0    50   ~ 0
USB-D+
Text Label 1575 6075 0    50   ~ 0
USB-D-
Wire Wire Line
	5275 6375 5575 6375
Connection ~ 5275 6375
Wire Wire Line
	5275 6325 5275 6375
Wire Wire Line
	5275 5975 5575 5975
Connection ~ 5275 5975
Wire Wire Line
	5275 5975 5275 6025
$Comp
L Device:C C12
U 1 1 664A0515
P 5275 6175
F 0 "C12" H 5275 6275 50  0000 L CNN
F 1 "100nF" H 5275 6075 50  0000 L CNN
F 2 "Capacitor_SMD:C_0603_1608Metric" H 5313 6025 50  0001 C CNN
F 3 "~" H 5275 6175 50  0001 C CNN
	1    5275 6175
	1    0    0    -1  
$EndComp
Connection ~ 4975 6375
Wire Wire Line
	4975 6375 5275 6375
Connection ~ 4975 5975
Wire Wire Line
	4975 5975 5275 5975
Wire Wire Line
	3725 5975 4025 5975
Wire Wire Line
	3725 6375 4025 6375
Wire Wire Line
	4025 5975 4025 6025
Wire Wire Line
	4025 6325 4025 6375
Connection ~ 4025 5975
$Comp
L power:GNDA #PWR012
U 1 1 65D0F494
P 5575 6425
F 0 "#PWR012" H 5575 6175 50  0001 C CNN
F 1 "GNDA" H 5580 6252 50  0000 C CNN
F 2 "" H 5575 6425 50  0001 C CNN
F 3 "" H 5575 6425 50  0001 C CNN
	1    5575 6425
	1    0    0    -1  
$EndComp
$Comp
L power:PWR_FLAG #FLG04
U 1 1 65D0F91F
P 5575 6325
F 0 "#FLG04" H 5575 6400 50  0001 C CNN
F 1 "PWR_FLAG" H 5575 6498 50  0000 C CNN
F 2 "" H 5575 6325 50  0001 C CNN
F 3 "~" H 5575 6325 50  0001 C CNN
	1    5575 6325
	1    0    0    -1  
$EndComp
$Comp
L power:+3V3 #PWR011
U 1 1 65D12E67
P 5575 5925
F 0 "#PWR011" H 5575 5775 50  0001 C CNN
F 1 "+3V3" H 5590 6098 50  0000 C CNN
F 2 "" H 5575 5925 50  0001 C CNN
F 3 "" H 5575 5925 50  0001 C CNN
	1    5575 5925
	1    0    0    -1  
$EndComp
Wire Wire Line
	5575 5975 5575 5925
Text GLabel 5675 5975 2    50   Input ~ 0
AREF
Wire Wire Line
	5575 5975 5675 5975
Wire Wire Line
	3725 5675 5975 5675
Wire Wire Line
	5975 5975 5975 5675
Wire Wire Line
	6425 5925 6425 5975
$Comp
L power:PWR_FLAG #FLG05
U 1 1 65CF2777
P 6425 5925
F 0 "#FLG05" H 6425 6000 50  0001 C CNN
F 1 "PWR_FLAG" H 6425 6098 50  0000 C CNN
F 2 "" H 6425 5925 50  0001 C CNN
F 3 "~" H 6425 5925 50  0001 C CNN
	1    6425 5925
	1    0    0    -1  
$EndComp
Wire Wire Line
	6425 6325 6425 6425
Wire Wire Line
	5975 5975 6075 5975
Wire Wire Line
	6425 5975 6525 5975
Connection ~ 6425 5975
Wire Wire Line
	6425 6025 6425 5975
Wire Wire Line
	6375 5975 6425 5975
Text GLabel 6525 5975 2    50   Input ~ 0
AVCC
$Comp
L Device:C C13
U 1 1 65CE8765
P 6425 6175
F 0 "C13" H 6425 6275 50  0000 L CNN
F 1 "100nF" H 6425 6075 50  0000 L CNN
F 2 "Capacitor_SMD:C_0603_1608Metric" H 6463 6025 50  0001 C CNN
F 3 "~" H 6425 6175 50  0001 C CNN
	1    6425 6175
	1    0    0    -1  
$EndComp
$Comp
L power:GNDA #PWR014
U 1 1 65CCCBD2
P 6425 6425
F 0 "#PWR014" H 6425 6175 50  0001 C CNN
F 1 "GNDA" H 6430 6252 50  0000 C CNN
F 2 "" H 6425 6425 50  0001 C CNN
F 3 "" H 6425 6425 50  0001 C CNN
	1    6425 6425
	1    0    0    -1  
$EndComp
$Comp
L Device:L L1
U 1 1 65CCBFEA
P 6225 5975
F 0 "L1" V 6075 5975 50  0000 C CNN
F 1 "10uH" V 6175 5975 50  0000 C CNN
F 2 "Inductor_SMD:L_0603_1608Metric" H 6225 5975 50  0001 C CNN
F 3 "~" H 6225 5975 50  0001 C CNN
	1    6225 5975
	0    1    1    0   
$EndComp
Wire Wire Line
	4625 6375 4675 6375
$Comp
L Device:Net-Tie_2 NT1
U 1 1 65D0C393
P 4775 6375
F 0 "NT1" H 4775 6425 50  0000 C CNN
F 1 "Net-Tie_2" H 4775 6325 50  0000 C CNN
F 2 "NetTie:NetTie-2_THT_Pad1.0mm" H 4775 6375 50  0001 C CNN
F 3 "~" H 4775 6375 50  0001 C CNN
	1    4775 6375
	1    0    0    -1  
$EndComp
Wire Wire Line
	4625 6375 4625 6275
$Comp
L dk_PMIC-Voltage-Reference:REF3030AIDBZR VR1
U 1 1 65EE8170
P 4625 5975
F 0 "VR1" H 4725 5725 50  0000 C CNN
F 1 "REF3033AIDBZT" H 4625 6149 50  0000 C CNN
F 2 "digikey-footprints:SOT-23-3" H 4825 6175 50  0001 L CNN
F 3 "http://www.ti.com/general/docs/suppproductinfo.tsp?distId=10&gotoUrl=http%3A%2F%2Fwww.ti.com%2Flit%2Fgpn%2Fref3012" H 4825 6275 60  0001 L CNN
F 4 "296-26323-1-ND" H 4825 6375 60  0001 L CNN "Digi-Key_PN"
F 5 "REF3030AIDBZR" H 4825 6475 60  0001 L CNN "MPN"
F 6 "Integrated Circuits (ICs)" H 4825 6575 60  0001 L CNN "Category"
F 7 "PMIC - Voltage Reference" H 4825 6675 60  0001 L CNN "Family"
F 8 "http://www.ti.com/general/docs/suppproductinfo.tsp?distId=10&gotoUrl=http%3A%2F%2Fwww.ti.com%2Flit%2Fgpn%2Fref3012" H 4825 6775 60  0001 L CNN "DK_Datasheet_Link"
F 9 "/product-detail/en/texas-instruments/REF3030AIDBZR/296-26323-1-ND/2254966" H 4825 6875 60  0001 L CNN "DK_Detail_Page"
F 10 "IC VREF SERIES 3V SOT23-3" H 4825 6975 60  0001 L CNN "Description"
F 11 "Texas Instruments" H 4825 7075 60  0001 L CNN "Manufacturer"
F 12 "Active" H 4825 7175 60  0001 L CNN "Status"
	1    4625 5975
	1    0    0    -1  
$EndComp
Wire Wire Line
	4875 6375 4975 6375
Wire Wire Line
	4975 6325 4975 6375
Wire Wire Line
	4925 5975 4975 5975
Wire Wire Line
	4975 6025 4975 5975
$Comp
L Device:CP C11
U 1 1 65D054DF
P 4975 6175
F 0 "C11" H 5025 6275 50  0000 L CNN
F 1 "4.7uF" H 4975 6075 50  0000 L CNN
F 2 "Capacitor_Tantalum_SMD:CP_EIA-3216-18_Kemet-A" H 5013 6025 50  0001 C CNN
F 3 "~" H 4975 6175 50  0001 C CNN
	1    4975 6175
	1    0    0    -1  
$EndComp
Connection ~ 4625 6375
Connection ~ 4025 6375
Wire Wire Line
	5575 6325 5575 6375
Connection ~ 5575 5975
Connection ~ 5575 6375
Wire Wire Line
	5575 6375 5575 6425
Wire Wire Line
	4025 6375 4275 6375
Wire Wire Line
	4025 5975 4275 5975
Wire Wire Line
	4275 6025 4275 5975
Connection ~ 4275 5975
Wire Wire Line
	4275 5975 4325 5975
Wire Wire Line
	4275 6325 4275 6375
Connection ~ 4275 6375
Wire Wire Line
	4275 6375 4625 6375
$Comp
L Device:C C9
U 1 1 6613C7A0
P 4025 6175
F 0 "C9" H 4025 6275 50  0000 L CNN
F 1 "100nF" H 4025 6075 50  0000 L CNN
F 2 "Capacitor_SMD:C_0603_1608Metric" H 4063 6025 50  0001 C CNN
F 3 "~" H 4025 6175 50  0001 C CNN
	1    4025 6175
	1    0    0    -1  
$EndComp
Connection ~ 3725 6375
NoConn ~ 1475 6275
Wire Wire Line
	2075 6075 2075 6475
Connection ~ 2075 6475
Wire Wire Line
	3425 6375 3725 6375
Wire Wire Line
	3125 5975 3425 5975
Wire Wire Line
	3175 5825 3225 5825
Text GLabel 3225 5825 2    50   Input ~ 0
~RESET~
Wire Wire Line
	2825 5825 2875 5825
Wire Wire Line
	2825 5975 2825 5825
$Comp
L Device:R R4
U 1 1 65E5D35B
P 3025 5825
F 0 "R4" V 2925 5825 50  0000 C CNN
F 1 "10K" V 3025 5825 50  0000 C CNN
F 2 "Resistor_SMD:R_0805_2012Metric" V 2955 5825 50  0001 C CNN
F 3 "~" H 3025 5825 50  0001 C CNN
	1    3025 5825
	0    1    1    0   
$EndComp
Wire Wire Line
	2525 5825 2575 5825
Wire Wire Line
	2525 5975 2525 5825
Text GLabel 2575 5825 2    50   Input ~ 0
VCC
Wire Wire Line
	3725 5675 3725 5975
Wire Wire Line
	2175 5975 2525 5975
Wire Wire Line
	3425 5975 3725 5975
Connection ~ 3425 5975
Wire Wire Line
	3425 6025 3425 5975
Connection ~ 3725 5975
Wire Wire Line
	3725 6025 3725 5975
Wire Wire Line
	3725 6325 3725 6375
Connection ~ 3425 6375
Wire Wire Line
	3125 6375 3425 6375
Wire Wire Line
	3425 6375 3425 6325
$Comp
L Device:C C8
U 1 1 65CFBBA3
P 3725 6175
F 0 "C8" H 3725 6275 50  0000 L CNN
F 1 "100nF" H 3725 6075 50  0000 L CNN
F 2 "Capacitor_SMD:C_0603_1608Metric" H 3763 6025 50  0001 C CNN
F 3 "~" H 3725 6175 50  0001 C CNN
	1    3725 6175
	1    0    0    -1  
$EndComp
$Comp
L Device:C C7
U 1 1 65CFB5A9
P 3425 6175
F 0 "C7" H 3425 6275 50  0000 L CNN
F 1 "100nF" H 3425 6075 50  0000 L CNN
F 2 "Capacitor_SMD:C_0603_1608Metric" H 3463 6025 50  0001 C CNN
F 3 "~" H 3425 6175 50  0001 C CNN
	1    3425 6175
	1    0    0    -1  
$EndComp
Connection ~ 3125 6375
Wire Wire Line
	3125 6325 3125 6375
Connection ~ 3125 5975
Wire Wire Line
	3125 6025 3125 5975
$Comp
L Device:CP C4
U 1 1 65CF863F
P 2525 6175
F 0 "C4" H 2575 6275 50  0000 L CNN
F 1 "22uF" H 2575 6075 50  0000 L CNN
F 2 "Capacitor_Tantalum_SMD:CP_EIA-3216-18_Kemet-A" H 2563 6025 50  0001 C CNN
F 3 "~" H 2525 6175 50  0001 C CNN
	1    2525 6175
	1    0    0    -1  
$EndComp
Wire Wire Line
	2825 5975 3125 5975
Connection ~ 2825 5975
Wire Wire Line
	2825 6025 2825 5975
Wire Wire Line
	2825 6325 2825 6375
Wire Wire Line
	2525 6375 2825 6375
Connection ~ 2525 6375
Wire Wire Line
	2525 6325 2525 6375
Wire Wire Line
	2525 5975 2825 5975
Connection ~ 2525 5975
Wire Wire Line
	2525 5975 2525 6025
Wire Wire Line
	1575 6375 2525 6375
$Comp
L Device:C C5
U 1 1 65CF485E
P 2825 6175
F 0 "C5" H 2825 6275 50  0000 L CNN
F 1 "100nF" H 2825 6075 50  0000 L CNN
F 2 "Capacitor_SMD:C_0603_1608Metric" H 2863 6025 50  0001 C CNN
F 3 "~" H 2825 6175 50  0001 C CNN
	1    2825 6175
	1    0    0    -1  
$EndComp
$Comp
L Device:C C6
U 1 1 65CF10A5
P 3125 6175
F 0 "C6" H 3125 6275 50  0000 L CNN
F 1 "100nF" H 3125 6075 50  0000 L CNN
F 2 "Capacitor_SMD:C_0603_1608Metric" H 3163 6025 50  0001 C CNN
F 3 "~" H 3125 6175 50  0001 C CNN
	1    3125 6175
	1    0    0    -1  
$EndComp
$Comp
L power:+5V #PWR05
U 1 1 65CE1CFA
P 2175 5925
F 0 "#PWR05" H 2175 5775 50  0001 C CNN
F 1 "+5V" H 2190 6098 50  0000 C CNN
F 2 "" H 2175 5925 50  0001 C CNN
F 3 "" H 2175 5925 50  0001 C CNN
	1    2175 5925
	1    0    0    -1  
$EndComp
Wire Wire Line
	2175 5975 2175 5925
Connection ~ 2175 5975
Wire Wire Line
	2175 6025 2175 5975
Connection ~ 2175 6475
Wire Wire Line
	2175 6325 2175 6475
$Comp
L Device:R R1
U 1 1 65CDFDB3
P 2175 6175
F 0 "R1" H 2275 6175 50  0000 C CNN
F 1 "4K7" V 2175 6175 50  0000 C CNN
F 2 "Resistor_SMD:R_0805_2012Metric" V 2105 6175 50  0001 C CNN
F 3 "~" H 2175 6175 50  0001 C CNN
	1    2175 6175
	1    0    0    -1  
$EndComp
Wire Wire Line
	1575 5975 2175 5975
Connection ~ 2825 6375
Wire Wire Line
	2825 6375 3125 6375
Connection ~ 2075 7025
Wire Wire Line
	2825 7025 2825 6375
Wire Wire Line
	2075 7025 2825 7025
Wire Wire Line
	975  7025 975  6675
Wire Wire Line
	1875 7025 975  7025
Connection ~ 1875 7025
Wire Wire Line
	1875 7025 1875 7075
Wire Wire Line
	1875 7025 1875 6975
Wire Wire Line
	2075 7025 2075 6975
Wire Wire Line
	1875 7025 2075 7025
Connection ~ 1575 5975
Wire Wire Line
	1575 5925 1575 5975
Connection ~ 1575 6375
Wire Wire Line
	1575 6425 1575 6375
$Comp
L power:PWR_FLAG #FLG02
U 1 1 65CDC71D
P 1575 6425
F 0 "#FLG02" H 1575 6500 50  0001 C CNN
F 1 "PWR_FLAG" H 1575 6598 50  0000 C CNN
F 2 "" H 1575 6425 50  0001 C CNN
F 3 "~" H 1575 6425 50  0001 C CNN
	1    1575 6425
	-1   0    0    1   
$EndComp
Wire Wire Line
	1475 5975 1575 5975
Wire Wire Line
	1475 6375 1575 6375
Wire Wire Line
	1475 6175 1875 6175
Wire Wire Line
	1475 6075 2075 6075
Wire Wire Line
	2075 6475 2075 6675
Wire Wire Line
	2175 6475 2075 6475
Connection ~ 1875 6625
Wire Wire Line
	1875 6625 1875 6675
Wire Wire Line
	2175 6625 1875 6625
Wire Wire Line
	2575 6625 2475 6625
Wire Wire Line
	2475 6475 2575 6475
Text GLabel 2575 6625 2    50   Input ~ 0
D+
Text GLabel 2575 6475 2    50   Input ~ 0
D-
$Comp
L Device:R R3
U 1 1 65CD3C2F
P 2325 6625
F 0 "R3" V 2275 6775 50  0000 C CNN
F 1 "68R" V 2325 6625 50  0000 C CNN
F 2 "Resistor_SMD:R_0805_2012Metric" V 2255 6625 50  0001 C CNN
F 3 "~" H 2325 6625 50  0001 C CNN
	1    2325 6625
	0    1    1    0   
$EndComp
$Comp
L Device:R R2
U 1 1 65CD2F9A
P 2325 6475
F 0 "R2" V 2275 6625 50  0000 C CNN
F 1 "68R" V 2325 6475 50  0000 C CNN
F 2 "Resistor_SMD:R_0805_2012Metric" V 2255 6475 50  0001 C CNN
F 3 "~" H 2325 6475 50  0001 C CNN
	1    2325 6475
	0    1    1    0   
$EndComp
$Comp
L Device:D_Zener_ALT D2
U 1 1 65CD2BD8
P 2075 6825
F 0 "D2" V 1975 6825 50  0000 L CNN
F 1 "3V3" V 2175 6825 50  0000 L CNN
F 2 "Diode_SMD:D_SOD-323" H 2075 6825 50  0001 C CNN
F 3 "~" H 2075 6825 50  0001 C CNN
	1    2075 6825
	0    1    1    0   
$EndComp
$Comp
L Device:D_Zener_ALT D1
U 1 1 65CD24B3
P 1875 6825
F 0 "D1" V 1775 6825 50  0000 L CNN
F 1 "3V3" V 1975 6825 50  0000 L CNN
F 2 "Diode_SMD:D_SOD-323" H 1875 6825 50  0001 C CNN
F 3 "~" H 1875 6825 50  0001 C CNN
	1    1875 6825
	0    1    1    0   
$EndComp
Wire Wire Line
	1875 6175 1875 6625
$Comp
L power:GNDD #PWR02
U 1 1 65CCC67C
P 1875 7075
F 0 "#PWR02" H 1875 6825 50  0001 C CNN
F 1 "GNDD" H 1879 6920 50  0000 C CNN
F 2 "" H 1875 7075 50  0001 C CNN
F 3 "" H 1875 7075 50  0001 C CNN
	1    1875 7075
	1    0    0    -1  
$EndComp
$Comp
L power:PWR_FLAG #FLG01
U 1 1 65CCB9DC
P 1575 5925
F 0 "#FLG01" H 1575 6000 50  0001 C CNN
F 1 "PWR_FLAG" H 1575 6098 50  0000 C CNN
F 2 "" H 1575 5925 50  0001 C CNN
F 3 "~" H 1575 5925 50  0001 C CNN
	1    1575 5925
	1    0    0    -1  
$EndComp
$Comp
L dk_USB-DVI-HDMI-Connectors:0548190519 J1
U 1 1 65CCA59B
P 1175 6175
F 0 "J1" H 1200 6725 60  0000 C CNN
F 1 "0548190519" H 1300 5600 60  0000 C CNN
F 2 "digikey-footprints:USB_Mini_B_Female_690-005-299-043" H 1375 6375 60  0001 L CNN
F 3 "https://www.molex.com/pdm_docs/sd/548190519_sd.pdf" H 1375 6475 60  0001 L CNN
F 4 "WM17115-ND" H 1375 6575 60  0001 L CNN "Digi-Key_PN"
F 5 "0548190519" H 1375 6675 60  0001 L CNN "MPN"
F 6 "Connectors, Interconnects" H 1375 6775 60  0001 L CNN "Category"
F 7 "USB, DVI, HDMI Connectors" H 1375 6875 60  0001 L CNN "Family"
F 8 "https://www.molex.com/pdm_docs/sd/548190519_sd.pdf" H 1375 6975 60  0001 L CNN "DK_Datasheet_Link"
F 9 "/product-detail/en/molex/0548190519/WM17115-ND/773802" H 1375 7075 60  0001 L CNN "DK_Detail_Page"
F 10 "CONN RCPT USB2.0 MINI B 5P R/A" H 1375 7175 60  0001 L CNN "Description"
F 11 "Molex" H 1375 7275 60  0001 L CNN "Manufacturer"
F 12 "Active" H 1375 7375 60  0001 L CNN "Status"
	1    1175 6175
	1    0    0    -1  
$EndComp
Wire Notes Line
	775  5300 775  3675
Wire Notes Line
	6875 3675 6875 5300
Wire Notes Line
	6875 5300 775  5300
Text Notes 800  3775 0    50   ~ 0
MIDI
Text Notes 7000 5500 0    50   ~ 0
POWER HEADERS
Text Notes 9800 5500 0    50   ~ 0
TWI/I2C
Wire Notes Line
	6975 5300 11200 5300
Wire Notes Line
	11200 5300 11200 3675
Wire Notes Line
	11200 3675 6975 3675
Wire Notes Line
	6975 3675 6975 5300
Text Notes 7000 3775 0    50   ~ 0
BUTTONS
Wire Wire Line
	9600 2625 9900 2625
Wire Wire Line
	9600 2725 9900 2725
Wire Wire Line
	9600 2825 9900 2825
Wire Wire Line
	9600 2925 9900 2925
Wire Wire Line
	9125 2625 9300 2625
Wire Wire Line
	9125 2725 9300 2725
Wire Wire Line
	9125 2825 9300 2825
Wire Wire Line
	9125 2925 9300 2925
Wire Notes Line
	6875 3575 3650 3575
Wire Notes Line
	3650 3575 3650 2075
Wire Notes Line
	3650 2075 6875 2075
Wire Notes Line
	6875 2075 6875 3575
Wire Notes Line
	6975 3575 11200 3575
Wire Notes Line
	11200 3575 11200 2075
Wire Notes Line
	11200 2075 6975 2075
Wire Notes Line
	6975 2075 6975 3575
Wire Notes Line
	3650 1975 6875 1975
Wire Notes Line
	6875 1975 6875 575 
Wire Notes Line
	6875 575  3650 575 
Wire Notes Line
	3650 575  3650 1975
Wire Notes Line
	6975 1975 11200 1975
Wire Notes Line
	11200 1975 11200 575 
Wire Notes Line
	11200 575  6975 575 
Wire Notes Line
	6975 575  6975 1975
Wire Notes Line
	3550 3575 3550 575 
Wire Notes Line
	3550 575  775  575 
Wire Notes Line
	775  575  775  3575
Wire Notes Line
	775  3575 3550 3575
Text Notes 800  675  0    50   ~ 0
MAIN MCU\n
Text Notes 3675 675  0    50   ~ 0
STATUS LEDs
Text Notes 7000 675  0    50   ~ 0
CONNECTIVITY & PROGRAMMING
Text Notes 7025 2275 0    50   ~ 0
ADC & FLSP\n**) Populate R8' (AltR) instead of R8 to if FSLP need to be flipped
Text Notes 3675 2250 0    50   ~ 0
IR RECEIVER\n*) used from RN2
Text Notes 7320 7510 0    79   Italic 16
kmMidiMini Project
Text Notes 8120 7640 0    71   ~ 0
2024-09-08
Text Notes 10550 7650 0    71   ~ 0
1.0
Text Notes 7000 6975 0    50   ~ 0
DIY MIDI Controller with support for IR Receiver, V-USB, \nand Force-Sensing Linear Potentiometer (Pololu #2730)\nAuthor: Krzysztof Moskwa\n\nReleased under GNU General Public License GNU GPL-v3.0-only
Wire Notes Line
	6875 3675 775  3675
$Comp
L Device:LED D4
U 1 1 65D366F5
P 4775 950
F 0 "D4" H 4600 1000 50  0000 L CNN
F 1 "LED" H 4850 1000 50  0000 L CNN
F 2 "LED_SMD:LED_1206_3216Metric_Pad1.42x1.75mm_HandSolder" H 4775 950 50  0001 C CNN
F 3 "~" H 4775 950 50  0001 C CNN
	1    4775 950 
	1    0    0    -1  
$EndComp
Wire Wire Line
	9525 3875 9525 3975
Wire Wire Line
	9525 3875 9600 3875
$Comp
L Diode:CDBA360-HF D3
U 1 1 65F071D7
P 4275 6175
F 0 "D3" V 4150 6175 50  0000 L CNN
F 1 "CDBA360-HF" V 4550 5975 50  0000 L CNN
F 2 "Diode_SMD:D_SMA" H 4275 6000 50  0001 C CNN
F 3 "https://www.comchiptech.com/admin/files/product/CDBA340-HF%20Thru193640.%20CDBA3100-HF%20RevB.pdf" H 4275 6175 50  0001 C CNN
	1    4275 6175
	0    1    1    0   
$EndComp
Text GLabel 8450 2825 2    50   Input ~ 0
GPIO3
Text GLabel 8450 2725 2    50   Input ~ 0
GPIO2
Text GLabel 8450 2625 2    50   Input ~ 0
GPIO1
Text GLabel 8450 2925 2    50   Input ~ 0
GPIO0
Wire Wire Line
	4650 2200 4950 2200
Wire Notes Line
	4800 2350 4900 2350
Wire Notes Line
	4900 2350 4900 2550
Wire Notes Line
	4900 2550 4800 2550
Wire Notes Line
	4800 2550 4800 2350
Wire Notes Line
	4850 2350 4850 2200
Wire Notes Line
	4850 2550 4850 2700
Text Notes 4900 2550 1    50   ~ 0
R10K
Text Notes 4800 2425 0    50   ~ 0
*
$Comp
L Connector_Generic:Conn_02x03_Odd_Even J4
U 1 1 6650C6E5
P 5700 4850
F 0 "J4" H 5750 5060 50  0000 C CNN
F 1 "MCON" H 5740 4645 50  0000 C CNN
F 2 "Connector_PinHeader_2.54mm:PinHeader_2x03_P2.54mm_Vertical" H 5700 4850 50  0001 C CNN
F 3 "~" H 5700 4850 50  0001 C CNN
	1    5700 4850
	1    0    0    -1  
$EndComp
Text GLabel 6050 4750 2    50   Input ~ 0
MCON5
Wire Wire Line
	7600 2725 8450 2725
Wire Wire Line
	7600 2625 8350 2625
Wire Wire Line
	7600 2825 7625 2825
Wire Wire Line
	7625 2825 8450 2825
Connection ~ 7625 2825
Wire Wire Line
	7675 3100 7625 3100
Wire Wire Line
	7625 2825 7625 3100
Wire Wire Line
	8275 3100 8350 3100
Wire Wire Line
	8350 3100 8350 2625
Connection ~ 8350 2625
Wire Wire Line
	8350 2625 8450 2625
Wire Wire Line
	7600 2925 7975 2925
Wire Wire Line
	7975 3000 7975 2925
Connection ~ 7975 2925
Wire Wire Line
	7975 2925 8450 2925
$Comp
L kmKiCadSymbol:DR R8
U 1 1 66BD8B79
P 7825 3100
F 0 "R8" V 7900 3100 50  0000 C CNN
F 1 "DR" V 7750 2950 50  0000 C CNN
F 2 "kmKicadFootprint:DR_0805_2012Metric" V 7755 3100 50  0001 C CNN
F 3 "~" H 7825 3100 50  0001 C CNN
	1    7825 3100
	0    -1   -1   0   
$EndComp
$Comp
L kmKiCadSymbol:PololuFSLP_G FSLP_G1
U 1 1 66BDB1C4
P 7600 2725
F 0 "FSLP_G1" H 7408 3050 50  0000 C CNN
F 1 "PololuFSLP_G" H 7408 2959 50  0000 C CNN
F 2 "kmKicadFootprint:FSLP_G" H 7050 3025 50  0001 C CNN
F 3 "" H 7600 2725 50  0001 C CNN
	1    7600 2725
	1    0    0    -1  
$EndComp
Text GLabel 5415 4750 0    50   Input ~ 0
MCON4
Wire Wire Line
	6050 4950 6000 4950
Wire Wire Line
	5415 4750 5500 4750
Wire Wire Line
	5415 4850 5500 4850
Wire Wire Line
	6000 4850 6185 4850
$Comp
L 4xxx:4069 U1
U 7 1 67157A87
P 1275 4365
F 0 "U1" H 1505 4411 50  0000 L CNN
F 1 "4069" H 1505 4320 50  0000 L CNN
F 2 "digikey-footprints:SOIC-14_W3.9mm" H 1275 4365 50  0001 C CNN
F 3 "http://www.intersil.com/content/dam/Intersil/documents/cd40/cd4069ubms.pdf" H 1275 4365 50  0001 C CNN
	7    1275 4365
	1    0    0    -1  
$EndComp
$Comp
L 4xxx:4069 U1
U 1 1 6715177C
P 2585 4135
F 0 "U1" H 2650 4370 50  0000 C CNN
F 1 "4069" H 2650 4270 50  0000 C CNN
F 2 "digikey-footprints:SOIC-14_W3.9mm" H 2585 4135 50  0001 C CNN
F 3 "http://www.intersil.com/content/dam/Intersil/documents/cd40/cd4069ubms.pdf" H 2585 4135 50  0001 C CNN
	1    2585 4135
	1    0    0    -1  
$EndComp
$Comp
L 4xxx:4069 U1
U 6 1 6715694F
P 3335 4135
F 0 "U1" H 3400 4370 50  0000 C CNN
F 1 "4069" H 3400 4270 50  0000 C CNN
F 2 "digikey-footprints:SOIC-14_W3.9mm" H 3335 4135 50  0001 C CNN
F 3 "http://www.intersil.com/content/dam/Intersil/documents/cd40/cd4069ubms.pdf" H 3335 4135 50  0001 C CNN
	6    3335 4135
	1    0    0    -1  
$EndComp
$Comp
L 4xxx:4069 U1
U 2 1 67152792
P 4525 4125
F 0 "U1" H 4575 4375 50  0000 C CNN
F 1 "4069" H 4575 4275 50  0000 C CNN
F 2 "digikey-footprints:SOIC-14_W3.9mm" H 4525 4125 50  0001 C CNN
F 3 "http://www.intersil.com/content/dam/Intersil/documents/cd40/cd4069ubms.pdf" H 4525 4125 50  0001 C CNN
	2    4525 4125
	1    0    0    -1  
$EndComp
$Comp
L 4xxx:4069 U1
U 3 1 67153880
P 4525 4525
F 0 "U1" H 4575 4775 50  0000 C CNN
F 1 "4069" H 4575 4675 50  0000 C CNN
F 2 "digikey-footprints:SOIC-14_W3.9mm" H 4525 4525 50  0001 C CNN
F 3 "http://www.intersil.com/content/dam/Intersil/documents/cd40/cd4069ubms.pdf" H 4525 4525 50  0001 C CNN
	3    4525 4525
	1    0    0    -1  
$EndComp
Wire Wire Line
	4825 4125 4925 4125
Wire Wire Line
	4825 4525 4925 4525
Wire Wire Line
	4225 4125 4125 4125
Wire Wire Line
	4225 4525 4125 4525
NoConn ~ 4925 4125
NoConn ~ 4925 4525
NoConn ~ 4125 4525
NoConn ~ 4125 4125
Wire Wire Line
	6050 4950 6050 5150
Text Label 4875 5150 0    50   ~ 0
MCON-I
Wire Wire Line
	4825 4950 5500 4950
$Comp
L 4xxx:4069 U1
U 4 1 671549B0
P 4525 4950
F 0 "U1" H 4575 5200 50  0000 C CNN
F 1 "4069" H 4575 5100 50  0000 C CNN
F 2 "digikey-footprints:SOIC-14_W3.9mm" H 4525 4950 50  0001 C CNN
F 3 "http://www.intersil.com/content/dam/Intersil/documents/cd40/cd4069ubms.pdf" H 4525 4950 50  0001 C CNN
	4    4525 4950
	1    0    0    -1  
$EndComp
Wire Wire Line
	4125 4950 4225 4950
$Comp
L 4xxx:4069 U1
U 5 1 67155975
P 3825 4950
F 0 "U1" H 3875 5200 50  0000 C CNN
F 1 "4069" H 3875 5100 50  0000 C CNN
F 2 "digikey-footprints:SOIC-14_W3.9mm" H 3825 4950 50  0001 C CNN
F 3 "http://www.intersil.com/content/dam/Intersil/documents/cd40/cd4069ubms.pdf" H 3825 4950 50  0001 C CNN
	5    3825 4950
	1    0    0    -1  
$EndComp
Wire Wire Line
	3475 4950 3525 4950
Wire Wire Line
	6050 5150 3475 5150
Wire Wire Line
	3475 5150 3475 4950
Text Label 4875 4950 0    50   ~ 0
MCON-O
Text Notes 8275 3050 2    50   ~ 0
R8"**
$Comp
L Device:LED D5
U 1 1 65D35EBE
P 4775 1150
F 0 "D5" H 4600 1200 50  0000 L CNN
F 1 "LED" H 4850 1200 50  0000 L CNN
F 2 "LED_SMD:LED_1206_3216Metric_Pad1.42x1.75mm_HandSolder" H 4775 1150 50  0001 C CNN
F 3 "~" H 4775 1150 50  0001 C CNN
	1    4775 1150
	1    0    0    -1  
$EndComp
Text Notes 7270 7250 0    71   ~ 0
1 1
$EndSCHEMATC
