(module kmMIDI_DIN5_180_sup10mm (layer F.Cu) (tedit 65FEA4BB)
  (descr "Din 5 (MIDI), Pro Signal P/N PSG03463")
  (fp_text reference MIDI_DIN5 (at 0 11.00074) (layer F.SilkS)
    (effects (font (size 1.524 1.524) (thickness 0.3048)))
  )
  (fp_text value JP*** (at 0 -11.00074) (layer F.SilkS)
    (effects (font (size 1.524 1.524) (thickness 0.3048)))
  )
  (fp_line (start 10.50036 8.49884) (end 10.50036 8.99922) (layer F.SilkS) (width 0.3048))
  (fp_line (start -10.50036 9.4996) (end -10.50036 8.99922) (layer F.SilkS) (width 0.3048))
  (fp_line (start -8.49884 8.001) (end -8.49884 8.49884) (layer F.SilkS) (width 0.3048))
  (fp_line (start 8.49884 8.49884) (end 8.49884 8.001) (layer F.SilkS) (width 0.3048))
  (fp_line (start -8.99922 8.001) (end -8.49884 8.001) (layer F.SilkS) (width 0.3048))
  (fp_line (start 8.99922 8.001) (end 8.49884 8.001) (layer F.SilkS) (width 0.3048))
  (fp_line (start -8.99922 8.49884) (end 10.50036 8.49884) (layer F.SilkS) (width 0.3048))
  (fp_line (start -8.99922 8.99922) (end -8.99922 8.49884) (layer F.SilkS) (width 0.3048))
  (fp_line (start -10.50036 8.99922) (end -8.99922 8.99922) (layer F.SilkS) (width 0.3048))
  (fp_line (start 8.99922 9.4996) (end -10.50036 9.4996) (layer F.SilkS) (width 0.3048))
  (fp_line (start 8.99922 8.99922) (end 8.99922 9.4996) (layer F.SilkS) (width 0.3048))
  (fp_line (start 10.50036 8.99922) (end 8.99922 8.99922) (layer F.SilkS) (width 0.3048))
  (fp_line (start 1.99898 -8.99922) (end 1.99898 -7.00024) (layer F.SilkS) (width 0.3048))
  (fp_line (start 1.50114 -9.4996) (end 1.99898 -8.99922) (layer F.SilkS) (width 0.3048))
  (fp_line (start -1.50114 -9.4996) (end 1.50114 -9.4996) (layer F.SilkS) (width 0.3048))
  (fp_line (start -1.99898 -8.99922) (end -1.99898 -7.00024) (layer F.SilkS) (width 0.3048))
  (fp_line (start -1.50114 -9.4996) (end -1.99898 -8.99922) (layer F.SilkS) (width 0.3048))
  (fp_line (start 5.4991 -7.00024) (end 1.99898 -7.00024) (layer F.SilkS) (width 0.3048))
  (fp_line (start 5.4991 -8.99922) (end 5.4991 -7.00024) (layer F.SilkS) (width 0.3048))
  (fp_line (start 5.99948 -9.4996) (end 5.4991 -8.99922) (layer F.SilkS) (width 0.3048))
  (fp_line (start 6.49986 -9.4996) (end 5.99948 -9.4996) (layer F.SilkS) (width 0.3048))
  (fp_line (start 8.49884 -9.4996) (end 6.49986 -9.4996) (layer F.SilkS) (width 0.3048))
  (fp_line (start 8.99922 -8.99922) (end 8.49884 -9.4996) (layer F.SilkS) (width 0.3048))
  (fp_line (start 8.99922 -8.99922) (end 8.99922 8.001) (layer F.SilkS) (width 0.3048))
  (fp_line (start -5.4991 -7.00024) (end -1.99898 -7.00024) (layer F.SilkS) (width 0.3048))
  (fp_line (start -5.4991 -8.99922) (end -5.4991 -7.00024) (layer F.SilkS) (width 0.3048))
  (fp_line (start -5.99948 -9.4996) (end -5.4991 -8.99922) (layer F.SilkS) (width 0.3048))
  (fp_line (start -8.49884 -9.4996) (end -5.99948 -9.4996) (layer F.SilkS) (width 0.3048))
  (fp_line (start -8.99922 -8.99922) (end -8.49884 -9.4996) (layer F.SilkS) (width 0.3048))
  (fp_line (start -8.99922 -8.99922) (end -8.99922 8.001) (layer F.SilkS) (width 0.3048))
  (fp_line (start -10.50036 9.25068) (end 8.99922 9.25068) (layer F.SilkS) (width 0.3048))
  (fp_line (start 8.99922 8.99922) (end -8.99922 8.99922) (layer F.SilkS) (width 0.3048))
  (fp_line (start -8.99922 8.7503) (end 10.50036 8.7503) (layer F.SilkS) (width 0.3048))
  (pad "" np_thru_hole circle (at -5 7) (size 2.49936 2.49936) (drill 1.397) (layers *.Cu *.Mask F.SilkS))
  (pad "" np_thru_hole circle (at 5 7) (size 2.49936 2.49936) (drill 1.397) (layers *.Cu *.Mask F.SilkS))
  (pad 5 thru_hole circle (at -4.99618 -5.4991) (size 2.49936 2.49936) (drill 1.397) (layers *.Cu *.SilkS *.Mask))
  (pad 1 thru_hole circle (at 7.49808 -2.9972) (size 2.49936 2.49936) (drill 1.397) (layers *.Cu *.SilkS *.Mask))
  (pad 2 thru_hole circle (at 0 -2.99974) (size 2.49936 2.49936) (drill 1.397) (layers *.Cu *.SilkS *.Mask))
  (pad 4 thru_hole circle (at 4.99618 -5.4991) (size 2.49936 2.49936) (drill 1.397) (layers *.Cu *.SilkS *.Mask))
  (pad 3 thru_hole circle (at -7.49808 -2.9972) (size 2.49936 2.49936) (drill 1.397) (layers *.Cu *.SilkS *.Mask))
  (model walter/conn_av/din-5.wrl
    (at (xyz 0 0 0))
    (scale (xyz 1 1 1))
    (rotate (xyz 0 0 0))
  )
)
