{
    "current_lock": -1,
    "error": [
        {
            "details": "",
            "ep_num": "4",
            "ep_search_presence": "PASSED",
            "ep_title": "I Am the Greatest",
            "error": "Watch/Resume option absent on episode; Option Provided = UPGRADE",
            "paid": "XPPK2019090207080216",
            "playback": "FAILED",
            "season_num": "1",
            "series_search_presence": "PASSED",
            "series_title": "Godfather of Harlem",
            "slot": 2,
            "url": "https://charter-testworkbench-com.s3.us-west-2.amazonaws.com/TMC_Screenshots/sg_TMC South Man_2_2019_11_07_13_43_52.jpeg"
        },
        {
            "details": "",
            "ep_num": "4",
            "ep_search_presence": "PASSED",
            "ep_title": "I Am the Greatest",
            "error": "Watch/Resume option absent on episode; Option Provided = UPGRADE",
            "paid": "XPPK2019090207080216",
            "playback": "FAILED",
            "season_num": "1",
            "series_search_presence": "PASSED",
            "series_title": "Godfather of Harlem",
            "slot": 16,
            "url": "https://charter-testworkbench-com.s3.us-west-2.amazonaws.com/TMC_Screenshots/sg_TMC South Man_16_2019_11_07_16_24_32.jpeg"
        }
    ],
    "fail": [
        {
            "details": "Episode Not Found in Asset Episode list page",
            "ep_num": "21",
            "ep_search_presence": "FAILED",
            "ep_title": "Confession",
            "error": "",
            "paid": "NBCU0400528000840013",
            "playback": "FAILED",
            "season_num": "6",
            "series_search_presence": "PASSED",
            "series_title": "Chicago P.D.",
            "slot": 15,
            "url": "https://charter-testworkbench-com.s3.us-west-2.amazonaws.com/TMC_Screenshots/sg_TMC South Man_15_2019_11_07_16_42_10.jpeg"
        },
        {
            "details": "Episode Not Found in Asset Episode list page",
            "ep_num": "7",
            "ep_search_presence": "FAILED",
            "ep_title": "Welcome to Crazytown",
            "error": "",
            "paid": "NBCU0405955500810013",
            "playback": "FAILED",
            "season_num": "8",
            "series_search_presence": "PASSED",
            "series_title": "Chicago Fire",
            "slot": 16,
            "url": "https://charter-testworkbench-com.s3.us-west-2.amazonaws.com/TMC_Screenshots/sg_TMC South Man_16_2019_11_07_16_42_45.jpeg"
        },
        {
            "details": "Episode Not Found in Asset Episode list page",
            "ep_num": "44",
            "ep_search_presence": "FAILED",
            "ep_title": "",
            "error": "",
            "paid": "NBCU0405440900840013",
            "playback": "FAILED",
            "season_num": "27",
            "series_search_presence": "PASSED",
            "series_title": "WWE Monday Night RAW",
            "slot": 2,
            "url": "https://charter-testworkbench-com.s3.us-west-2.amazonaws.com/TMC_Screenshots/sg_TMC South Man_2_2019_11_07_16_46_11.jpeg"
        },
        {
            "details": "Unrecognized view option: NOT DETERMINED",
            "ep_num": "",
            "ep_search_presence": "N/A",
            "ep_title": "",
            "error": "",
            "paid": "XPPK0001569926334001",
            "playback": "FAILED",
            "season_num": "",
            "series_search_presence": "PASSED",
            "series_title": "Attrition",
            "slot": 5,
            "url": "https://charter-testworkbench-com.s3.us-west-2.amazonaws.com/TMC_Screenshots/sg_TMC South Man_5_2019_11_07_13_58_45.jpeg"
        },
        {
            "details": "Episode Not Found in Asset Episode list page",
            "ep_num": "9",
            "ep_search_presence": "FAILED",
            "ep_title": "Week 9: Global and Local",
            "error": "",
            "paid": "XPPK2019090203080197",
            "playback": "FAILED",
            "season_num": "1",
            "series_search_presence": "PASSED",
            "series_title": "NFL: The Grind",
            "slot": 6,
            "url": "https://charter-testworkbench-com.s3.us-west-2.amazonaws.com/TMC_Screenshots/sg_TMC South Man_6_2019_11_07_14_15_36.jpeg"
        },
        {
            "details": "Episode Not Found in Asset Episode list page",
            "ep_num": "10",
            "ep_search_presence": "FAILED",
            "ep_title": "2019: Week 9",
            "error": "",
            "paid": "XPPK0001569927271001",
            "playback": "FAILED",
            "season_num": "42",
            "series_search_presence": "PASSED",
            "series_title": "Inside the NFL",
            "slot": 5,
            "url": "https://charter-testworkbench-com.s3.us-west-2.amazonaws.com/TMC_Screenshots/sg_TMC South Man_5_2019_11_07_14_55_37.jpeg"
        },
        {
            "details": "Episode Not Found in Asset Episode list page",
            "ep_num": "10",
            "ep_search_presence": "FAILED",
            "ep_title": "2019: Week 9",
            "error": "",
            "paid": "XPPK0001569926350001",
            "playback": "FAILED",
            "season_num": "42",
            "series_search_presence": "PASSED",
            "series_title": "Inside the NFL",
            "slot": 16,
            "url": "https://charter-testworkbench-com.s3.us-west-2.amazonaws.com/TMC_Screenshots/sg_TMC South Man_16_2019_11_07_15_36_51.jpeg"
        },
        {
            "details": "Episode Not Found in Asset Episode list page",
            "ep_num": "13",
            "ep_search_presence": "FAILED",
            "ep_title": "Hit Me",
            "error": "",
            "paid": "NBCU0360169000840309",
            "playback": "FAILED",
            "season_num": "3",
            "series_search_presence": "PASSED",
            "series_title": "Chicago P.D.",
            "slot": 1,
            "url": "https://charter-testworkbench-com.s3.us-west-2.amazonaws.com/TMC_Screenshots/sg_TMC South Man_1_2019_11_07_13_58_57.jpeg"
        }
    ],
    "in_progress": [
        {
            "14": {
                "ep_num": "20",
                "ep_title": "Sacrifice",
                "paid": "NBCU0400527500840013",
                "season_num": "6",
                "series_title": "Chicago P.D."
            }
        }
    ],
    "pass": [
        {
            "details": "",
            "ep_num": "11",
            "ep_search_presence": "PASSED",
            "ep_title": "The Apartment",
            "error": "",
            "paid": "TVNC0000000003360377",
            "playback": "PASSED",
            "season_num": "5",
            "series_search_presence": "PASSED",
            "series_title": "New Girl",
            "slot": 7,
            "url": "https://charter-testworkbench-com.s3.us-west-2.amazonaws.com/TMC_Screenshots/sg_TMC South Man_7_2019_11_07_16_41_33.jpeg"
        },
        {
            "details": "",
            "ep_num": "5",
            "ep_search_presence": "PASSED",
            "ep_title": "Kristen Stewart; Coldplay",
            "error": "",
            "paid": "NBCU0405806900820087",
            "playback": "PASSED",
            "season_num": "45",
            "series_search_presence": "PASSED",
            "series_title": "Saturday Night Live",
            "slot": 6,
            "url": "https://charter-testworkbench-com.s3.us-west-2.amazonaws.com/TMC_Screenshots/sg_TMC South Man_6_2019_11_07_16_45_15.jpeg"
        },
        {
            "details": "",
            "ep_num": "2",
            "ep_search_presence": "PASSED",
            "ep_title": "Terri & Richard's Sunset Search",
            "error": "",
            "paid": "NBCU0383176400610161",
            "playback": "PASSED",
            "season_num": "1",
            "series_search_presence": "PASSED",
            "series_title": "Lake Front Luxury",
            "slot": 5,
            "url": "https://charter-testworkbench-com.s3.us-west-2.amazonaws.com/TMC_Screenshots/sg_TMC South Man_5_2019_11_07_16_45_20.jpeg"
        },
        {
            "details": "",
            "ep_num": "14",
            "ep_search_presence": "PASSED",
            "ep_title": "The Song of Gregory Yates",
            "error": "",
            "paid": "NBCU0360169100840309",
            "playback": "PASSED",
            "season_num": "3",
            "series_search_presence": "PASSED",
            "series_title": "Chicago P.D.",
            "slot": 1,
            "url": "https://charter-testworkbench-com.s3.us-west-2.amazonaws.com/TMC_Screenshots/sg_TMC South Man_1_2019_11_07_16_48_36.jpeg"
        },
        {
            "details": "",
            "ep_num": "12",
            "ep_search_presence": "PASSED",
            "ep_title": "And the Storytelling Show",
            "error": "",
            "paid": "TVNC0000000003352388",
            "playback": "PASSED",
            "season_num": "5",
            "series_search_presence": "PASSED",
            "series_title": "2 Broke Girls",
            "slot": 15,
            "url": "https://charter-testworkbench-com.s3.us-west-2.amazonaws.com/TMC_Screenshots/sg_TMC South Man_15_2019_11_07_16_53_37.jpeg"
        },
        {
            "details": "",
            "ep_num": "5",
            "ep_search_presence": "PASSED",
            "ep_title": "405 Method Not Allowed",
            "error": "",
            "paid": "NBCU0405787800840013",
            "playback": "PASSED",
            "season_num": "4",
            "series_search_presence": "PASSED",
            "series_title": "Mr. Robot",
            "slot": 5,
            "url": "https://charter-testworkbench-com.s3.us-west-2.amazonaws.com/TMC_Screenshots/sg_TMC South Man_5_2019_11_07_13_12_10.jpeg"
        },
        {
            "details": "",
            "ep_num": "31",
            "ep_search_presence": "PASSED",
            "ep_title": "",
            "error": "",
            "paid": "NBCU0406048700820087",
            "playback": "PASSED",
            "season_num": "55",
            "series_search_presence": "PASSED",
            "series_title": "Days of our Lives",
            "slot": 6,
            "url": "https://charter-testworkbench-com.s3.us-west-2.amazonaws.com/TMC_Screenshots/sg_TMC South Man_6_2019_11_07_13_17_14.jpeg"
        },
        {
            "details": "",
            "ep_num": "",
            "ep_search_presence": "PASSED",
            "ep_title": "Real Madrid vs. Galatasaray A.S.",
            "error": "",
            "paid": "TVNC0000000003364392",
            "playback": "PASSED",
            "season_num": "",
            "series_search_presence": "PASSED",
            "series_title": "UEFA Champions League Soccer",
            "slot": 15,
            "url": "https://charter-testworkbench-com.s3.us-west-2.amazonaws.com/TMC_Screenshots/sg_TMC South Man_15_2019_11_07_13_18_15.jpeg"
        },
        {
            "details": "",
            "ep_num": "5",
            "ep_search_presence": "PASSED",
            "ep_title": "What It Always Is",
            "error": "",
            "paid": "AMCX9610100000017036",
            "playback": "PASSED",
            "season_num": "10",
            "series_search_presence": "PASSED",
            "series_title": "The Walking Dead",
            "slot": 1,
            "url": "https://charter-testworkbench-com.s3.us-west-2.amazonaws.com/TMC_Screenshots/sg_TMC South Man_1_2019_11_07_13_19_40.jpeg"
        },
        {
            "details": "",
            "ep_num": "28",
            "ep_search_presence": "PASSED",
            "ep_title": "Henry Golding; Noomi Rapace; Dan White",
            "error": "",
            "paid": "NBCU0406057200810087",
            "playback": "PASSED",
            "season_num": "7",
            "series_search_presence": "PASSED",
            "series_title": "The Tonight Show Starring Jimmy Fallon",
            "slot": 14,
            "url": "https://charter-testworkbench-com.s3.us-west-2.amazonaws.com/TMC_Screenshots/sg_TMC South Man_14_2019_11_07_13_21_53.jpeg"
        },
        {
            "details": "",
            "ep_num": "4",
            "ep_search_presence": "PASSED",
            "ep_title": "Elevators: 1996",
            "error": "",
            "paid": "AMCX9610100000016939",
            "playback": "PASSED",
            "season_num": "1",
            "series_search_presence": "PASSED",
            "series_title": "Hip Hop: The Songs That Shook America",
            "slot": 16,
            "url": "https://charter-testworkbench-com.s3.us-west-2.amazonaws.com/TMC_Screenshots/sg_TMC South Man_16_2019_11_07_13_24_54.jpeg"
        },
        {
            "details": "",
            "ep_num": "23",
            "ep_search_presence": "PASSED",
            "ep_title": "",
            "error": "",
            "paid": "NBCU0405795100600013",
            "playback": "PASSED",
            "season_num": "14",
            "series_search_presence": "PASSED",
            "series_title": "Cash Cab",
            "slot": 15,
            "url": "https://charter-testworkbench-com.s3.us-west-2.amazonaws.com/TMC_Screenshots/sg_TMC South Man_15_2019_11_07_13_26_06.jpeg"
        },
        {
            "details": "",
            "ep_num": "6",
            "ep_search_presence": "PASSED",
            "ep_title": "Bringing the Heat",
            "error": "",
            "paid": "HDDY0000010056321001",
            "playback": "PASSED",
            "season_num": "3",
            "series_search_presence": "PASSED",
            "series_title": "Holmes & Holmes",
            "slot": 6,
            "url": "https://charter-testworkbench-com.s3.us-west-2.amazonaws.com/TMC_Screenshots/sg_TMC South Man_6_2019_11_07_13_26_59.jpeg"
        },
        {
            "details": "",
            "ep_num": "23",
            "ep_search_presence": "PASSED",
            "ep_title": "Jim Gaffigan; Jenny Slate; MUNA; Brendan Buckley",
            "error": "",
            "paid": "NBCU0406057700810013",
            "playback": "PASSED",
            "season_num": "7",
            "series_search_presence": "PASSED",
            "series_title": "Late Night With Seth Meyers",
            "slot": 5,
            "url": "https://charter-testworkbench-com.s3.us-west-2.amazonaws.com/TMC_Screenshots/sg_TMC South Man_5_2019_11_07_13_28_33.jpeg"
        },
        {
            "details": "",
            "ep_num": "1",
            "ep_search_presence": "PASSED",
            "ep_title": "Evander Holyfield Featuring Marcus Lemonis",
            "error": "",
            "paid": "NBCU0406039500410013",
            "playback": "PASSED",
            "season_num": "1",
            "series_search_presence": "PASSED",
            "series_title": "Back in the Game",
            "slot": 1,
            "url": "https://charter-testworkbench-com.s3.us-west-2.amazonaws.com/TMC_Screenshots/sg_TMC South Man_1_2019_11_07_13_30_47.jpeg"
        },
        {
            "details": "",
            "ep_num": "25",
            "ep_search_presence": "PASSED",
            "ep_title": "Ashley Graham",
            "error": "",
            "paid": "NBCU0406053300810013",
            "playback": "PASSED",
            "season_num": "1",
            "series_search_presence": "PASSED",
            "series_title": "A Little Late With Lilly Singh",
            "slot": 2,
            "url": "https://charter-testworkbench-com.s3.us-west-2.amazonaws.com/TMC_Screenshots/sg_TMC South Man_2_2019_11_07_13_31_36.jpeg"
        },
        {
            "details": "",
            "ep_num": "7",
            "ep_search_presence": "PASSED",
            "ep_title": "Informant",
            "error": "",
            "paid": "NBCU0405955400810013",
            "playback": "PASSED",
            "season_num": "7",
            "series_search_presence": "PASSED",
            "series_title": "Chicago P.D.",
            "slot": 15,
            "url": "https://charter-testworkbench-com.s3.us-west-2.amazonaws.com/TMC_Screenshots/sg_TMC South Man_15_2019_11_07_13_33_36.jpeg"
        },
        {
            "details": "",
            "ep_num": "",
            "ep_search_presence": "PASSED",
            "ep_title": "Behind the Episode 1001",
            "error": "",
            "paid": "NBCU0405792000600013",
            "playback": "PASSED",
            "season_num": "10",
            "series_search_presence": "PASSED",
            "series_title": "The Real Housewives of New Jersey",
            "slot": 7,
            "url": "https://charter-testworkbench-com.s3.us-west-2.amazonaws.com/TMC_Screenshots/sg_TMC South Man_7_2019_11_07_13_34_42.jpeg"
        },
        {
            "details": "",
            "ep_num": "7",
            "ep_search_presence": "PASSED",
            "ep_title": "Who Knows What Tomorrow Brings",
            "error": "",
            "paid": "NBCU0405955300810013",
            "playback": "PASSED",
            "season_num": "5",
            "series_search_presence": "PASSED",
            "series_title": "Chicago Med",
            "slot": 5,
            "url": "https://charter-testworkbench-com.s3.us-west-2.amazonaws.com/TMC_Screenshots/sg_TMC South Man_5_2019_11_07_13_36_10.jpeg"
        },
        {
            "details": "",
            "ep_num": "10",
            "ep_search_presence": "PASSED",
            "ep_title": "My Big Fat Dallas Wedding",
            "error": "",
            "paid": "NBCU0406005300600013",
            "playback": "PASSED",
            "season_num": "4",
            "series_search_presence": "PASSED",
            "series_title": "The Real Housewives of Dallas",
            "slot": 16,
            "url": "https://charter-testworkbench-com.s3.us-west-2.amazonaws.com/TMC_Screenshots/sg_TMC South Man_16_2019_11_07_13_41_43.jpeg"
        },
        {
            "details": "",
            "ep_num": "179",
            "ep_search_presence": "PASSED",
            "ep_title": "",
            "error": "",
            "paid": "NBCU0405797200600013",
            "playback": "PASSED",
            "season_num": "16",
            "series_search_presence": "PASSED",
            "series_title": "Watch What Happens Live With Andy Cohen",
            "slot": 14,
            "url": "https://charter-testworkbench-com.s3.us-west-2.amazonaws.com/TMC_Screenshots/sg_TMC South Man_14_2019_11_07_13_42_29.jpeg"
        },
        {
            "details": "",
            "ep_num": "",
            "ep_search_presence": "PASSED",
            "ep_title": "FC Lokomotiv Moscow vs. Juventus FC",
            "error": "",
            "paid": "TVNC0000000003364216",
            "playback": "PASSED",
            "season_num": "",
            "series_search_presence": "PASSED",
            "series_title": "UEFA Champions League Soccer",
            "slot": 15,
            "url": "https://charter-testworkbench-com.s3.us-west-2.amazonaws.com/TMC_Screenshots/sg_TMC South Man_15_2019_11_07_13_47_12.jpeg"
        },
        {
            "details": "",
            "ep_num": "21",
            "ep_search_presence": "PASSED",
            "ep_title": "The Spoiler",
            "error": "",
            "paid": "AMCX9610100000017127",
            "playback": "PASSED",
            "season_num": "2",
            "series_search_presence": "PASSED",
            "series_title": "The Rifleman",
            "slot": 7,
            "url": "https://charter-testworkbench-com.s3.us-west-2.amazonaws.com/TMC_Screenshots/sg_TMC South Man_7_2019_11_07_13_48_25.jpeg"
        },
        {
            "details": "",
            "ep_num": "1",
            "ep_search_presence": "PASSED",
            "ep_title": "Sex, Lies and Video Debates",
            "error": "",
            "paid": "NBCU0405927600600013",
            "playback": "PASSED",
            "season_num": "10",
            "series_search_presence": "PASSED",
            "series_title": "The Real Housewives of New Jersey",
            "slot": 1,
            "url": "https://charter-testworkbench-com.s3.us-west-2.amazonaws.com/TMC_Screenshots/sg_TMC South Man_1_2019_11_07_13_50_01.jpeg"
        },
        {
            "details": "",
            "ep_num": "20",
            "ep_search_presence": "PASSED",
            "ep_title": "The Horsetraders",
            "error": "",
            "paid": "AMCX9610100000017126",
            "playback": "PASSED",
            "season_num": "2",
            "series_search_presence": "PASSED",
            "series_title": "The Rifleman",
            "slot": 5,
            "url": "https://charter-testworkbench-com.s3.us-west-2.amazonaws.com/TMC_Screenshots/sg_TMC South Man_5_2019_11_07_13_50_18.jpeg"
        },
        {
            "details": "",
            "ep_num": "32",
            "ep_search_presence": "PASSED",
            "ep_title": "The Fourflusher",
            "error": "",
            "paid": "AMCX9610100000017138",
            "playback": "PASSED",
            "season_num": "2",
            "series_search_presence": "PASSED",
            "series_title": "The Rifleman",
            "slot": 16,
            "url": "https://charter-testworkbench-com.s3.us-west-2.amazonaws.com/TMC_Screenshots/sg_TMC South Man_16_2019_11_07_13_50_38.jpeg"
        },
        {
            "details": "",
            "ep_num": "10",
            "ep_search_presence": "PASSED",
            "ep_title": "Sanibel Island and Palm Trees",
            "error": "",
            "paid": "NBCU0393482700610087",
            "playback": "PASSED",
            "season_num": "2",
            "series_search_presence": "PASSED",
            "series_title": "What's for Sale? With a View",
            "slot": 6,
            "url": "https://charter-testworkbench-com.s3.us-west-2.amazonaws.com/TMC_Screenshots/sg_TMC South Man_6_2019_11_07_13_50_42.jpeg"
        },
        {
            "details": "",
            "ep_num": "28",
            "ep_search_presence": "PASSED",
            "ep_title": "Smoke Screen",
            "error": "",
            "paid": "AMCX9610100000017134",
            "playback": "PASSED",
            "season_num": "2",
            "series_search_presence": "PASSED",
            "series_title": "The Rifleman",
            "slot": 14,
            "url": "https://charter-testworkbench-com.s3.us-west-2.amazonaws.com/TMC_Screenshots/sg_TMC South Man_14_2019_11_07_13_53_08.jpeg"
        },
        {
            "details": "",
            "ep_num": "22",
            "ep_search_presence": "PASSED",
            "ep_title": "Reckoning",
            "error": "",
            "paid": "NBCU0400529200840013",
            "playback": "PASSED",
            "season_num": "6",
            "series_search_presence": "PASSED",
            "series_title": "Chicago P.D.",
            "slot": 6,
            "url": "https://charter-testworkbench-com.s3.us-west-2.amazonaws.com/TMC_Screenshots/sg_TMC South Man_6_2019_11_07_14_01_33.jpeg"
        },
        {
            "details": "",
            "ep_num": "19",
            "ep_search_presence": "PASSED",
            "ep_title": "The Hero",
            "error": "",
            "paid": "AMCX9610100000017125",
            "playback": "PASSED",
            "season_num": "2",
            "series_search_presence": "PASSED",
            "series_title": "The Rifleman",
            "slot": 7,
            "url": "https://charter-testworkbench-com.s3.us-west-2.amazonaws.com/TMC_Screenshots/sg_TMC South Man_7_2019_11_07_14_03_01.jpeg"
        },
        {
            "details": "",
            "ep_num": "24",
            "ep_search_presence": "PASSED",
            "ep_title": "A Time for Singing",
            "error": "",
            "paid": "AMCX9610100000017130",
            "playback": "PASSED",
            "season_num": "2",
            "series_search_presence": "PASSED",
            "series_title": "The Rifleman",
            "slot": 16,
            "url": "https://charter-testworkbench-com.s3.us-west-2.amazonaws.com/TMC_Screenshots/sg_TMC South Man_16_2019_11_07_14_03_08.jpeg"
        },
        {
            "details": "",
            "ep_num": "26",
            "ep_search_presence": "PASSED",
            "ep_title": "The Vision",
            "error": "",
            "paid": "AMCX9610100000017132",
            "playback": "PASSED",
            "season_num": "2",
            "series_search_presence": "PASSED",
            "series_title": "The Rifleman",
            "slot": 15,
            "url": "https://charter-testworkbench-com.s3.us-west-2.amazonaws.com/TMC_Screenshots/sg_TMC South Man_15_2019_11_07_14_06_07.jpeg"
        },
        {
            "details": "",
            "ep_num": "27",
            "ep_search_presence": "PASSED",
            "ep_title": "Lariat",
            "error": "",
            "paid": "AMCX9610100000017133",
            "playback": "PASSED",
            "season_num": "2",
            "series_search_presence": "PASSED",
            "series_title": "The Rifleman",
            "slot": 1,
            "url": "https://charter-testworkbench-com.s3.us-west-2.amazonaws.com/TMC_Screenshots/sg_TMC South Man_1_2019_11_07_14_08_52.jpeg"
        },
        {
            "details": "",
            "ep_num": "33",
            "ep_search_presence": "PASSED",
            "ep_title": "",
            "error": "",
            "paid": "NBCU0406049100810013",
            "playback": "PASSED",
            "season_num": "55",
            "series_search_presence": "PASSED",
            "series_title": "Days of our Lives",
            "slot": 5,
            "url": "https://charter-testworkbench-com.s3.us-west-2.amazonaws.com/TMC_Screenshots/sg_TMC South Man_5_2019_11_07_14_10_08.jpeg"
        },
        {
            "details": "",
            "ep_num": "9",
            "ep_search_presence": "PASSED",
            "ep_title": "Contessa's Carnival",
            "error": "",
            "paid": "NBCU0405735800610013",
            "playback": "PASSED",
            "season_num": "7",
            "series_search_presence": "PASSED",
            "series_title": "Married to Medicine",
            "slot": 7,
            "url": "https://charter-testworkbench-com.s3.us-west-2.amazonaws.com/TMC_Screenshots/sg_TMC South Man_7_2019_11_07_14_14_15.jpeg"
        },
        {
            "details": "",
            "ep_num": "7",
            "ep_search_presence": "PASSED",
            "ep_title": "Good Soldiers",
            "error": "",
            "paid": "NBCU0405955200810013",
            "playback": "PASSED",
            "season_num": "2",
            "series_search_presence": "PASSED",
            "series_title": "New Amsterdam",
            "slot": 1,
            "url": "https://charter-testworkbench-com.s3.us-west-2.amazonaws.com/TMC_Screenshots/sg_TMC South Man_1_2019_11_07_14_17_32.jpeg"
        },
        {
            "details": "",
            "ep_num": "18",
            "ep_search_presence": "PASSED",
            "ep_title": "The Visitor",
            "error": "",
            "paid": "AMCX9610100000017124",
            "playback": "PASSED",
            "season_num": "2",
            "series_search_presence": "PASSED",
            "series_title": "The Rifleman",
            "slot": 15,
            "url": "https://charter-testworkbench-com.s3.us-west-2.amazonaws.com/TMC_Screenshots/sg_TMC South Man_15_2019_11_07_14_17_49.jpeg"
        },
        {
            "details": "",
            "ep_num": "5",
            "ep_search_presence": "PASSED",
            "ep_title": "Styx Feet Under",
            "error": "",
            "paid": "TVNC0000000003364290",
            "playback": "PASSED",
            "season_num": "7",
            "series_search_presence": "PASSED",
            "series_title": "Charmed",
            "slot": 5,
            "url": "https://charter-testworkbench-com.s3.us-west-2.amazonaws.com/TMC_Screenshots/sg_TMC South Man_5_2019_11_07_14_17_57.jpeg"
        },
        {
            "details": "",
            "ep_num": "1",
            "ep_search_presence": "PASSED",
            "ep_title": "The Moore the Merrier",
            "error": "",
            "paid": "NBCU0405735600610013",
            "playback": "PASSED",
            "season_num": "12",
            "series_search_presence": "PASSED",
            "series_title": "The Real Housewives of Atlanta",
            "slot": 16,
            "url": "https://charter-testworkbench-com.s3.us-west-2.amazonaws.com/TMC_Screenshots/sg_TMC South Man_16_2019_11_07_14_20_18.jpeg"
        },
        {
            "details": "",
            "ep_num": "6",
            "ep_search_presence": "PASSED",
            "ep_title": "Once in a Blue Moon",
            "error": "",
            "paid": "TVNC0000000003364247",
            "playback": "PASSED",
            "season_num": "7",
            "series_search_presence": "PASSED",
            "series_title": "Charmed",
            "slot": 7,
            "url": "https://charter-testworkbench-com.s3.us-west-2.amazonaws.com/TMC_Screenshots/sg_TMC South Man_7_2019_11_07_14_21_26.jpeg"
        },
        {
            "details": "",
            "ep_num": "7",
            "ep_search_presence": "PASSED",
            "ep_title": "Someone to Witch Over Me",
            "error": "",
            "paid": "TVNC0000000003364406",
            "playback": "PASSED",
            "season_num": "7",
            "series_search_presence": "PASSED",
            "series_title": "Charmed",
            "slot": 1,
            "url": "https://charter-testworkbench-com.s3.us-west-2.amazonaws.com/TMC_Screenshots/sg_TMC South Man_1_2019_11_07_14_24_19.jpeg"
        },
        {
            "details": "",
            "ep_num": "4",
            "ep_search_presence": "PASSED",
            "ep_title": "Charrrmed!",
            "error": "",
            "paid": "TVNC0000000003364331",
            "playback": "PASSED",
            "season_num": "7",
            "series_search_presence": "PASSED",
            "series_title": "Charmed",
            "slot": 15,
            "url": "https://charter-testworkbench-com.s3.us-west-2.amazonaws.com/TMC_Screenshots/sg_TMC South Man_15_2019_11_07_14_25_53.jpeg"
        },
        {
            "details": "",
            "ep_num": "23",
            "ep_search_presence": "PASSED",
            "ep_title": "Grasshopper",
            "error": "",
            "paid": "AMCX9610100000017129",
            "playback": "PASSED",
            "season_num": "2",
            "series_search_presence": "PASSED",
            "series_title": "The Rifleman",
            "slot": 6,
            "url": "https://charter-testworkbench-com.s3.us-west-2.amazonaws.com/TMC_Screenshots/sg_TMC South Man_6_2019_11_07_14_27_21.jpeg"
        },
        {
            "details": "",
            "ep_num": "1",
            "ep_search_presence": "PASSED",
            "ep_title": "The Mango",
            "error": "",
            "paid": "TVNC0000000003364240",
            "playback": "PASSED",
            "season_num": "5",
            "series_search_presence": "PASSED",
            "series_title": "Seinfeld",
            "slot": 16,
            "url": "https://charter-testworkbench-com.s3.us-west-2.amazonaws.com/TMC_Screenshots/sg_TMC South Man_16_2019_11_07_14_27_43.jpeg"
        },
        {
            "details": "",
            "ep_num": "17",
            "ep_search_presence": "PASSED",
            "ep_title": "And the Show and Don't Tell",
            "error": "",
            "paid": "TVNC0000000003360437",
            "playback": "PASSED",
            "season_num": "5",
            "series_search_presence": "PASSED",
            "series_title": "2 Broke Girls",
            "slot": 5,
            "url": "https://charter-testworkbench-com.s3.us-west-2.amazonaws.com/TMC_Screenshots/sg_TMC South Man_5_2019_11_07_14_28_12.jpeg"
        },
        {
            "details": "",
            "ep_num": "4",
            "ep_search_presence": "PASSED",
            "ep_title": "The Kentucky Contract",
            "error": "",
            "paid": "NBCU0405496800830013",
            "playback": "PASSED",
            "season_num": "1",
            "series_search_presence": "PASSED",
            "series_title": "Treadstone",
            "slot": 7,
            "url": "https://charter-testworkbench-com.s3.us-west-2.amazonaws.com/TMC_Screenshots/sg_TMC South Man_7_2019_11_07_14_29_11.jpeg"
        },
        {
            "details": "",
            "ep_num": "3",
            "ep_search_presence": "PASSED",
            "ep_title": "The Glasses",
            "error": "",
            "paid": "TVNC0000000003364417",
            "playback": "PASSED",
            "season_num": "5",
            "series_search_presence": "PASSED",
            "series_title": "Seinfeld",
            "slot": 1,
            "url": "https://charter-testworkbench-com.s3.us-west-2.amazonaws.com/TMC_Screenshots/sg_TMC South Man_1_2019_11_07_14_31_24.jpeg"
        },
        {
            "details": "",
            "ep_num": "5",
            "ep_search_presence": "PASSED",
            "ep_title": "",
            "error": "",
            "paid": "NBCU0406147200410013",
            "playback": "PASSED",
            "season_num": "1",
            "series_search_presence": "PASSED",
            "series_title": "Shark Tank",
            "slot": 16,
            "url": "https://charter-testworkbench-com.s3.us-west-2.amazonaws.com/TMC_Screenshots/sg_TMC South Man_16_2019_11_07_14_36_43.jpeg"
        },
        {
            "details": "",
            "ep_num": "16",
            "ep_search_presence": "PASSED",
            "ep_title": "And the Pity Party Bus",
            "error": "",
            "paid": "TVNC0000000003360395",
            "playback": "PASSED",
            "season_num": "5",
            "series_search_presence": "PASSED",
            "series_title": "2 Broke Girls",
            "slot": 6,
            "url": "https://charter-testworkbench-com.s3.us-west-2.amazonaws.com/TMC_Screenshots/sg_TMC South Man_6_2019_11_07_14_38_06.jpeg"
        },
        {
            "details": "",
            "ep_num": "21",
            "ep_search_presence": "PASSED",
            "ep_title": "The Smelly Car",
            "error": "",
            "paid": "TVNC0000000003364226",
            "playback": "PASSED",
            "season_num": "4",
            "series_search_presence": "PASSED",
            "series_title": "Seinfeld",
            "slot": 1,
            "url": "https://charter-testworkbench-com.s3.us-west-2.amazonaws.com/TMC_Screenshots/sg_TMC South Man_1_2019_11_07_14_40_08.jpeg"
        },
        {
            "details": "",
            "ep_num": "21",
            "ep_search_presence": "PASSED",
            "ep_title": "Simple Greek",
            "error": "",
            "paid": "NBCU0406038300410013",
            "playback": "PASSED",
            "season_num": "1",
            "series_search_presence": "PASSED",
            "series_title": "The Profit: An Inside Look",
            "slot": 5,
            "url": "https://charter-testworkbench-com.s3.us-west-2.amazonaws.com/TMC_Screenshots/sg_TMC South Man_5_2019_11_07_14_43_33.jpeg"
        },
        {
            "details": "",
            "ep_num": "1",
            "ep_search_presence": "PASSED",
            "ep_title": "Dante's",
            "error": "",
            "paid": "NBCU0406037700410013",
            "playback": "PASSED",
            "season_num": "7",
            "series_search_presence": "PASSED",
            "series_title": "The Profit",
            "slot": 6,
            "url": "https://charter-testworkbench-com.s3.us-west-2.amazonaws.com/TMC_Screenshots/sg_TMC South Man_6_2019_11_07_14_48_57.jpeg"
        },
        {
            "details": "",
            "ep_num": "178",
            "ep_search_presence": "PASSED",
            "ep_title": "",
            "error": "",
            "paid": "NBCU0405796800600013",
            "playback": "PASSED",
            "season_num": "16",
            "series_search_presence": "PASSED",
            "series_title": "Watch What Happens Live With Andy Cohen",
            "slot": 7,
            "url": "https://charter-testworkbench-com.s3.us-west-2.amazonaws.com/TMC_Screenshots/sg_TMC South Man_7_2019_11_07_14_52_19.jpeg"
        },
        {
            "details": "",
            "ep_num": "27",
            "ep_search_presence": "PASSED",
            "ep_title": "Adam Sandler; Jenny Slate; Megan Gailey",
            "error": "",
            "paid": "NBCU0406057100810013",
            "playback": "PASSED",
            "season_num": "7",
            "series_search_presence": "PASSED",
            "series_title": "The Tonight Show Starring Jimmy Fallon",
            "slot": 15,
            "url": "https://charter-testworkbench-com.s3.us-west-2.amazonaws.com/TMC_Screenshots/sg_TMC South Man_15_2019_11_07_14_54_19.jpeg"
        },
        {
            "details": "",
            "ep_num": "4",
            "ep_search_presence": "PASSED",
            "ep_title": "Grief Box",
            "error": "",
            "paid": "NBCU0405494200830013",
            "playback": "PASSED",
            "season_num": "2",
            "series_search_presence": "PASSED",
            "series_title": "The Purge",
            "slot": 6,
            "url": "https://charter-testworkbench-com.s3.us-west-2.amazonaws.com/TMC_Screenshots/sg_TMC South Man_6_2019_11_07_14_58_34.jpeg"
        },
        {
            "details": "",
            "ep_num": "14",
            "ep_search_presence": "PASSED",
            "ep_title": "Best Frenemies Forever",
            "error": "",
            "paid": "NBCU0405857100600013",
            "playback": "PASSED",
            "season_num": "14",
            "series_search_presence": "PASSED",
            "series_title": "The Real Housewives of Orange County",
            "slot": 16,
            "url": "https://charter-testworkbench-com.s3.us-west-2.amazonaws.com/TMC_Screenshots/sg_TMC South Man_16_2019_11_07_14_59_55.jpeg"
        },
        {
            "details": "",
            "ep_num": "22",
            "ep_search_presence": "PASSED",
            "ep_title": "Kristin Chenoweth; Michael Kelly; Sinead Burke; Brendan Buckley",
            "error": "",
            "paid": "NBCU0406057600810013",
            "playback": "PASSED",
            "season_num": "7",
            "series_search_presence": "PASSED",
            "series_title": "Late Night With Seth Meyers",
            "slot": 1,
            "url": "https://charter-testworkbench-com.s3.us-west-2.amazonaws.com/TMC_Screenshots/sg_TMC South Man_1_2019_11_07_15_00_32.jpeg"
        },
        {
            "details": "",
            "ep_num": "22",
            "ep_search_presence": "PASSED",
            "ep_title": "",
            "error": "",
            "paid": "NBCU0405795000600013",
            "playback": "PASSED",
            "season_num": "14",
            "series_search_presence": "PASSED",
            "series_title": "Cash Cab",
            "slot": 15,
            "url": "https://charter-testworkbench-com.s3.us-west-2.amazonaws.com/TMC_Screenshots/sg_TMC South Man_15_2019_11_07_15_03_49.jpeg"
        },
        {
            "details": "",
            "ep_num": "100",
            "ep_search_presence": "PASSED",
            "ep_title": "Bert Kreischer",
            "error": "",
            "paid": "TVNC0000000003360357",
            "playback": "PASSED",
            "season_num": "9",
            "series_search_presence": "PASSED",
            "series_title": "Conan",
            "slot": 16,
            "url": "https://charter-testworkbench-com.s3.us-west-2.amazonaws.com/TMC_Screenshots/sg_TMC South Man_16_2019_11_07_15_08_20.jpeg"
        },
        {
            "details": "",
            "ep_num": "15",
            "ep_search_presence": "PASSED",
            "ep_title": "And the Great Escape",
            "error": "",
            "paid": "TVNC0000000003360374",
            "playback": "PASSED",
            "season_num": "5",
            "series_search_presence": "PASSED",
            "series_title": "2 Broke Girls",
            "slot": 6,
            "url": "https://charter-testworkbench-com.s3.us-west-2.amazonaws.com/TMC_Screenshots/sg_TMC South Man_6_2019_11_07_15_12_47.jpeg"
        },
        {
            "details": "",
            "ep_num": "4",
            "ep_search_presence": "PASSED",
            "ep_title": "How Did It Get in There?",
            "error": "",
            "paid": "TVNC0000000003360413",
            "playback": "PASSED",
            "season_num": "1",
            "series_search_presence": "PASSED",
            "series_title": "The Misery Index",
            "slot": 1,
            "url": "https://charter-testworkbench-com.s3.us-west-2.amazonaws.com/TMC_Screenshots/sg_TMC South Man_1_2019_11_07_15_14_36.jpeg"
        },
        {
            "details": "",
            "ep_num": "",
            "ep_search_presence": "PASSED",
            "ep_title": "Never Before Scene 1413",
            "error": "",
            "paid": "NBCU0405793300600013",
            "playback": "PASSED",
            "season_num": "14",
            "series_search_presence": "PASSED",
            "series_title": "The Real Housewives of Orange County",
            "slot": 7,
            "url": "https://charter-testworkbench-com.s3.us-west-2.amazonaws.com/TMC_Screenshots/sg_TMC South Man_7_2019_11_07_15_15_35.jpeg"
        },
        {
            "details": "",
            "ep_num": "24",
            "ep_search_presence": "PASSED",
            "ep_title": "Ewan McGregor: Rebecca Ferguson",
            "error": "",
            "paid": "NBCU0406053200810013",
            "playback": "PASSED",
            "season_num": "1",
            "series_search_presence": "PASSED",
            "series_title": "A Little Late With Lilly Singh",
            "slot": 5,
            "url": "https://charter-testworkbench-com.s3.us-west-2.amazonaws.com/TMC_Screenshots/sg_TMC South Man_5_2019_11_07_15_16_37.jpeg"
        },
        {
            "details": "",
            "ep_num": "15",
            "ep_search_presence": "PASSED",
            "ep_title": "The Donation Oscillation",
            "error": "",
            "paid": "TVNC0000000003360875",
            "playback": "PASSED",
            "season_num": "12",
            "series_search_presence": "PASSED",
            "series_title": "The Big Bang Theory",
            "slot": 15,
            "url": "https://charter-testworkbench-com.s3.us-west-2.amazonaws.com/TMC_Screenshots/sg_TMC South Man_15_2019_11_07_15_18_13.jpeg"
        },
        {
            "details": "",
            "ep_num": "14",
            "ep_search_presence": "PASSED",
            "ep_title": "The Knockouts, Part 4",
            "error": "",
            "paid": "NBCU0405954800810013",
            "playback": "PASSED",
            "season_num": "17",
            "series_search_presence": "PASSED",
            "series_title": "The Voice",
            "slot": 6,
            "url": "https://charter-testworkbench-com.s3.us-west-2.amazonaws.com/TMC_Screenshots/sg_TMC South Man_6_2019_11_07_15_22_24.jpeg"
        },
        {
            "details": "",
            "ep_num": "14",
            "ep_search_presence": "PASSED",
            "ep_title": "The Meteorite Manifestation",
            "error": "",
            "paid": "TVNC0000000003360865",
            "playback": "PASSED",
            "season_num": "12",
            "series_search_presence": "PASSED",
            "series_title": "The Big Bang Theory",
            "slot": 16,
            "url": "https://charter-testworkbench-com.s3.us-west-2.amazonaws.com/TMC_Screenshots/sg_TMC South Man_16_2019_11_07_15_22_59.jpeg"
        },
        {
            "details": "",
            "ep_num": "40",
            "ep_search_presence": "PASSED",
            "ep_title": "Come Collect Uncle Daryl",
            "error": "",
            "paid": "XPPK0001569927270001",
            "playback": "PASSED",
            "season_num": "1",
            "series_search_presence": "PASSED",
            "series_title": "Desus & Mero",
            "slot": 7,
            "url": "https://charter-testworkbench-com.s3.us-west-2.amazonaws.com/TMC_Screenshots/sg_TMC South Man_7_2019_11_07_15_26_08.jpeg"
        },
        {
            "details": "",
            "ep_num": "40",
            "ep_search_presence": "PASSED",
            "ep_title": "Come Collect Uncle Daryl",
            "error": "",
            "paid": "XPPK0001569926349001",
            "playback": "PASSED",
            "season_num": "1",
            "series_search_presence": "PASSED",
            "series_title": "Desus & Mero",
            "slot": 5,
            "url": "https://charter-testworkbench-com.s3.us-west-2.amazonaws.com/TMC_Screenshots/sg_TMC South Man_5_2019_11_07_15_27_29.jpeg"
        },
        {
            "details": "",
            "ep_num": "",
            "ep_search_presence": "PASSED",
            "ep_title": "Chelsea FC vs. AFC Ajax",
            "error": "",
            "paid": "TVNC0000000003360498",
            "playback": "PASSED",
            "season_num": "",
            "series_search_presence": "PASSED",
            "series_title": "UEFA Champions League Soccer",
            "slot": 1,
            "url": "https://charter-testworkbench-com.s3.us-west-2.amazonaws.com/TMC_Screenshots/sg_TMC South Man_1_2019_11_07_15_33_58.jpeg"
        },
        {
            "details": "",
            "ep_num": "29",
            "ep_search_presence": "PASSED",
            "ep_title": "Shotgun Man",
            "error": "",
            "paid": "AMCX9610100000017135",
            "playback": "PASSED",
            "season_num": "2",
            "series_search_presence": "PASSED",
            "series_title": "The Rifleman",
            "slot": 6,
            "url": "https://charter-testworkbench-com.s3.us-west-2.amazonaws.com/TMC_Screenshots/sg_TMC South Man_6_2019_11_07_15_36_01.jpeg"
        },
        {
            "details": "",
            "ep_num": "22",
            "ep_search_presence": "PASSED",
            "ep_title": "Heller",
            "error": "",
            "paid": "AMCX9610100000017128",
            "playback": "PASSED",
            "season_num": "2",
            "series_search_presence": "PASSED",
            "series_title": "The Rifleman",
            "slot": 15,
            "url": "https://charter-testworkbench-com.s3.us-west-2.amazonaws.com/TMC_Screenshots/sg_TMC South Man_15_2019_11_07_15_36_24.jpeg"
        },
        {
            "details": "",
            "ep_num": "31",
            "ep_search_presence": "PASSED",
            "ep_title": "The Prodigal",
            "error": "",
            "paid": "AMCX9610100000017137",
            "playback": "PASSED",
            "season_num": "2",
            "series_search_presence": "PASSED",
            "series_title": "The Rifleman",
            "slot": 7,
            "url": "https://charter-testworkbench-com.s3.us-west-2.amazonaws.com/TMC_Screenshots/sg_TMC South Man_7_2019_11_07_15_37_57.jpeg"
        },
        {
            "details": "",
            "ep_num": "30",
            "ep_search_presence": "PASSED",
            "ep_title": "Sins of the Father",
            "error": "",
            "paid": "AMCX9610100000017136",
            "playback": "PASSED",
            "season_num": "2",
            "series_search_presence": "PASSED",
            "series_title": "The Rifleman",
            "slot": 16,
            "url": "https://charter-testworkbench-com.s3.us-west-2.amazonaws.com/TMC_Screenshots/sg_TMC South Man_16_2019_11_07_15_47_42.jpeg"
        },
        {
            "details": "",
            "ep_num": "25",
            "ep_search_presence": "PASSED",
            "ep_title": "The Deserter",
            "error": "",
            "paid": "AMCX9610100000017131",
            "playback": "PASSED",
            "season_num": "2",
            "series_search_presence": "PASSED",
            "series_title": "The Rifleman",
            "slot": 1,
            "url": "https://charter-testworkbench-com.s3.us-west-2.amazonaws.com/TMC_Screenshots/sg_TMC South Man_1_2019_11_07_15_49_53.jpeg"
        },
        {
            "details": "",
            "ep_num": "2",
            "ep_search_presence": "PASSED",
            "ep_title": "The Bare Witch Project",
            "error": "",
            "paid": "TVNC0000000003360528",
            "playback": "PASSED",
            "season_num": "7",
            "series_search_presence": "PASSED",
            "series_title": "Charmed",
            "slot": 7,
            "url": "https://charter-testworkbench-com.s3.us-west-2.amazonaws.com/TMC_Screenshots/sg_TMC South Man_7_2019_11_07_15_50_16.jpeg"
        },
        {
            "details": "",
            "ep_num": "",
            "ep_search_presence": "PASSED",
            "ep_title": "FC Barcelona vs. SK Slavia Praha",
            "error": "",
            "paid": "TVNC0000000003360462",
            "playback": "PASSED",
            "season_num": "",
            "series_search_presence": "PASSED",
            "series_title": "UEFA Champions League Soccer",
            "slot": 6,
            "url": "https://charter-testworkbench-com.s3.us-west-2.amazonaws.com/TMC_Screenshots/sg_TMC South Man_6_2019_11_07_15_55_39.jpeg"
        },
        {
            "details": "",
            "ep_num": "32",
            "ep_search_presence": "PASSED",
            "ep_title": "",
            "error": "",
            "paid": "NBCU0406049000810013",
            "playback": "PASSED",
            "season_num": "55",
            "series_search_presence": "PASSED",
            "series_title": "Days of our Lives",
            "slot": 5,
            "url": "https://charter-testworkbench-com.s3.us-west-2.amazonaws.com/TMC_Screenshots/sg_TMC South Man_5_2019_11_07_15_55_41.jpeg"
        },
        {
            "details": "",
            "ep_num": "22",
            "ep_search_presence": "PASSED",
            "ep_title": "The Handicap Spot",
            "error": "",
            "paid": "TVNC0000000003360330",
            "playback": "PASSED",
            "season_num": "4",
            "series_search_presence": "PASSED",
            "series_title": "Seinfeld",
            "slot": 16,
            "url": "https://charter-testworkbench-com.s3.us-west-2.amazonaws.com/TMC_Screenshots/sg_TMC South Man_16_2019_11_07_15_57_54.jpeg"
        },
        {
            "details": "",
            "ep_num": "3",
            "ep_search_presence": "PASSED",
            "ep_title": "Cheaper by the Coven",
            "error": "",
            "paid": "TVNC0000000003360515",
            "playback": "PASSED",
            "season_num": "7",
            "series_search_presence": "PASSED",
            "series_title": "Charmed",
            "slot": 15,
            "url": "https://charter-testworkbench-com.s3.us-west-2.amazonaws.com/TMC_Screenshots/sg_TMC South Man_15_2019_11_07_15_59_51.jpeg"
        },
        {
            "details": "",
            "ep_num": "",
            "ep_search_presence": "N/A",
            "ep_title": "",
            "error": "",
            "paid": "TVNC0000000003353162",
            "playback": "PASSED",
            "season_num": "",
            "series_search_presence": "PASSED",
            "series_title": "The Core",
            "slot": 1,
            "url": "https://charter-testworkbench-com.s3.us-west-2.amazonaws.com/TMC_Screenshots/sg_TMC South Man_1_2019_11_07_16_00_45.jpeg"
        },
        {
            "details": "",
            "ep_num": "20",
            "ep_search_presence": "PASSED",
            "ep_title": "The Junior Mint",
            "error": "",
            "paid": "TVNC0000000003360419",
            "playback": "PASSED",
            "season_num": "4",
            "series_search_presence": "PASSED",
            "series_title": "Seinfeld",
            "slot": 7,
            "url": "https://charter-testworkbench-com.s3.us-west-2.amazonaws.com/TMC_Screenshots/sg_TMC South Man_7_2019_11_07_16_01_16.jpeg"
        },
        {
            "details": "",
            "ep_num": "5",
            "ep_search_presence": "PASSED",
            "ep_title": "Catawampus",
            "error": "",
            "paid": "NBCU0405940500820087",
            "playback": "PASSED",
            "season_num": "2",
            "series_search_presence": "PASSED",
            "series_title": "Vets Saving Pets",
            "slot": 5,
            "url": "https://charter-testworkbench-com.s3.us-west-2.amazonaws.com/TMC_Screenshots/sg_TMC South Man_5_2019_11_07_16_09_43.jpeg"
        },
        {
            "details": "",
            "ep_num": "13",
            "ep_search_presence": "PASSED",
            "ep_title": "And the Lost Baggage",
            "error": "",
            "paid": "TVNC0000000003352360",
            "playback": "PASSED",
            "season_num": "5",
            "series_search_presence": "PASSED",
            "series_title": "2 Broke Girls",
            "slot": 16,
            "url": "https://charter-testworkbench-com.s3.us-west-2.amazonaws.com/TMC_Screenshots/sg_TMC South Man_16_2019_11_07_16_11_48.jpeg"
        },
        {
            "details": "",
            "ep_num": "16",
            "ep_search_presence": "PASSED",
            "ep_title": "Security",
            "error": "",
            "paid": "TVNC0000000003360320",
            "playback": "PASSED",
            "season_num": "8",
            "series_search_presence": "PASSED",
            "series_title": "Everybody Loves Raymond",
            "slot": 15,
            "url": "https://charter-testworkbench-com.s3.us-west-2.amazonaws.com/TMC_Screenshots/sg_TMC South Man_15_2019_11_07_16_15_22.jpeg"
        },
        {
            "details": "",
            "ep_num": "17",
            "ep_search_presence": "PASSED",
            "ep_title": "The Ingrate",
            "error": "",
            "paid": "TVNC0000000003360314",
            "playback": "PASSED",
            "season_num": "8",
            "series_search_presence": "PASSED",
            "series_title": "Everybody Loves Raymond",
            "slot": 1,
            "url": "https://charter-testworkbench-com.s3.us-west-2.amazonaws.com/TMC_Screenshots/sg_TMC South Man_1_2019_11_07_16_15_45.jpeg"
        },
        {
            "details": "",
            "ep_num": "15",
            "ep_search_presence": "PASSED",
            "ep_title": "Party Dress",
            "error": "",
            "paid": "TVNC0000000003352287",
            "playback": "PASSED",
            "season_num": "8",
            "series_search_presence": "PASSED",
            "series_title": "Everybody Loves Raymond",
            "slot": 6,
            "url": "https://charter-testworkbench-com.s3.us-west-2.amazonaws.com/TMC_Screenshots/sg_TMC South Man_6_2019_11_07_16_20_32.jpeg"
        },
        {
            "details": "",
            "ep_num": "10",
            "ep_search_presence": "PASSED",
            "ep_title": "Amazon River Islands",
            "error": "",
            "paid": "NBCU0405871200820087",
            "playback": "PASSED",
            "season_num": "2",
            "series_search_presence": "PASSED",
            "series_title": "Earth Odyssey With Dylan Dreyer",
            "slot": 7,
            "url": "https://charter-testworkbench-com.s3.us-west-2.amazonaws.com/TMC_Screenshots/sg_TMC South Man_7_2019_11_07_16_20_43.jpeg"
        },
        {
            "details": "",
            "ep_num": "14",
            "ep_search_presence": "PASSED",
            "ep_title": "And You Bet Your Ass",
            "error": "",
            "paid": "TVNC0000000003352343",
            "playback": "PASSED",
            "season_num": "5",
            "series_search_presence": "PASSED",
            "series_title": "2 Broke Girls",
            "slot": 5,
            "url": "https://charter-testworkbench-com.s3.us-west-2.amazonaws.com/TMC_Screenshots/sg_TMC South Man_5_2019_11_07_16_21_17.jpeg"
        }
    ],
    "queue": [
        {
            "details": "",
            "ep_num": "4",
            "ep_search_presence": "PASSED",
            "ep_title": "I Am the Greatest",
            "error": "Watch/Resume option absent on episode; Option Provided = UPGRADE",
            "paid": "XPPK2019090207080216",
            "playback": "FAILED",
            "season_num": "1",
            "series_search_presence": "PASSED",
            "series_title": "Godfather of Harlem",
            "slot": 16,
            "url": "https://charter-testworkbench-com.s3.us-west-2.amazonaws.com/TMC_Screenshots/sg_TMC South Man_16_2019_11_07_16_24_32.jpeg"
        }
    ],
    "working_boxes": [
        14
    ]
}